business_x_category.id,business.id,business.ts,business.business_name,business.home_page,business.email_address,business.phone,business.street,business.city,business.state,business.zip_code,business.full_address,business.category,business.rating,business.number_of_reviews,business.bbb_rating_or_license,business.latitude,business.longitude,business.cover_image,business.slogan,business.general_info,business.regular_hours,business.extra_phones,business.services_products,business.payment,business.price_range,business.aka,business.other_links,business.other_information,business.review_1_name,business.review_1_date,business.review_1_rating,business.review_1_text,business.review_2_name,business.review_2_date,business.review_2_rating,business.review_2_text
737418,253461,"2020-09-27 02:55:23","Quiet Sweep Inc",http://quietsweep.com,steve@quietsweep.com,"(240) 314-7184","108 England Ter",Rockville,MD,20850,"108 England Ter,Rockville,MD 20850","General Contractors, Altering & Remodeling Contractors, Concrete Contractors, Deck Builders, Demolition Contractors, Flooring Contractors, Garages-Building & Repairing, Landscape Contractors, Parking Stations & Garages-Construction, Patio Builders",,,,39.08684,-77.14672,,,,,"Phone: (240) 314-0311 Phone: (301) 260-8444",,,,"Quiet Sweep, Ltd.",http://quietsweep.com,,,,,,,,,
737911,253635,"2020-09-27 02:55:23","Constable Construction, Inc.",http://www.constableconstruction.com,constablecon@msn.com,"(540) 218-1952",,Elkton,VA,22827,"Elkton,VA 22827","General Contractors, Altering & Remodeling Contractors, Bathroom Remodeling, Building Construction Consultants, Building Contractors, Building Contractors-Commercial & Industrial, Construction Consultants, Home Builders, Home Improvements, Kitchen Planning & Remodeling Service, Parking Stations & Garages-Construction",,,A+,,,https://i4.ypcdn.com/blob/c9fb5a7f4cf8d78f9a086b6502b1d4a267b76273_100x100_crop.jpg?63f80dd,"When Quality Counts Call Constable Construction","When you are ready to build your forever home, Constable Construction, Inc. will help you design and build a space that represents your unique personality and sense of style. We have been serving Rockingham County and the surrounding areas for over 20 years.Constable Construction, Inc. can help review and locate your building site before you purchase it, and weВ’ll work with you every step of the way to ensure the quality and integrity of your dream home project. When quality counts, call Constable Construction, Inc.","Mon - Sun: 7:00 am - 7:00 pm",,,,,,http://www.constableconstruction.com,,,,,,,,,
738045,253685,"2020-09-27 02:55:23","Aztec Asphalt",http://www.dexknows.com/rd?dku=,,"(505) 880-8511","2302 Claremont Ave NE",Albuquerque,NM,87112,"2302 Claremont Ave NE,Albuquerque,NM 87112","Paving Contractors, Altering & Remodeling Contractors, Concrete Contractors, General Contractors, Masonry Contractors-Commercial & Industrial, Parking Lot Maintenance & Marking, Road Building Contractors",,,,35.101025,-106.51834,,,,"Mon - Thu: 7:30 am - 5:30 pm",,,"master card, visa",,,http://www.dexknows.com/rd?dku=,,,,,,,,,
738136,253709,"2020-09-27 02:55:23","Hanley Fence & Deck",,jwhanley@gmail.com,"(720) 275-7813",,Denver,CO,80220,"Denver,CO 80220","Deck Builders, Altering & Remodeling Contractors, Fence-Sales, Service & Contractors, Kitchen Planning & Remodeling Service, Parking Stations & Garages-Construction",,,A+,,,,,,,,,,,,,,,,,,,,,
738906,254012,"2020-09-27 02:55:25","Florida Door Solutions",,,"(407) 884-5955","777 S Park Ave",Apopka,FL,32703,"777 S Park Ave,Apopka,FL 32703","Parking Lots & Garages, Altering & Remodeling Contractors, Building Materials, Door Operating Devices, Door Repair, Door Wholesalers & Manufacturers, Doors, Frames, & Accessories, Garage Doors & Openers, Home Centers, Home Improvements, Overhead Doors",,,,28.66849,-81.5089,https://i4.ypcdn.com/blob/f55cf07be5c502320392afb642fbc52b9cb0c1af_100x100_crop.jpg?63f80dd,,,"Mon - Fri: 7:00 am - 5:00 pm",,,"all major credit cards, amex",,,,,,,,,,,,
739583,254239,"2020-09-27 02:55:25","Corporate Contracting Group, LLC",,ccg-llc@hotmail.com,"(318) 990-1928","1204 Dutton Rd",Shreveport,LA,71115,"1204 Dutton Rd,Shreveport,LA 71115","Altering & Remodeling Contractors, Building Contractors-Commercial & Industrial, Concrete Contractors, Parking Lot Maintenance & Marking, Road Building Contractors",,,,32.41801,-93.68732,https://i3.ypcdn.com/blob/0921146cab0979b655fcd37f07ecaebb0dca8921_100x100_crop.jpg?63f80dd,"Are you in need of repairs? We have a solution....Corporate Contracting Group, LLC is a full service licensed and insured contractor. We offer cost effective solutions for all your construction needs.","We Take Pride in All Our Work! Whether you need a concrete driveway, patio, porch, sidewalk, or garage floor, building slab Corporate Contracting Group, LLC is your source for professional concrete solutions with a personal touch. Our family-owned business has been providing quality commercial concrete work and light residential services to our Shreveport-Bossier neighbors since 2005 and just became licensed this year, and there's a little bit of us in every job we pour. That's why we say: ""We take pride in all our work""! Our dedicated employees are highly trained professionals with years of experience. Put that together with our fleet of well-maintained vehicles and equipment and an unwavering commitment to qualityand we're ready to take on any concrete project and deliver results you'll be proud of. We know that it takes more than just materials, tools, and skill to deliver outstanding results. That is why we are committed to unsurpassed customer service. Our support staff will ensure that your concrete project will be completed on time and on budget to the highest possible standards. We will not be satisfied until you are. That is our promise to you. Go to our Facebook and ""Like"" our page! See current projects going on.","Mon - Sat: 7:00 am - 5:00 pm Sun Closed","Fax: (318) 300-4755",,"cash, check",,,,,,,,,,,,
739709,254280,"2020-09-27 02:55:25","Boyle M J General Contractor Inc",http://mjboyle.com,estimating@mjboyle.com,"(210) 227-1919","1919 N Saint Marys St","San Antonio",TX,78212,"1919 N Saint Marys St,San Antonio,TX 78212","General Contractors, Altering & Remodeling Contractors, Building Construction Consultants, Building Contractors, Building Specialties, Home Builders, Parking Stations & Garages-Construction, Real Estate Developers",,,A+,29.44274,-98.48638,,,,,"Primary Phone: (210) 229-1192 Phone: (210) 229-9802 Fax Number: (210) 229-9802",,,,"MJ Boyle General Contractors Inc. M J Boyle General Contr Inc",http://mjboyle.com,,,,,,,,,
739873,254324,"2020-09-27 02:55:25","Building Concrete Ponce",,alfredo1063@yahoo.com,"(720) 634-5391","26900 E Colfax Ave",Aurora,CO,80018,"26900 E Colfax Ave,Aurora,CO 80018","Garages-Building & Repairing, Altering & Remodeling Contractors, Building Contractors, Concrete Blocks & Shapes, Concrete Contractors, Concrete Equipment & Supplies, General Contractors, Masonry Contractors, Parking Lots & Garages, Paving Contractors",,,A+,39.73801,-104.67341,,,"We are your number one choice for all of your general contracting needs! We pride ourselves in providing the best client experience as well as top quality work. Large jobs don't intimidate us at all and we encourage you call us to inquire about any large job!","Mon - Fri: 7:00 am - 6:00 pm Sat - Sun Closed",,,,,,,,,,,,,,,
739918,254341,"2020-09-27 02:55:25","Hitt Contracting Inc",http://www.hitt-gc.com,,"(703) 846-9000","2900 Fairview Park Dr","Falls Church",VA,22042,"2900 Fairview Park Dr,Falls Church,VA 22042","General Contractors, Altering & Remodeling Contractors, Building Construction Consultants, Building Contractors, Building Contractors-Commercial & Industrial, Building Specialties, Home Builders, Parking Stations & Garages-Construction",,,,38.87314,-77.21618,,,"Operational for more than 60 years, Hitt Contracting is a family-owned and managed company that offers a range of construction services for several residential and commercial projects. It is one the largest general contracting companies in the United States. The company undertakes projects in over 30 U.S. states. Hitt Contracting works with a team of nearly 700 staff members. The company serves clients in the government, health care, biotechnology, legal, institutional and technology industries. It offers construction management and design and build services. Hitt Contracting provides budget development, value engineering, cost monitoring and site logistics services. The company maintains a fleet of on-site trucks.","Mon - Fri: 8:00 am - 5:00 pm","Phone: (703) 289-9201 Phone: (703) 846-9001 Primary Phone: (571) 707-8438 Fax: (703) 846-9110",,,,,"http://www.hitt-gc.com http://dandb.com https://hitt.com",,,,,,,,,
741359,254874,"2020-09-27 02:55:25","Projects Unlimited",http://www.projectsui.net,candiloro@comcast.net,"(253) 222-2853","806 15th St NW",Puyallup,WA,98371,"806 15th St NW,Puyallup,WA 98371","Parking Lots & Garages, Altering & Remodeling Contractors, Building Contractors, Building Contractors-Commercial & Industrial, Building Maintenance, Cabinet Makers, Cabinets, Disabled Accessibility Contractors, Garages-Building & Repairing, General Contractors, Home Builders, Home Improvements, Home Repair & Maintenance, Medical Equipment & Supplies, Wheelchair Lifts & Ramps",,,A+,47.19824,-122.31418,,"Our Commitment is to the highest quality remodeling.","We are a full-service general contractor who will facilitate your project from start to finish. Our specialties include two story additions, whole house remodels, exterior sidings, kitchen remodeling, bath renovations, bedroom suite work, outdoor living spaces, decks and pretty much any other home remodeling you can imagine. Many of our remodeling clients live in Tacoma, Puyallup, Lakewood, Sumner, Bonney Lake and throughout Pierce County, but we've been hired by discerning customers in Issaquah, Seattle, Thurston County and beyond. We deliver excellent customer satisfaction along with the highest quality craftsmanship. Projects Unlimited is passionately committed to the best possible results for our clients. When we are remodeling, renovating, expanding and updating your living spaces, it's more than just construction. We are your partners in achieving your dream home, a place where families can gather, a place of order and sanctuary, a place to enjoy life and create memories.","Mon - Fri: 8:00 am - 5:00 pm Sat - Sun Closed",,,check,,,http://www.projectsui.net,"Services: Patio & Deck Cleaning & Restoration, Earthquake Services, Skylight Installation, Wood Siding Installation, Window Repair, Basement Remodeling, Bathroom Remodeling, Carport Construction, Disability Remodeling, Handyman, Kitchen Remodeling, Sun Rooms, Water Damage Restoration, Window Replacement, Garage Door Repair, Door Hanging, Cabinet Installation, Install Water Heater",,,,,,,,
741400,254888,"2020-09-27 02:55:25","Avant Construction Inc",http://www.avantconstruction.com,,"(662) 473-2366","1185 County Road 97","Water Valley",MS,38965,"1185 County Road 97,Water Valley,MS 38965","General Contractors, Altering & Remodeling Contractors, Building Construction Consultants, Building Contractors, Parking Stations & Garages-Construction",,,,34.09818,-89.65845,,,,,,,,,"Avant Construction Co.",http://www.avantconstruction.com,,,,,,,,,
742265,255144,"2020-09-27 02:55:30","Sealcoat Express",,seal_coatexpress@yahoo.com,"(314) 488-3087","2508 Hillcrest Dr","High Ridge",MO,63049,"2508 Hillcrest Dr,High Ridge,MO 63049","Paving Contractors, Altering & Remodeling Contractors, Asphalt, Concrete Contractors, Parking Lot Maintenance & Marking, Waterproofing Contractors",,,,38.47131,-90.53436,,,,"Mon - Sun: 8:00 am - 5:00 pm",,,,,"Sealcoat Express LLC",,,,,,,,,,
742792,255330,"2020-09-27 02:55:30","Steven Cerilli Sealcoating",,,"(845) 229-7580","Hyde Park 12538","Hyde Park",NY,12538,"Hyde Park 12538,Hyde Park,NY 12538","Paving Contractors, Altering & Remodeling Contractors, Concrete Contractors, Driveway Contractors, Excavation Contractors, Parking Lot Maintenance & Marking, Pavement & Floor Marking Services",,,,41.76676,-73.90153,,,,,,,check,,"S Cerilli Paving & Sealcoating",,"Parking: Lot, Free",,,,,,,,
743281,255521,"2020-09-27 02:55:30","Capital City Builders",,mfleniken@gmail.com,"(512) 632-3561","Po Box 4108","Cedar Park",TX,78630,"Po Box 4108,Cedar Park,TX 78630","Home Builders, Altering & Remodeling Contractors, Bathroom Remodeling, Construction Consultants, Gazebos, General Contractors, Kitchen Planning & Remodeling Service, Parking Stations & Garages-Construction, Swimming Pool Dealers",,,A+,30.505,-97.82,,,,,,,,,"Capital City Builders, LLC",,,,,,,,,,
743401,255560,"2020-09-27 02:55:30","Layton Homes",,,"(270) 667-2553","915 Princeton St",Providence,KY,42450,"915 Princeton St,Providence,KY 42450","General Contractors, Altering & Remodeling Contractors, Parking Stations & Garages-Construction",,,,37.38905,-87.75324,,,,,,,,,,,,,,,,,,,
743973,255776,"2020-09-27 02:55:30","Buffalo Construction",,,"(502) 327-4686","6060 Dutchmans Ln",Louisville,KY,40205,"6060 Dutchmans Ln,Louisville,KY 40205","General Contractors, Altering & Remodeling Contractors, Building Construction Consultants, Building Contractors, Parking Stations & Garages-Construction",1,"1 Review",,38.22758,-85.64011,,,,"Mon - Fri: 8:00 am - 5:00 pm",,,,,,,,clodhopper,05/14/2008,one,"Although he dioes average work, he is slow, slow, slow. He is very rude because he absolutely will not return phone calls.",,,,
744063,255817,"2020-09-27 02:55:30","Danoski Clutts Building Group",http://danoskiclutts.com,,"(702) 434-9991","6110 Elton Ave","Las Vegas",NV,89107,"6110 Elton Ave,Las Vegas,NV 89107","General Contractors, Altering & Remodeling Contractors, Building Construction Consultants, Building Contractors, Building Contractors-Commercial & Industrial, Building Specialties, Flooring Contractors, Home Builders, Kitchen Planning & Remodeling Service, Parking Stations & Garages-Construction",,,,36.17222,-115.22546,,,,"Mon - Fri: 8:00 am - 5:00 pm",,,,,"Danoski Clutts Building Group LLC Danoski Clutts Building Group L Ic",http://danoskiclutts.com,,,,,,,,,
744430,255949,"2020-09-27 02:55:30","John King Construction",http://www.johnkingconstruction.com,info@johnkingconstruction.com,"(512) 836-5464","12012 N Interstate 35",Austin,TX,78753,"12012 N Interstate 35,Austin,TX 78753","General Contractors, Altering & Remodeling Contractors, Building Construction Consultants, Building Contractors, Building Contractors-Commercial & Industrial, Building Specialties, Carpenters, Home Builders, Parking Stations & Garages-Construction",,,,30.38709,-97.67357,,,,,,,,,"John King Construction Ltd","http://www.johnkingconstruction.com http://jkc78.com",,,,,,,,,
745028,256169,"2020-09-27 02:55:35","Tar Heel Paving Co Inc",,thpaving@aol.com,"(336) 885-5154","2217 Chestnut Street Ext","High Point",NC,27262,"2217 Chestnut Street Ext,High Point,NC 27262","Paving Contractors, Altering & Remodeling Contractors, Asphalt Paving & Sealcoating, Building Contractors, Concrete Contractors, General Contractors, Masonry Contractors-Commercial & Industrial, Masonry Equipment & Supplies, Parking Lot Maintenance & Marking, Pavement & Floor Marking Services, Road Building Contractors",,,,35.973408,-80.01067,,,,"Mon - Fri: 7:30 am - 4:00 pm Sat - Sun Closed","Phone: (336) 889-5667",,,,"Tar Heel & Handy Paving",,"Services: Concrete Sealing, Concrete Hardscaping",,,,,,,,
745611,256360,"2020-09-27 02:55:36","Western Construction, Inc.",http://www.westernconstructioninc.com,info@westernconstructioninc.com,"(952) 920-8888","4301 Highway 7 STE 115",Minneapolis,MN,55416,"4301 Highway 7 STE 115,Minneapolis,MN 55416","Garages-Building & Repairing, Altering & Remodeling Contractors, General Contractors, Parking Stations & Garages-Construction, Windows-Repair, Replacement & Installation",5,"9 Reviews",A+,44.94591,-93.33472,https://i4.ypcdn.com/blob/55a7444e3cca5535578ab43c5e940b4f1ca9e65c_100x100_crop.jpg?63f80dd,"Give people what they want and don't charge too much!!","Western Construction, Inc. is a Minneapolis St Paul Garage Builder. We're the #1 detached garage builder in the Twin Cities Since 1949.","Mon - Fri: 7:00 am - 8:00 pm Sat: 7:30 am - 4:00 pm",,,"check, financing available, insurance, master card, cash",,,"Western Construction, Inc.",,sara133456,04/11/2013,five,"Western was a really quality company. We enjoyed working with a family business. Brad and his son Zack were very knowledgable and helped us every step of the way.",sara133456,04/11/2013,five,
745714,256408,"2020-09-27 02:55:36","Home Siding LLC",,,"(920) 743-7539",,"Sturgeon Bay",WI,54235,"Sturgeon Bay,WI 54235","Siding Contractors, Altering & Remodeling Contractors, Bathroom Remodeling, Building Contractors, Cabinet Makers, Cabinets, Deck Builders, Door & Window Screens, General Contractors, Home Improvements, Home Repair & Maintenance, Kitchen Planning & Remodeling Service, Parking Lots & Garages, Patio Builders, Patio Covers & Enclosures, Roofing Contractors, Screens, Siding Materials, Storm Windows & Doors, Windows, Windows-Repair, Replacement & Installation",,,,,,,"Best Contractor I Ever Had",,"Mon - Fri: 7:00 am - 7:00 pm",,,,,,,,,,,,,,,
747504,256978,"2020-09-27 02:55:36","Moffett's Construction",,,"(601) 638-8101","70 Jones Rd",Vicksburg,MS,39180,"70 Jones Rd,Vicksburg,MS 39180","General Contractors, Altering & Remodeling Contractors, Building Construction Consultants, Building Contractors, Parking Stations & Garages-Construction",,,,32.17408,-90.93044,,,,,,,,,,,,,,,,,,,
747614,257015,"2020-09-27 02:55:42","Blue Northern Builders",http://www.bluenorthernbuilders.com,,"(916) 772-4192","7401 Galilee Rd Ste 450",Roseville,CA,95678,"7401 Galilee Rd Ste 450,Roseville,CA 95678","General Contractors, Altering & Remodeling Contractors, Asphalt Paving & Sealcoating, Building Construction Consultants, Building Contractors, Building Contractors-Commercial & Industrial, Building Specialties, Carpenters, Flooring Contractors, Home Builders, Insulation Contractors, Masonry Contractors, Masonry Contractors-Commercial & Industrial, Parking Stations & Garages-Construction, Real Estate Developers",,,,38.77678,-121.3075,,,,"Mon - Fri: 8:00 am - 4:00 pm Sat - Sun Closed","Fax Number: (916) 772-4193",,,,"Blue Northern Builders INC",http://www.bluenorthernbuilders.com,,,,,,,,,
748183,257245,"2020-09-27 02:55:42","Young's Hot Top Paving",http://youngspavingnh.com,,"(603) 224-4140","5 Dunnmoore Dr",Bow,NH,03304,"5 Dunnmoore Dr,Bow,NH 03304","Paving Contractors, Altering & Remodeling Contractors, Asphalt Paving & Sealcoating, Building Contractors, Concrete Contractors, Driveway Contractors, General Contractors, Masonry Contractors-Commercial & Industrial, Parking Lot Maintenance & Marking, Paving Materials, Plumbers, Road Building Contractors, Waterproofing Contractors",2,"1 Review",A+,43.14127,-71.53359,,,,"Mon - Fri: 8:00 am - 5:00 am Sat Closed",,,"discover, master card, visa",,"Young's PAVING",http://youngspavingnh.com,,"Robert R.",07/02/2018,two,"I hired Young's Paving after they arrived at my home saying that they had a truck full of asphalt left from a job nearby. The truck fell short of completing the job so I needed to pay Young's to come back to complete the job. The second time around did not go so very well. My driveway is still not finished. I could not believe that they would not finish. The gentleman who interacted with the customer insisted that they were not going to have enough asphalt to go all the way to the end of the driveway. And so, I now have an incomplete driveway which I will need to hire yet another company to come finish. I would be ashamed of myself if I were to do such a thing to a customer. I cannot recommend Young's Paving. Do not be the next customer who is unsatisfied.",,,,
748663,257410,"2020-09-27 02:55:42","Dale Boalton Paving & Excavating",http://daleboaltonpaving.com,itsseweasy@yahoo.com,"(610) 367-0867","148 Vale Dr",Boyertown,PA,19512,"148 Vale Dr,Boyertown,PA 19512","Excavation Contractors, Altering & Remodeling Contractors, Building Contractors, Building Contractors-Commercial & Industrial, Concrete Contractors, Demolition Contractors, Grading Contractors, Masonry Contractors-Commercial & Industrial, Parking Lot Maintenance & Marking, Paving Contractors",,,,40.32322,-75.68824,,,,,"Fax: (610) 367-0867",,,,,http://daleboaltonpaving.com,"Services: Patio & Deck Cleaning & Restoration",,,,,,,,
748971,257514,"2020-09-27 02:55:42","CK Construction",http://ckconstructioncorp.com,jan@ckconstructioncorp.com,"(801) 731-0717","1981 Painter Ln",Ogden,UT,84401,"1981 Painter Ln,Ogden,UT 84401","General Contractors, Altering & Remodeling Contractors, Building Construction Consultants, Building Contractors, Building Contractors-Commercial & Industrial, Building Specialties, Home Builders, Metal Buildings, Parking Stations & Garages-Construction, Plumbers, Real Estate Developers, Steel Erectors",,,,41.23092,-112.02136,,,,,"Phone: (801) 732-8959 Phone: (801) 731-4698",,"amex, visa, discover, all major credit cards, mastercard",,"C K Construction & Service Corp CK Construction Corporation C K Construction & Svc Corp C K Construction And Services",http://ckconstructioncorp.com,,,,,,,,,
749261,257621,"2020-09-27 02:55:42","R J Noble Co",http://www.rjnoblecompany.com,kasondracarver@rjnoblecompany.com,"(714) 637-1550","15505 E Lincoln Ave",Orange,CA,92865,"15505 E Lincoln Ave,Orange,CA 92865","Paving Contractors, Altering & Remodeling Contractors, Asphalt Paving & Sealcoating, Building Contractors, Concrete Contractors, Driveway Contractors, General Contractors, Parking Lot Maintenance & Marking, Recycling Centers",,,,33.83535,-117.86115,https://i3.ypcdn.com/blob/a46affb16f3912d16fd219a0f29f39ecf72ba94d_100x100_crop.jpg?63f80dd,,"R.J. Noble is a general engineering company that specializes in manufacturing and crushing asphalt at its facility in Orange, Calif. It also owns a landfill, which is also located at its Orange plant. Its staff has over two centuries of combined expertise in the asphalt paving and engineering industry. The company boasts that there is no job that is too small or too big that does not deserve the same quality that it puts into each and every job to serve its customers. R. J. Noble also has an asphalt plant in the city of Corona.","Mon - Fri: 8:00 am - 5:00 pm","Phone: (714) 283-1636 Fax: (714) 637-6321 TollFree: (800) 339-0362",,,,"Noble R J Paving Co R J Noble Co Inc",http://www.rjnoblecompany.com,,,,,,,,,
749651,257753,"2020-09-27 02:55:42","Dcma Construction",,,"(915) 630-8887","11470 Joe Watson Ct","El Paso",TX,79936,"11470 Joe Watson Ct,El Paso,TX 79936","General Contractors, Altering & Remodeling Contractors, Building Contractors-Commercial & Industrial, Construction Consultants, Construction Management, Doors, Frames, & Accessories, Electricians, Home Builders, Home Improvements, Painting Contractors, Parking Stations & Garages-Construction, Roofing Contractors-Commercial & Industrial",,,A+,31.78099,-106.29454,,,,"Mon - Fri: 9:00 am - 5:00 pm Sat - Sun Closed","Phone: (915) 849-5897 Fax: (915) 849-5897",,,,,,,,,,,,,,