part_image_file.id,part_image_file.ts,part_image_file.source_content_type,part_image_file.hash_file_content,part_image_file.size,part_image_file.path,part_image_file.title,part_image_file.access,part_image.id,part_image.ts,part.id,part.ts,part.manufacturer,part.part_number,part.alternate_oem_numbers,part.tagline,part.list_price,part.description,part.info_essential,part.info_supplemental,part.category_1,part.category_2,part.partkey
1125,"2018-04-28 14:33:20",image/jpeg,82d2f7e27236fac7928d4bd1cc1c393b1d846612,28867,/82/d2/f7/e2/82d2f7e27236fac7928d4bd1cc1c393b1d846612.jpg,,https://songer.datasn.com/data/api/v1/u_2926417bef71d25521f5/auto_parts_north_america_1/by_table/part_image_file_access/82/d2/f7/e2/82d2f7e27236fac7928d4bd1cc1c393b1d846612.jpg,1193,"2017-11-14 00:01:08",888,"2021-11-08 14:46:27",NATIONAL,99187,07047884,,$21.79,"Fits Rear Outer; with Spicer 60 Axle; with 9.75 IN Ring Gear or Rear Outer; with Spicer 60-HD Axle; with 9.75 IN Ring Gear or Front Outer; with Spicer 60-F Axle; with 9.75 IN Ring Gear or Rear Outer; with Chrysler Axle; with 9.25 IN Ring Gear","{""groupindex"":""9"",""carcode"":""3439038"",""parttype"":""13976"",""partkey"":""257671"",""opts"":{""0-0-0-1"":{""warehouse"":""55303"",""whpartnum"":""FRD 99187"",""optionlist"":""0"",""paramcode"":""0"",""notekey"":""0"",""multiple"":""1""}}}","{""partnumber"":""99187"",""catalogname"":""NATIONAL"",""belongstolisting"":""7"",""markets"":[""MX""],""sortgroup"":0,""sortgrouptext"":""""}",Drivetrain,"Differential Pinion Repair Sleeve",257671
1126,"2018-04-28 14:33:25",image/jpeg,25e8c13ed99269671f04975702a0f927f542f83a,26263,/25/e8/c1/3e/25e8c13ed99269671f04975702a0f927f542f83a.jpg,,https://songer.datasn.com/data/api/v1/u_2926417bef71d25521f5/auto_parts_north_america_1/by_table/part_image_file_access/25/e8/c1/3e/25e8c13ed99269671f04975702a0f927f542f83a.jpg,1194,"2017-11-14 00:01:17",889,"2020-12-22 01:57:24",MAHLE,JV707,"B4A6348A, B4A6701A, B4AZ6336B, B4Q6701A, B4Q6701B, B5Q6701A, B6Q6336A, B8E6701A, B8KY6336A, BSZ1915, C1AE6336A, C1AE6336B, C1AZ6A321C, C1ME6336A, C2026701, EAD6701A, EAD6701B, EBU6348B, ECU6336A, EDF6701A, PB8E6348A, PB8M6336A, T44, T46, T55, Z1975",,$9.20,"Rope Packing Seal; Rear Main Bearing Cap Seals Included","{""groupindex"":""9"",""carcode"":""3438254"",""parttype"":""5604"",""partkey"":""2185444"",""opts"":{""0-0-0-1"":{""warehouse"":""83401"",""whpartnum"":""VIC JV707"",""optionlist"":""0"",""paramcode"":""0"",""notekey"":""0"",""multiple"":""1""}}}","{""partnumber"":""JV707"",""catalogname"":""MAHLE"",""belongstolisting"":""7"",""markets"":[""US""],""sortgroup"":0,""sortgrouptext"":""""}",Engine,"Crankshaft Seal",2185444
1127,"2018-04-28 14:33:31",image/jpeg,c06607c01b2d96cfeee4e306edf0ae30502d1cc5,19843,/c0/66/07/c0/c06607c01b2d96cfeee4e306edf0ae30502d1cc5.jpg,,https://songer.datasn.com/data/api/v1/u_2926417bef71d25521f5/auto_parts_north_america_1/by_table/part_image_file_access/c0/66/07/c0/c06607c01b2d96cfeee4e306edf0ae30502d1cc5.jpg,1195,"2017-11-14 00:01:18",890,"2017-11-14 00:01:18","MAHLE ORIGINAL/VICTOR REINZ",JV707P,"B8AZ6701A, C7AE6701A, T3957",Rubber,$5.98,"2 Piece; Rear Main Bearing Cap Seals Included","{""groupindex"":""9"",""carcode"":""1436031"",""parttype"":""5604"",""partkey"":""2663178"",""opts"":{""0-0-1-1"":{""warehouse"":""77478"",""whpartnum"":""VIC JV707P"",""optionlist"":""0"",""paramcode"":""0"",""notekey"":""1"",""multiple"":""1""},""0-0-0-1"":{""warehouse"":""11570"",""whpartnum"":""VG JV707P"",""optionlist"":""0"",""paramcode"":""0"",""notekey"":""0"",""multiple"":""1""}}}","{""partnumber"":""JV707P"",""catalogname"":""MAHLE ORIGINAL\/VICTOR REINZ"",""belongstolisting"":""7"",""markets"":[""US""],""sortgroup"":0,""sortgrouptext"":""""}",Engine,"Crankshaft Seal",2663178
1128,"2018-04-28 14:33:38",image/jpeg,e3f13c6b558e41926a4366a174cf3930f00ff343,26284,/e3/f1/3c/6b/e3f13c6b558e41926a4366a174cf3930f00ff343.jpg,,https://songer.datasn.com/data/api/v1/u_2926417bef71d25521f5/auto_parts_north_america_1/by_table/part_image_file_access/e3/f1/3c/6b/e3f13c6b558e41926a4366a174cf3930f00ff343.jpg,1196,"2017-11-14 00:01:18",891,"2021-09-25 23:16:28",NATIONAL,2942,"15527596, C3AE6700A, C3AE6700A1, C3AZ6700A, E5TE6700A2A, E5TZ6700C",,$8.25,Front,"{""groupindex"":""13"",""carcode"":""1132300"",""parttype"":""5604"",""partkey"":""253940"",""opts"":{""0-0-0-1"":{""warehouse"":""92829"",""whpartnum"":""FRD 2942"",""optionlist"":""0"",""paramcode"":""0"",""notekey"":""0"",""multiple"":""1""}}}","{""partnumber"":""2942"",""catalogname"":""NATIONAL"",""belongstolisting"":""7"",""markets"":[""US"",""CA"",""MX""],""sortgroup"":0,""sortgrouptext"":""""}",Engine,"Crankshaft Seal",253940
1129,"2018-04-28 14:33:42",image/jpeg,348647a8702a675de5574076f6d80ffd65a8ac81,14528,/34/86/47/a8/348647a8702a675de5574076f6d80ffd65a8ac81.jpg,,https://songer.datasn.com/data/api/v1/u_2926417bef71d25521f5/auto_parts_north_america_1/by_table/part_image_file_access/34/86/47/a8/348647a8702a675de5574076f6d80ffd65a8ac81.jpg,1197,"2017-11-14 00:01:18",892,"2021-05-24 22:49:50",NATIONAL,5095,"12304289, 9772831, C0DE6701A, C2OE6701A, C2OZ6701A, C90Z6701A, C9OZ6701A",,$13.31,"Rear; Rope Seal","{""groupindex"":""14"",""carcode"":""1223558"",""parttype"":""5604"",""partkey"":""256186"",""opts"":{""0-0-0-1"":{""warehouse"":""37158"",""whpartnum"":""FRD 5095"",""optionlist"":""0"",""paramcode"":""0"",""notekey"":""0"",""multiple"":""1""}}}","{""partnumber"":""5095"",""catalogname"":""NATIONAL"",""belongstolisting"":""7"",""markets"":[""US"",""CA""],""sortgroup"":0,""sortgrouptext"":""""}",Engine,"Crankshaft Seal",256186
1130,"2018-04-28 14:33:49",image/jpeg,2a57bab8c2511e9addddbcb3565fb12bf0eb5eb9,20844,/2a/57/ba/b8/2a57bab8c2511e9addddbcb3565fb12bf0eb5eb9.jpg,,https://songer.datasn.com/data/api/v1/u_2926417bef71d25521f5/auto_parts_north_america_1/by_table/part_image_file_access/2a/57/ba/b8/2a57bab8c2511e9addddbcb3565fb12bf0eb5eb9.jpg,1198,"2017-11-14 00:01:18",893,"2020-12-22 01:30:21",FEL-PRO,BS30138,RCS505,,$13.65,"Rear; Rear Main Seal Set; Rubber; Two-piece","{""groupindex"":""13"",""carcode"":""1491764"",""parttype"":""5604"",""partkey"":""122678"",""opts"":{""0-0-0-1"":{""warehouse"":""55121"",""whpartnum"":""FEL BS30138"",""optionlist"":""0"",""paramcode"":""0"",""notekey"":""0"",""multiple"":""1""}}}","{""partnumber"":""BS30138"",""catalogname"":""FEL-PRO"",""belongstolisting"":""7"",""markets"":[""US""],""sortgroup"":0,""sortgrouptext"":""""}",Engine,"Crankshaft Seal",122678
1131,"2018-04-28 14:33:51",image/jpeg,9b4458b6c841864e388ab9fbf7b7584926c60c93,17152,/9b/44/58/b6/9b4458b6c841864e388ab9fbf7b7584926c60c93.jpg,,https://songer.datasn.com/data/api/v1/u_2926417bef71d25521f5/auto_parts_north_america_1/by_table/part_image_file_access/9b/44/58/b6/9b4458b6c841864e388ab9fbf7b7584926c60c93.jpg,1199,"2017-11-14 00:01:23",894,"2021-07-25 09:34:32",MAHLE,3389,"5750641, B8A6051A, B8A6051B, B9AE6051A, C2AE6051B, C2AZ6051A, C3AE6051B, C6AE6051C, C6AZ6051A, C8AZ6051A, Z1301, Z1302, Z3085, Z3108",Composite,$15.79,"0.040 IN Thickness","{""groupindex"":""9"",""carcode"":""1139789"",""parttype"":""5412"",""partkey"":""2663210"",""opts"":{""0-0-0-1"":{""warehouse"":""85281"",""whpartnum"":""VG 3389"",""optionlist"":""0"",""paramcode"":""0"",""notekey"":""0"",""multiple"":""1""}}}","{""partnumber"":""3389"",""catalogname"":""MAHLE"",""belongstolisting"":""7"",""markets"":[""US"",""CA""],""sortgroup"":0,""sortgrouptext"":""""}",Engine,"Cylinder Head Gasket",2663210
1132,"2018-04-28 14:34:02",image/jpeg,399ae2776ec6c38ed411825defb54e5a2f20d15b,23618,/39/9a/e2/77/399ae2776ec6c38ed411825defb54e5a2f20d15b.jpg,,https://songer.datasn.com/data/api/v1/u_2926417bef71d25521f5/auto_parts_north_america_1/by_table/part_image_file_access/39/9a/e2/77/399ae2776ec6c38ed411825defb54e5a2f20d15b.jpg,1200,"2017-11-14 00:01:23",895,"2021-07-25 09:34:32",FEL-PRO,8554PT,"B8A6051A, B8A6051B, B9AE6051A, C2AE6051B, C2AZ6051A, C3AE6051BS, C3AZ6051B, C4AE6051BS, C6AE6051C, C6AE6051C2, C6AZ6051A, C6AZ6051C, C8AE6051B, C8AZ6051A, EDC6051D, EDG6051E",,$8.17,PermaTorque,"{""groupindex"":""8"",""carcode"":""1139789"",""parttype"":""5412"",""partkey"":""122182"",""opts"":{""0-0-1-1"":{""warehouse"":""77478"",""whpartnum"":""FEL 8554PT"",""optionlist"":""0"",""paramcode"":""0"",""notekey"":""1"",""multiple"":""1""},""0-0-0-1"":{""warehouse"":""92829"",""whpartnum"":""FEL 8554PT"",""optionlist"":""0"",""paramcode"":""0"",""notekey"":""0"",""multiple"":""1""}}}","{""partnumber"":""8554PT"",""catalogname"":""FEL-PRO"",""belongstolisting"":""7"",""markets"":[""US"",""CA""],""sortgroup"":0,""sortgrouptext"":""""}",Engine,"Cylinder Head Gasket",122182
1133,"2018-04-28 14:34:07",image/jpeg,f9b3b69d4cf0f259c7d5f9cfdf12af20486463f8,62575,/f9/b3/b6/9d/f9b3b69d4cf0f259c7d5f9cfdf12af20486463f8.jpg,,https://songer.datasn.com/data/api/v1/u_2926417bef71d25521f5/auto_parts_north_america_1/by_table/part_image_file_access/f9/b3/b6/9d/f9b3b69d4cf0f259c7d5f9cfdf12af20486463f8.jpg,1201,"2017-11-14 00:01:23",896,"2021-07-25 09:34:41",MAHLE,HS3389VJ,"C5AZ6079D, C6AZ6079F, C6AZ6079G, C8AZ6079C, C9AZ6079A, HSZ3110, HSZ3423","Does Not Include Cylinder Head Bolts or Exhaust Pipe Gasket",$61.99,"Exhaust Pipe Gasket Not Included","{""groupindex"":""10"",""carcode"":""1139789"",""parttype"":""5416"",""partkey"":""3653541"",""opts"":{""0-0-0-1"":{""warehouse"":""98059"",""whpartnum"":""VIC HS3389VJ"",""optionlist"":""0"",""paramcode"":""0"",""notekey"":""0"",""multiple"":""1""}}}","{""partnumber"":""HS3389VJ"",""catalogname"":""MAHLE"",""belongstolisting"":""7"",""markets"":[""US"",""CA""],""sortgroup"":0,""sortgrouptext"":""""}",Engine,"Cylinder Head Gasket Set",3653541
1134,"2018-04-28 14:34:14",image/jpeg,67fa25d86ec5c30b9f7cf40da1ef28611b7901a1,44340,/67/fa/25/d8/67fa25d86ec5c30b9f7cf40da1ef28611b7901a1.jpg,,https://songer.datasn.com/data/api/v1/u_2926417bef71d25521f5/auto_parts_north_america_1/by_table/part_image_file_access/67/fa/25/d8/67fa25d86ec5c30b9f7cf40da1ef28611b7901a1.jpg,1202,"2017-11-14 00:01:23",897,"2021-07-25 09:34:41",FEL-PRO,HS8554PT,"B8AZ6079A, B8AZ6079B, B8AZ6079C, B8AZ6079D, C1AZ6079A, C2AZ6079A, C2AZ6079B, C2AZ6079C, C2AZ6079D, C3AZ6079B, C3AZ6079C, C3AZ6079D, C3AZ6079F, C3AZ6079G, C6AZ6079A, C6AZ6079C, C6AZ6079E, C6AZ6079F, C6AZ6079G, C8AZ6079B, C8AZ6079C, C8AZ6079D, C9AZ6079A, C9AZ6079D, C9OZ6079C","Does Not Include Exhaust Pipe Flange Gasket",$61.79,"Exhaust Pipe Flange Gaskets not Included; Exhaust Manifold Heat Shields Not Included","{""groupindex"":""9"",""carcode"":""1139789"",""parttype"":""5416"",""partkey"":""124337"",""opts"":{""0-0-0-1"":{""warehouse"":""44148"",""whpartnum"":""FEL HS8554PT"",""optionlist"":""0"",""paramcode"":""0"",""notekey"":""0"",""multiple"":""1""}}}","{""partnumber"":""HS8554PT"",""catalogname"":""FEL-PRO"",""belongstolisting"":""7"",""markets"":[""US"",""CA""],""sortgroup"":0,""sortgrouptext"":""""}",Engine,"Cylinder Head Gasket Set",124337
1135,"2018-04-28 14:34:15",image/jpeg,d19d56e1296f58f523bc119aff65fd0233771c42,24019,/d1/9d/56/e1/d19d56e1296f58f523bc119aff65fd0233771c42.jpg,,https://songer.datasn.com/data/api/v1/u_2926417bef71d25521f5/auto_parts_north_america_1/by_table/part_image_file_access/d1/9d/56/e1/d19d56e1296f58f523bc119aff65fd0233771c42.jpg,1203,"2017-11-14 00:01:27",898,"2021-06-11 11:30:36",FEL-PRO,8554SP,,,$9.05,HeadSaver,"{""groupindex"":""8"",""carcode"":""1131994"",""parttype"":""5420"",""partkey"":""122183"",""opts"":{""0-0-8-1"":{""warehouse"":""77478"",""whpartnum"":""FEL 8554SP:8"",""optionlist"":""0"",""paramcode"":""0"",""notekey"":""8"",""multiple"":""1""},""0-0-0-1"":{""warehouse"":""92407"",""whpartnum"":""FP 8554SP"",""optionlist"":""0"",""paramcode"":""0"",""notekey"":""0"",""multiple"":""1""}}}","{""partnumber"":""8554SP"",""catalogname"":""FEL-PRO"",""belongstolisting"":""7"",""markets"":[""US"",""CA""],""sortgroup"":0,""sortgrouptext"":""""}",Engine,"Cylinder Head Spacer Shim",122183
1136,"2018-04-28 14:34:18",image/jpeg,ad27ec1d642708bf65c28bec636dde99aab77f0e,29618,/ad/27/ec/1d/ad27ec1d642708bf65c28bec636dde99aab77f0e.jpg,,https://songer.datasn.com/data/api/v1/u_2926417bef71d25521f5/auto_parts_north_america_1/by_table/part_image_file_access/ad/27/ec/1d/ad27ec1d642708bf65c28bec636dde99aab77f0e.jpg,1204,"2017-11-14 00:01:38",899,"2020-12-11 03:54:51",FEL-PRO,KS2307,RB505,,$50.79,"Exh. manifold heat shields not included. use MS 95000","{""groupindex"":""8"",""carcode"":""1436037"",""parttype"":""10392"",""partkey"":""124885"",""opts"":{""0-0-0-1"":{""warehouse"":""55121"",""whpartnum"":""FEL KS2307"",""optionlist"":""0"",""paramcode"":""0"",""notekey"":""0"",""multiple"":""1""}}}","{""partnumber"":""KS2307"",""catalogname"":""FEL-PRO"",""belongstolisting"":""7"",""markets"":[""US""],""sortgroup"":0,""sortgrouptext"":""""}",Engine,"Engine Kit Gasket Set",124885
1137,"2018-04-28 14:34:29",image/jpeg,7ad4cb0e94b6cb515d4359749a831e7fc068ae34,32318,/7a/d4/cb/0e/7ad4cb0e94b6cb515d4359749a831e7fc068ae34.jpg,,https://songer.datasn.com/data/api/v1/u_2926417bef71d25521f5/auto_parts_north_america_1/by_table/part_image_file_access/7a/d4/cb/0e/7ad4cb0e94b6cb515d4359749a831e7fc068ae34.jpg,1205,"2017-11-14 00:01:38",900,"2020-12-22 01:30:37",FEL-PRO,FS8554PT,"B8AZ6008A, B8AZ6008B, B8AZ6008C, B8AZ6008D, C1AZ6008B, C2AZ6008A, C2AZ6008B, C2AZ6008C, C2AZ6008D, C2AZ6008E, C3AZ6008C, C3AZ6008E, C6AZ6008C, C6AZ6008E, C6AZ6008F, C8AZ6008D, C8AZ6008E, C9AZ6008A, C9AZ6008C, C9OZ6008C",,$71.79,"Exh. pipe flange not included.","{""groupindex"":""11"",""carcode"":""1491764"",""parttype"":""10392"",""partkey"":""123917"",""opts"":{""0-0-0-1"":{""warehouse"":""92829"",""whpartnum"":""FEL FS8554PT"",""optionlist"":""0"",""paramcode"":""0"",""notekey"":""0"",""multiple"":""1""}}}","{""partnumber"":""FS8554PT"",""catalogname"":""FEL-PRO"",""belongstolisting"":""7"",""markets"":[""US""],""sortgroup"":0,""sortgrouptext"":""""}",Engine,"Engine Kit Gasket Set",123917
1138,"2018-04-28 14:34:37",image/jpeg,e281f3b682ceb1d27acbe5109359fb1b56e722ab,29170,/e2/81/f3/b6/e281f3b682ceb1d27acbe5109359fb1b56e722ab.jpg,,https://songer.datasn.com/data/api/v1/u_2926417bef71d25521f5/auto_parts_north_america_1/by_table/part_image_file_access/e2/81/f3/b6/e281f3b682ceb1d27acbe5109359fb1b56e722ab.jpg,1206,"2017-11-14 00:02:58",901,"2021-09-25 23:20:06",MAHLE,A2262,,"Nickel Plated Formed Steel",,"0.013 IN Thickness","{""groupindex"":""11"",""carcode"":""1132300"",""parttype"":""5408"",""partkey"":""2646862"",""opts"":{""0-0-0-1"":{""warehouse"":0,""whpartnum"":""A2262"",""optionlist"":0,""paramcode"":0,""notekey"":0,""multiple"":1}}}","{""partnumber"":""A2262"",""catalogname"":""MAHLE"",""belongstolisting"":""7"",""markets"":[""US"",""CA"",""MX""],""sortgroup"":0,""sortgrouptext"":""""}",Engine,"Harmonic Balancer Repair Sleeve",2646862
1139,"2018-04-28 14:34:47",image/jpeg,0dae12aff67e4777731915da3f6db1178dee34ca,32283,/0d/ae/12/af/0dae12aff67e4777731915da3f6db1178dee34ca.jpg,,https://songer.datasn.com/data/api/v1/u_2926417bef71d25521f5/auto_parts_north_america_1/by_table/part_image_file_access/0d/ae/12/af/0dae12aff67e4777731915da3f6db1178dee34ca.jpg,1207,"2017-11-14 00:02:58",902,"2021-09-25 23:20:06",NATIONAL,88187,,,$7.97,,"{""groupindex"":""9"",""carcode"":""1132300"",""parttype"":""5408"",""partkey"":""257553"",""opts"":{""0-0-0-1"":{""warehouse"":""93722"",""whpartnum"":""NS 88187"",""optionlist"":""0"",""paramcode"":""0"",""notekey"":""0"",""multiple"":""1""}}}","{""partnumber"":""88187"",""catalogname"":""NATIONAL"",""belongstolisting"":""7"",""markets"":[""US"",""CA"",""MX""],""sortgroup"":0,""sortgrouptext"":""""}",Engine,"Harmonic Balancer Repair Sleeve",257553
1140,"2018-04-28 14:34:55",image/jpeg,5f49b610ea229b25b5f9455e834d2f7054e5ad11,29924,/5f/49/b6/10/5f49b610ea229b25b5f9455e834d2f7054e5ad11.jpg,,https://songer.datasn.com/data/api/v1/u_2926417bef71d25521f5/auto_parts_north_america_1/by_table/part_image_file_access/5f/49/b6/10/5f49b610ea229b25b5f9455e834d2f7054e5ad11.jpg,1208,"2017-11-14 00:03:07",903,"2021-07-16 16:02:09",MAHLE,MS15166X,"B8AZ9433A, C2AZ9433A, C3AZ9433A, C3AZ9433F, C3AZ9433G, C6AZ9433D, MSZ3955, Z1803, Z1804","Set; Composite",,"1.46 IN x 2.40 IN Port Size","{""groupindex"":""8"",""carcode"":""1495134"",""parttype"":""5424"",""partkey"":""2589296"",""opts"":{""0-0-0-1"":{""warehouse"":0,""whpartnum"":""MS15166X"",""optionlist"":0,""paramcode"":0,""notekey"":0,""multiple"":1}}}","{""partnumber"":""MS15166X"",""catalogname"":""MAHLE"",""belongstolisting"":""7"",""markets"":[""US""],""sortgroup"":0,""sortgrouptext"":""""}",Engine,"Intake Manifold Gasket",2589296
1141,"2018-04-28 14:35:01",image/jpeg,83e9e3274b98f545317677609e1493b4bdb03c7d,28996,/83/e9/e3/27/83e9e3274b98f545317677609e1493b4bdb03c7d.jpg,,https://songer.datasn.com/data/api/v1/u_2926417bef71d25521f5/auto_parts_north_america_1/by_table/part_image_file_access/83/e9/e3/27/83e9e3274b98f545317677609e1493b4bdb03c7d.jpg,1209,"2017-11-14 00:03:07",904,"2020-12-22 01:30:42",FEL-PRO,MS90145,"B8AZ9433A, C2AZ9433A, C3AZ9433A, C3AZ9433E, C3AZ9433F, C3AZ9433G, C3AZ9433J, C6AZ9433A, C6AZ9433B, C6AZ9433C, C6AZ9433D, C6AZ9433E, C8MY9433A",Set,$5.79,,"{""groupindex"":""10"",""carcode"":""1491764"",""parttype"":""5424"",""partkey"":""125137"",""opts"":{""0-0-1-1"":{""warehouse"":""77478"",""whpartnum"":""FEL MS90145"",""optionlist"":""0"",""paramcode"":""0"",""notekey"":""1"",""multiple"":""1""},""0-0-0-1"":{""warehouse"":""55121"",""whpartnum"":""FEL MS90145"",""optionlist"":""0"",""paramcode"":""0"",""notekey"":""0"",""multiple"":""1""}}}","{""partnumber"":""MS90145"",""catalogname"":""FEL-PRO"",""belongstolisting"":""7"",""markets"":[""US""],""sortgroup"":0,""sortgrouptext"":""""}",Engine,"Intake Manifold Gasket",125137
1142,"2018-04-28 14:35:12",image/jpeg,5ec90f57e02ee837c8cdd1db131a9b9022bfd736,24177,/5e/c9/0f/57/5ec90f57e02ee837c8cdd1db131a9b9022bfd736.jpg,,https://songer.datasn.com/data/api/v1/u_2926417bef71d25521f5/auto_parts_north_america_1/by_table/part_image_file_access/5e/c9/0f/57/5ec90f57e02ee837c8cdd1db131a9b9022bfd736.jpg,1210,"2017-11-14 00:03:12",905,"2021-11-07 10:51:50",FEL-PRO,70822,"10017614, 10017615, 14079550, 14090908, 1625762, 1638257, 24571185, 25524544, 3769935, 3921988, 3921989, 4271941, 4763739, 559563, 6032145, 7424872, 791008, 8132294, 8134690, 8140909080, 9043012011, 9043012019, 9043012020, 9043012021, 9043012024, 9043012027, 9043012028, 9043012031, 94840599, 94855472, 94855838, C20Z6734A, C2OZ6734A, E3TZ6734A",,$0.45,"0.500 in Inside Diameter x 0.900 in Outside Diameter; Flat Washer; Plastic","{""groupindex"":""9"",""carcode"":""1362013"",""parttype"":""5428"",""partkey"":""121617"",""opts"":{""0-0-0-1"":{""warehouse"":""60436"",""whpartnum"":""FEL 70822"",""optionlist"":""0"",""paramcode"":""0"",""notekey"":""0"",""multiple"":""1""}}}","{""partnumber"":""70822"",""catalogname"":""FEL-PRO"",""belongstolisting"":""7"",""markets"":[""US"",""CA"",""MX""],""sortgroup"":0,""sortgrouptext"":""""}",Engine,"Oil Drain Plug Gasket",121617
1143,"2018-04-28 14:35:21",image/jpeg,b82d3c930a883e4cfc681ebebda987795ea285db,41894,/b8/2d/3c/93/b82d3c930a883e4cfc681ebebda987795ea285db.jpg,,https://songer.datasn.com/data/api/v1/u_2926417bef71d25521f5/auto_parts_north_america_1/by_table/part_image_file_access/b8/2d/3c/93/b82d3c930a883e4cfc681ebebda987795ea285db.jpg,1211,"2017-11-14 00:03:24",906,"2017-11-14 00:03:24",BOSCH,72102WS,72102,"Workshop Oil Filter; O.D. 3.77""; Inside Diam/Thread 3/4""-16; Height 5.00""; Gasket Attached",$3.59,,"{""groupindex"":""8"",""carcode"":""1436031"",""parttype"":""5340"",""partkey"":""5407476"",""opts"":{""0-0-0-1"":{""warehouse"":""80204"",""whpartnum"":""BSH 72102WS"",""optionlist"":""0"",""paramcode"":""0"",""notekey"":""0"",""multiple"":""1""}}}","{""partnumber"":""72102WS"",""catalogname"":""BOSCH"",""belongstolisting"":""7"",""markets"":[""US""],""sortgroup"":0,""sortgrouptext"":""Economy""}",Engine,"Oil Filter",5407476
1144,"2018-04-28 14:35:43",image/jpeg,3da301f61db64dce58a14015787184ed2dfcdbcf,63320,/3d/a3/01/f6/3da301f61db64dce58a14015787184ed2dfcdbcf.jpg,,https://songer.datasn.com/data/api/v1/u_2926417bef71d25521f5/auto_parts_north_america_1/by_table/part_image_file_access/3d/a3/01/f6/3da301f61db64dce58a14015787184ed2dfcdbcf.jpg,1214,"2017-11-14 00:03:34",909,"2020-12-22 01:30:53",MAHLE,B25451,"C0AZ6A636B, C8AE6A636A",Paper,$0.98,"Adapter to Block","{""groupindex"":""8"",""carcode"":""1491764"",""parttype"":""5432"",""partkey"":""3654012"",""opts"":{""0-0-0-1"":{""warehouse"":""44081"",""whpartnum"":""MAH B25451"",""optionlist"":""0"",""paramcode"":""0"",""notekey"":""0"",""multiple"":""1""}}}","{""partnumber"":""B25451"",""catalogname"":""MAHLE"",""belongstolisting"":""7"",""markets"":[""US""],""sortgroup"":0,""sortgrouptext"":""""}",Engine,"Oil Filter Gasket",3654012
1145,"2018-04-28 14:35:45",image/jpeg,9e1c45f781cddc0c12451e285be131137b4c92be,56939,/9e/1c/45/f7/9e1c45f781cddc0c12451e285be131137b4c92be.jpg,,https://songer.datasn.com/data/api/v1/u_2926417bef71d25521f5/auto_parts_north_america_1/by_table/part_image_file_access/9e/1c/45/f7/9e1c45f781cddc0c12451e285be131137b4c92be.jpg,1215,"2017-11-14 00:03:34",910,"2020-12-22 01:30:53",FEL-PRO,70135,"730026, B8A6838A, C0AZ6A636B, C0AZ6A63B, C4TZ6A636A, C5TZ6A636A",,$1.00,Adapter,"{""groupindex"":""9"",""carcode"":""1491764"",""parttype"":""5432"",""partkey"":""121540"",""opts"":{""0-0-0-1"":{""warehouse"":""90746"",""whpartnum"":""FEL 70135"",""optionlist"":""0"",""paramcode"":""0"",""notekey"":""0"",""multiple"":""1""}}}","{""partnumber"":""70135"",""catalogname"":""FEL-PRO"",""belongstolisting"":""7"",""markets"":[""US""],""sortgroup"":0,""sortgrouptext"":""""}",Engine,"Oil Filter Gasket",121540
1146,"2018-04-28 14:35:52",image/jpeg,a2435cb792adb16e32fa32655fe7744356944b7e,13938,/a2/43/5c/b7/a2435cb792adb16e32fa32655fe7744356944b7e.jpg,,https://songer.datasn.com/data/api/v1/u_2926417bef71d25521f5/auto_parts_north_america_1/by_table/part_image_file_access/a2/43/5c/b7/a2435cb792adb16e32fa32655fe7744356944b7e.jpg,1216,"2017-11-14 00:03:43",911,"2020-12-22 01:30:59",MAHLE,OS30764,"B8A6710A, C0AE6710C, C0AZ6710A, C4TZ6710A, C9ZE6710A, C9ZZ6710A, D0AZ6710A, EDC6710A, LPZ1992, Z1992, Z3283",Cork-Rubber,$9.92,,"{""groupindex"":""11"",""carcode"":""1491764"",""parttype"":""5436"",""partkey"":""2589718"",""opts"":{""0-0-0-1"":{""warehouse"":""72901"",""whpartnum"":""VIC OS30764"",""optionlist"":""0"",""paramcode"":""0"",""notekey"":""0"",""multiple"":""1""}}}","{""partnumber"":""OS30764"",""catalogname"":""MAHLE"",""belongstolisting"":""7"",""markets"":[""US""],""sortgroup"":0,""sortgrouptext"":""""}",Engine,"Oil Pan Gasket",2589718
1147,"2018-04-28 14:35:58",image/jpeg,9f8af4a89f45b3e8bd4ed6393a0cd11f232e585a,19890,/9f/8a/f4/a8/9f8af4a89f45b3e8bd4ed6393a0cd11f232e585a.jpg,,https://songer.datasn.com/data/api/v1/u_2926417bef71d25521f5/auto_parts_north_america_1/by_table/part_image_file_access/9f/8a/f4/a8/9f8af4a89f45b3e8bd4ed6393a0cd11f232e585a.jpg,1217,"2017-11-14 00:03:43",912,"2020-12-22 01:30:59",FEL-PRO,OS11701D,,,$4.68,Felcoid,"{""groupindex"":""8"",""carcode"":""1491764"",""parttype"":""5436"",""partkey"":""125812"",""opts"":{""0-0-1-1"":{""warehouse"":""77478"",""whpartnum"":""FEL OS11701D"",""optionlist"":""0"",""paramcode"":""0"",""notekey"":""1"",""multiple"":""1""},""0-0-0-1"":{""warehouse"":""85042"",""whpartnum"":""FEL OS11701D"",""optionlist"":""0"",""paramcode"":""0"",""notekey"":""0"",""multiple"":""1""}}}","{""partnumber"":""OS11701D"",""catalogname"":""FEL-PRO"",""belongstolisting"":""7"",""markets"":[""US""],""sortgroup"":0,""sortgrouptext"":""""}",Engine,"Oil Pan Gasket",125812