business_x_category.id,business.id,business.ts,business.business_name,business.home_page,business.email_address,business.phone,business.street,business.city,business.state,business.zip_code,business.full_address,business.category,business.rating,business.number_of_reviews,business.bbb_rating_or_license,business.latitude,business.longitude,business.cover_image,business.slogan,business.general_info,business.regular_hours,business.extra_phones,business.services_products,business.payment,business.price_range,business.aka,business.other_links,business.other_information,business.review_1_name,business.review_1_date,business.review_1_rating,business.review_1_text,business.review_2_name,business.review_2_date,business.review_2_rating,business.review_2_text
11905,4617,"2020-09-27 02:30:50","Jasmine Johnson EDU ""Modeling and Talent""",,jasminejohnsonedu@gmail.com,"(404) 645-8522",,Norcross,GA,30010,"Norcross,GA 30010","Modeling Schools, Acting Schools & Workshops, Child Care, Educational Services, Schools",,,,,,,,,"Mon - Fri: 2:30 pm - 6:00 pm Sat: 11:30 am - 5:00 pm",,,"cash only",,,,,,,,,,,,
76239,32995,"2020-09-27 02:32:56","Expressions Dance",,expressionsdance101@gmail.com,"(951) 269-9556",,Riverside,CA,92504,"Riverside,CA 92504","Dancing Instruction, Child Care, Dance Companies, Educational Services, Private Schools (K-12)",,,,,,,"inspiring excellence through dance.","We offer quality ballet training at an affordable rate so that any child can participate. we also offer family rates and classes for beginning students of all ages. Pre-pointe classes and private lessons are available for students who would like to take it to the next level. we strive to create a personal connection with each of our students to help them in their development as a dancer and an individual. Our focus is on ballet technique, we have a recital every spring and dance camp every summer to introduce new styles to our students. In addition to current classes Expressions Dance also offers our program to schools, churches and homeschool groups. To sign-up your child or for more information please e-mail expressionsdance101@gmail.com or call 951-269-9556","Mon - Fri: 9:00 am - 8:00 pm Sat - Sun Closed",,,"check, no credit cards",,,,,,,,,,,,
77933,33714,"2020-09-27 02:33:01","Burks Building Blocks Child Care",,,"(209) 518-5027","2130 William Moss Blvd",Stockton,CA,95206,"2130 William Moss Blvd,Stockton,CA 95206","Children's Instructional Play Programs, Child Care, Dance Companies, Sports Clubs & Organizations, Tutoring",,,,37.90815,-121.31608,,,,"Mon - Fri: 5:00 am - 5:30 pm",,,,,,,,,,,,,,,
78977,34135,"2020-09-27 02:33:05","Imagine Studio",http://imaginestudioct.com,,"(860) 490-6299","97 South St","West Hartford",CT,06110,"97 South St,West Hartford,CT 06110","Art Instruction & Schools, Child Care, Dance Companies, Recreation Centers, Youth Camps",,,,41.72687,-72.72559,,,"Imagine Studio, under the direction of Karla Kress-Boyle, is West HartfordВ’s only Creative and Performing Arts Studio. Focusing on building imagination and self confidence our wonderful staff will be sharing their talents in Dance, Art, Music, Yoga and Theater programming.","Mon - Fri: 9:00 am - 7:00 pm Sat: 9:00 am - 12:00 pm",,,"all major credit cards, cash, check, debit, visa",,,http://imaginestudioct.com,,,,,,,,,
82088,35421,"2020-09-27 02:33:13","Discovery Kids Draper",http://www.discoverykidsdraper.com,discoverykidsdraper@gmail.com,"(801) 244-7073","12492 S Fort St",Draper,UT,84020,"12492 S Fort St,Draper,UT 84020","Music Schools, Child Care, Dance Companies, Tutoring, Youth Camps",,,,40.52342,-111.86448,,,,"Mon - Fri: 8:30 am - 6:00 pm Sat - Sun Closed","MobilePhone: (801) 244-7073",,"all major credit cards, debit, check, cash",,,http://www.discoverykidsdraper.com,,,,,,,,,
83690,36097,"2020-09-27 02:33:15","Dazzle Dance & Cheer LLC",,,"(765) 273-2501","3611 N Briarwood Ln",Muncie,IN,47304,"3611 N Briarwood Ln,Muncie,IN 47304","Dancing Instruction, Cheerleading, Child Care, Dance Companies, Day Care Centers & Nurseries, Exercise & Physical Fitness Programs, Gymnastics Instruction, Schools, Sports Instruction",5,"1 Review",,40.22217,-85.42898,,"Serious Dancing... Serious Fun.","Discover the most innovative dance and tumbling studio in the Muncie region. Your child will learn in an encouraging, no-pressure environment, under the tutelage of nationally renowned instructors and choreographers. Dazzle is also known for bringing in amazing guest artists to teach classes and choreograph some of our company dances. Guest artist classes are open to everyone - dates and times will be posted on Facebook.","Mon - Fri: 1:00 am - 8:00 am",,,"discover, mastercard, visa",,,http://www.teamdazzle.com,"Classes Offered: Dance Classes","Erin V.",12/31/2013,five,"From a personal level, the school is friendly and an open environment. So many skills-building resources at your disposal. Overall, this is a top-notch school to pick.",,,,
86539,37285,"2020-09-27 02:33:18","Inna's Hall Of Fame Performing Arts Conservatory",http://www.innashalloffame.com,InnaDance@hotmail.com,"(954) 237-6021","8685 Stirling Rd","Cooper City",FL,33328,"8685 Stirling Rd,Cooper City,FL 33328","Dancing Instruction, Child Care, Children's Party Planning & Entertainment, Dance Companies, Music Schools, Yoga Instruction, Youth Camps","3,5","3 Reviews",,26.04524,-80.26083,,,,"Mon - Fri: 9:00 am - 10:00 pm Sat: 9:00 pm - 10:00 pm Sun: 9:00 am - 5:00 pm",,,,,,http://www.innashalloffame.com,,"YPMobile User",12/30/2013,one,"If I could give it negative ten stars I would. Do not go here! The place is run by crooks. They will tell you the price is one thing to get you to join and then sell you a bunch of other stuff and then raise the price on you. Teachers are rude... one of them said terrible things about my child right in front of her and other kids! One of the other teachers taught while she had a fever! Kids in child care constantly being yelled out and sit in a boring room playing UNO. Don't trust your kids with them! Stay away!",nataliep.,01/27/2012,five,"location and the prices per class are not bad at all. I get bored at gyms working on machines after a while - but I like dancing, and upbeat music so I thought I'd give Zumba a try. After three months of going to InnaВ’s Hall of Fame, I had opportunity to try not only Zumba, but also, Body sculpturing, Yoga and even Hip-hop. The studio is very nice and I highly recommend this place to everyone who wants to try something new!"
87166,37541,"2020-09-27 02:33:18","A Dancer's Love School of Dance",,adancerslove@yahoo.com,"(704) 390-4092","1801 North Tryon St. Suite 611",Charlotte,NC,28206,"1801 North Tryon St. Suite 611,Charlotte,NC 28206","Nursery Schools, Child Care, Dance Companies",5,"1 Review",,35.24218,-80.82525,https://i1.ypcdn.com/blob/a334ddc8832024a4aa5c44886a9898c96956fa40_100x100_crop.jpg?f832250,"A Dancer's Love School of Dance where every individual is born with a heart to love, and every dancer is given an opportunity to perform. We believe that ""A Dancer's Love"" can never be explained because it goes above and beyond reality.","A Dancer's Love School of Dance provides dance lessons to Charlotte,Gastonia,Huntersville and its surrounding areas. We provide dance lessons for ages 18 months and older. A Dancer's Love School of Dance has provided its services to many organizations and events. We have recently performed in weddings,churches, recitals, ministries, local public events, plays,conferences,gala dinners, photo shoots and family reunions, just to name a few.","Mon - Tue: 6:30 pm - 9:00 pm Wed Closed Thu - Fri: 6:30 pm - 9:00 pm Sat: 11:00 am - 2:30 pm Sun Closed","7043904092: (704) 390-4092",,"master card, paypal, check, debit, visa",,,,,"Tiffanie S.",01/15/2013,five,"If you have a love for dance,then I recommend this school,the owner is very loving and caring,their praise ministries are anointed and blessed. I'm so glad I found you guys!",,,,
87427,37653,"2020-09-27 02:33:18","Alpha Omega Summer Camp",http://www.alphaomegasummercamp.com,,"(858) 635-1211","1286 University Ave","San Diego",CA,92103,"1286 University Ave,San Diego,CA 92103","Music Instruction-Instrumental, Camps-Recreational, Child Care, Dance Companies, Sports & Entertainment Centers",,,,32.7491,-117.15193,,,"The Alpha Omega Dance Camp is a dynamic summer arts program. Cultivating self-confidence, teamwork, and creativity through the powerful medium of dance, music and art. We offer unique and innovative summer? ? programming. Our educator designed programs are fun, age appropriate, and structured to provide engaging activities for your child,Its so much more than your average day camp!Much care has been put into the design of the program, from the schedule to the class selections which collectively teach with the 9 modes of learning. This will ensure that your child will enjoy the camp no matter what their energy level and attention span. We also encourage kids to express themselves in our mini sessions? ? where kids can discuss issues that they care about, such as? ? personal goals, self esteem,? ? and making friends. Where they are able to talk in an open, nurturing and positive atmosphere.?В€?Teaching kids is one of the most rewarding experiences because kids are really open to learning and they're always want to know more information?В€? says director Prince Graham.Our Best Camp Ever sessions give your child the opportunity to custom design their day to their preference. They can choose between Magic, Hip Hop Dance or Sticky Icky Science or Yoga and much more. This are like 7 specialty camps in 1. You child will be constantly stimulated and encouraged to learn new skills. We believe that if we stimulate all aspects of the childs brain we can further increase its growth and capacity, that?В€В™s means smarter kids to us.? We as parents know how important it is to have children involved in activities that keep them active and healthy. The Alpha Omega Summer Camp is a great way for children and teens to learn, play, discover and get fit while building self-confidence, life skills and self-esteem.","Mon - Sun: 9:00 am - 4:00 pm",,,,,,http://www.alphaomegasummercamp.com,,,,,,,,,
94122,40533,"2020-09-27 02:33:35","Tayo Reed Performing Arts Center",http://www.tayoreedperformingartscenter.org,TayoReedCorporateOffice@gmail.com,"(770) 774-4299","6703 Shannon Pkwy Ste 7","Union City",GA,30291,"6703 Shannon Pkwy Ste 7,Union City,GA 30291","Child Care, Children's Instructional Play Programs, Choreographers, Dance Companies, Day Care Centers & Nurseries, Educational Services, Fine Art Artists, Music Schools, Nursery Schools, Preschools & Kindergarten, Scholarship Services, School Bus Service, School Information, Studio Rental, Tutoring","3,5","3 Reviews",A+,33.56912,-84.53937,,"'Winners are not those who never FALL or FAIL, but those who always get up and NEVER QUIT!""","Tayo Reed's Performing Arts Center in Atlanta, Georgia's is a full service parent childcare resource and Adult Fine Arts Program offering Dance, Music, Drama and Voice. In addition to tutoring, academics and arts camps for the youth. The vision has expanded to Georgia's 1st Preschool Academy of Tayoartology, the highest advancement for preschool scholars. Uniforms required, and Abeka Curriculum, After School Enrichment Pick Up, and Accelerated evening classes. We are a one stop affordable childcare program for parents. NOW ENROLLING! Register Online. Limited Space.","Mon - Fri: 6:30 am - 6:30 pm Sat: 10:00 am - 2:00 pm",,,"visa, master card",,,"http://www.tayoreedperformingartscenter.org http://www.tayoreedperformingartspreschool.org",,"Tomeka R.",04/08/2018,five,"I am very happy one of my friends referred me to this dance studio because my daughter love to dance. I was very impressed with the recital and costumes. I will be enrolling her in the Summer Camp.",yardie3000,01/28/2014,five,"I have been taking my child to Tayo ReedВ’s Dance Academy for over 5 years. It has been a very inspiring and rewarding experience. I have watched my child significantly mature in attitude and posture and the only thing I can attribute to her development is Tayo Reeds Dance Academy. As a result, my daughter really stands out amongst her peers. I never had a complaint and would recommend anyone to this academy. Ms Tayo teaches out of love and encourages everyone around her to do and be better. The impression I get from Tayo Reeds School is that with great attitude you can accomplish anything and they preach that philosophy Dailey. Ms Tayo loves her kids and treats them like they are her own. The staff is also great and they do there best to work with you. Sometimes recitals can be very involved but nothing beats seeing your child learning a life time trait of self respect, discipline, and maturity that really stands out. Overall in the beginning I wasnВ’t a fan of ballet but seeing that my child loves to dance I toke a chance to enroll her in Ms. TayoВ’s Academy and she has taught my child more than ballet. There is no greater reward than seeing my daughter behaving like a young lady with such good posture at the dinner table or when she walks into a room with good mannerism and takes pride in doing things."
95990,41304,"2020-09-27 02:33:43","White Oak Early Childcare Center",http://www.whiteoakchildcarecenter.com,whiteoakecc@comcast.net,"(804) 737-7575","6171 Memorial Dr",Sandston,VA,23150,"6171 Memorial Dr,Sandston,VA 23150","Day Care Centers & Nurseries, Child Care, Dance Companies, Gymnastics Instruction, Sports Motivational Training",,,,37.49509,-77.2615,,,,"Mon - Fri: 7:00 am - 6:00 pm","Fax: (804) 328-6171",,,,,"Childcare Center, Sandston, VA","Specialties: Memory Issues",,,,,,,,
96080,41350,"2020-09-27 02:33:43","Armenian Dance Academy Of Las Vegas",,armeniandancerslv@gmail.com,"(702) 467-8523","7835 S Rainbow Blvd","Las Vegas",NV,89139,"7835 S Rainbow Blvd,Las Vegas,NV 89139","Dancing Instruction, Child Care, Dance Companies, Dance Halls, Educational Services",,,,36.04577,-115.24394,https://i1.ypcdn.com/blob/ca2f70d68272c96d3ad04b946f03da01caa4801f_100x100_crop.jpg?f832250,,,"Mon - Fri: 5:30 pm - 6:30 pm","MobilePhone: (702) 467-8523",,,,"Armenian Dance Academy LV",,"Parking: Lot, Free Wheelchair Accessible: Yes",,,,,,,,
96478,41531,"2020-09-27 02:33:43","The Community House of Birmingham",http://www.communityhouse.com,info@communityhouse.com,"(248) 644-5832","380 S Bates St",Birmingham,MI,48009,"380 S Bates St,Birmingham,MI 48009","Community Organizations, Banquet Halls & Reception Facilities, Child Care, Dance Companies",,,,42.54482,-83.21759,,"A unique setting for learning, meeting, celebrating...","The mission of The Community House, an independent, nonprofit organization established in 1923 and located in Birmingham, Michigan, is to offer relevant programs and services to help people in the metropolitan area improve and enrich their lives. We do this by providing educational, social and cultural opportunities for people of all ages, interests and backgrounds. We build community by valuing diversity, connecting neighbors, and providing a gathering place for families, individuals and groups.","Mon - Fri: 8:30 am - 5:00 pm Sat - Sun: 9:00 am - 4:30 pm",,,"check, discover, amex, visa, mastercard",,,http://www.communityhouse.com,,,,,,,,,
97147,41791,"2020-09-27 02:33:43","USA ELITE DANCE COMPANY",,,"(832) 433-5443","10818 Hughes Rd",Houston,TX,77089,"10818 Hughes Rd,Houston,TX 77089","Cheerleading, Child Care, Dance Companies, Dancing Instruction, Dancing Supplies",,,,29.59145,-95.22259,,,,"Mon - Tue: 6:00 pm - 8:00 pm Thu: 6:00 pm - 8:00 pm Sat: 10:00 am - 2:00 pm",,,"cash, check, master card, visa",,,,,,,,,,,,
97973,42129,"2020-09-27 02:33:52","Ford Community & Performing Arts Center",http://dearbornfordcenter.com,dearbornrec@gmail.com,"(313) 943-2350","15801 Michigan Ave",Dearborn,MI,48126,"15801 Michigan Ave,Dearborn,MI 48126","Community Centers, Art Galleries, Dealers & Consultants, Art Instruction & Schools, Art Restoration & Conservation, Arts Organizations & Information, Athletic Organizations, Ballrooms, Bands & Orchestras, Banquet Halls & Reception Facilities, Baseball Clubs & Parks, Basketball Clubs, Bingo Halls, Cafeterias, Camps-Recreational, Card Playing Rooms, Caterers Menus, Charities, Cheerleading, Child Care, Children's Instructional Play Programs, Children's Party Planning & Entertainment, City, Village & Township Government, Climbing Instruction, Clubs, Community Organizations, Concert Halls, Conference & Seminar Coordinators, Conference Centers, Craft Instruction, Dance Halls, Dancing Instruction, Day Care Centers & Nurseries, Drinking Fountains, Driving Service, Educational Materials, Educational Research, Event Ticket Sales, Exercise & Physical Fitness Programs, Family & Business Entertainers, Fine Art Artists, Government Offices, Gymnasiums, Gymnastics Instruction, Halls, Auditoriums & Ballrooms, Headquarters, Health & Fitness Program Consultants, Health Clubs, Hearing & Sound Level Testing, Human Services Organizations, Knitting Instruction, Medical Practice Consultants, Medical Service Organizations, Meeting & Event Planning Services, Music Instruction-Instrumental, Music Instruction-Vocal, Parks, Party & Event Planners, Personal Fitness Trainers, Physical Fitness Consultants & Trainers, Physical Therapists, Picnic Grounds, Playgrounds, Private Swimming Pools, Public Swimming Pools, Racquetball Courts, Reducing & Weight Control, Retreat Facilities, School Supplies & Services, Senior Citizens Services & Organizations, Sitting Services, Sports & Entertainment Centers, Sports Information Service, Stadiums, Arenas & Athletic Fields, Stages, Stress Management & Prevention, Swimming Instruction, Tennis Instruction, Theatrical & Stage Lighting Equipment, Theatrical & Stage Lighting Equipment-Services, Theatrical Agencies, Theatrical Managers & Producers, Tourist Information & Attractions, Trade Shows, Expositions & Fairs, Transportation Providers, Vending Machines-Wholesale & Manufacturers, Water Parks & Slides, Yoga Instruction, Youth Camps, Youth Organizations & Centers","3,5","2 Reviews",,42.31521,-83.19822,https://i1.ypcdn.com/blob/fa556939cde06a6ca82dcdfeb150c1cea06fc2f0_100x100_crop.jpg?f832250,"Your New Place To Play","The Ford Community & Performing Arts Center is a multi-faceted, multi-facility network of leisure, fitness, life enrichment and cultural arts activities, offering something for everyone.","Mon - Fri: 5:30 am - 10:00 pm Sat: 8:00 am - 8:00 pm Sun: 9:00 am - 6:00 pm","Senior Services: (313) 943-2412 Theater Box Office: (313) 943-2354 Facility Rentals: (313) 943-2381",,,,"Recreation Center Civic Center Michael A. Guido Theater","Ford Community & Performing Arts Center Dearborn Recreation and Parks","Parking: Lot, Free Wheelchair Accessible: Yes Bike Parking: Yes","Nehal R.",07/19/2014,three,"2 have trade shows and Conventions",janash85,11/18/2007,four,"art is the joy of this life, i wanted to go out of the depress that i had, so i searched for this"
356106,117031,"2020-09-27 02:41:39","Amelia's Mamma's Yoga and Massage",,rachel.ameliaagency@gmail.com,"(303) 261-7403","3442 W 32nd Ave",Denver,CO,80211,"3442 W 32nd Ave,Denver,CO 80211","Child Care Consultants, Child Care, Massage Therapists, Nanny Service, Yoga Instruction",,,A+,39.76188,-105.03339,,,"Amelia's Mamma's offers guidance, support, and energy to families from thought to tot.","Mon - Fri: 7:00 am - 7:30 pm Sat: 9:00 am - 2:30 pm Sun Closed","MobilePhone: (303) 261-7403",,"paypal, cash, all major credit cards",,"The Amelia Agency",,,,,,,,,,
356756,117301,"2020-09-27 02:41:40","The Aspen Club & Spa",http://www.aspenclub.com,eyoung@aspenclub.com,"(970) 925-8900","1450 Crystal Lake Rd",Aspen,CO,81611,"1450 Crystal Lake Rd,Aspen,CO 81611","Health Clubs, Child Care, Day Spas, Gymnasiums, Health Resorts, Massage Services, Massage Therapists, Medical Spas, Nutritionists, Personal Fitness Trainers, Physical Fitness Consultants & Trainers, Physical Therapists, Yoga Instruction",5,"1 Review",,39.182083,-106.80686,https://i1.ypcdn.com/blob/a060ac97e134a89d34ee363e9a99d6618d6352b2_100x100_crop.jpg?f832250,"Serving The Aspen Area For Over 30 Years. Free shuttle service available within the Aspen Community.","Aspen Club & Spa is one of the leading fitness and recreational sports resorts in the United States. Built on more than 77,000-square-feet of space, the resort offers full-service spa, more than 34 treatment and locker rooms, whirlpools, steam and sauna, fitness and pilates studio, indoor and outdoor pools, tennis courts, kids gymnasium, sports medicine institute, and caf and club shop. It offers various traditional and modern treatments, therapeutic massages, facials, Swedish massages, herbal wraps, and body scrubs. The resort also has two relaxation lounges, the Warming Room and Alpine Garden Room. Based on the European spa experience, it provides a wide variety of climate-specific therapies, such as high-altitude and apres ski massage, krauter kur, and alpine rejuvenator body treatment with organic and indigenous pine essentials, personalized aromatherapy blending, and Ayurvedic treatments. Located in Aspen, Colo., its health and fitness center feature state-of-the-art equipment, gyrotonic studio, certified trainers, racquetball and squash courts, and an indoor court for basketball and volleyball.","Mon - Fri: 6:00 am - 9:00 pm Sat - Sun: 7:00 am - 8:00 pm","Phone: (970) 925-8940 Fax: (970) 925-9543 TollFree: (866) 484-8254",,"all major credit cards",,"Fabrocini, Bill - Aspen Club & Spa Aspen Club Sports Medicine",http://www.aspenclub.com,"Parking: Lot, Private Wheelchair Accessible: Yes By Appointment Only: No",flyfisher,01/29/2008,five,"It's very rare to find a facility that offers all of the amenities with a professional staff that this one does, and it has a shuttle service!",,,,
357027,117400,"2020-09-27 02:41:40","Organic Nurturing School",https://plus.google.com/u/0/b/117061351464747577887/events/coqho6ebur6pd20dkmkpt5kb5fg?hl=en,organicnurturingschool@gmail.com,"(530) 370-2840","197 Lucas Ln","Grass Valley",CA,95945,"197 Lucas Ln,Grass Valley,CA 95945","Day Care Centers & Nurseries, Child Care, Preschools & Kindergarten, Schools, Yoga Instruction",,,,39.21084,-121.05877,,,,"Mon - Fri: 6:00 am - 6:00 pm Sat - Sun Closed",,,"check, cash",,,Organicnurturingschool,,,,,,,,,
357585,117640,"2020-09-27 02:41:40","Jodi's Gym",http://www.jodisgym.com,jodgym@aol.com,"(212) 772-7633","244 E 84th St","New York",NY,10028,"244 E 84th St,New York,NY 10028","Health Clubs, Child Care, Gymnasiums, Sporting Goods, Yoga Instruction",,,,40.77661,-73.95308,,,,"Mon - Sun: 9:00 am - 6:00 pm","Phone: (212) 772-9558 Fax: (212) 772-9558",,"amex, visa, all major credit cards",,,http://www.jodisgym.com,"Parking: Street",,,,,,,,
357917,117780,"2020-09-27 02:41:40","Onelife Fitness-Brambleton",http://www.sportandhealth.com/clubshome/club.aspx?id=9873,,"(703) 774-9500","42365 Soave Dr Ste 100",Ashburn,VA,20148,"42365 Soave Dr Ste 100,Ashburn,VA 20148","Health Clubs, Child Care, Day Spas, Exercise & Physical Fitness Programs, Gymnasiums, Health Resorts, Personal Fitness Trainers, Physical Fitness Consultants & Trainers, Pilates Instruction & Equipment, Tennis Courts, Weights, Yoga Instruction",,,,38.98288,-77.5375,https://i1.ypcdn.com/blob/bbf9b763f5c180cf44d85de6897447f3f037aa85_100x100_crop.jpg?f832250,,,"Mon - Thu: 5:00 am - 11:00 pm Fri: 5:00 am - 10:00 pm Sat - Sun: 7:00 am - 8:00 pm",,,"all major credit cards, check, amex, master card, visa, discover",,,"http://www.sportandhealth.com/clubshome/club.aspx?id=9873 https://www.onelifefitness.com/brambleton",,,,,,,,,