business_x_category.id,business.id,business.ts,business.business_name,business.home_page,business.email_address,business.phone,business.street,business.city,business.state,business.zip_code,business.full_address,business.category,business.rating,business.number_of_reviews,business.bbb_rating_or_license,business.latitude,business.longitude,business.cover_image,business.slogan,business.general_info,business.regular_hours,business.extra_phones,business.services_products,business.payment,business.price_range,business.aka,business.other_links,business.other_information,business.review_1_name,business.review_1_date,business.review_1_rating,business.review_1_text,business.review_2_name,business.review_2_date,business.review_2_rating,business.review_2_text
5220013,1542677,"2020-09-27 04:59:49","Nicollet Island Inn",http://www.nicolletislandinn.com,frontdesk@nicolletislandinn.com,"(612) 331-1800","95 Merriam St",Minneapolis,MN,55401,"95 Merriam St,Minneapolis,MN 55401","American Restaurants, Bars, Breakfast, Brunch & Lunch Restaurants, Caterers, Cocktail Lounges, Continental Restaurants, Fine Dining Restaurants, French Restaurants, Restaurants, Seafood Restaurants, Steak Houses",4,"65 Reviews",,44.98597,-93.26084,https://i3.ypcdn.com/blob/675bc98ca0286bd6f41d8c5193ba7ba951a16eec_100x100_crop.jpg?f832250,,"If youВ’re looking for a romantic motel in Minneapolis, look no further than Nicollet Island Inn. Given the close proximity of popular landmarks, such as Grand Rounds Scenic Byway (0.6 mi) and Nicollet Mall (1.3 mi), guests of Nicollet Island Hotel can easily experience some of Minneapolis' most well known attractions. The rooms offer a flat screen TV, air conditioning, and a desk, and getting online is possible, as free wifi is available, allowing you to rest and refresh with ease. Nicollet Island Hotel features a 24 hour front desk, room service, and baggage storage. In addition, as a valued Nicollet Island Hotel guest, you can enjoy an on-site restaurant that is available on-site. Guests arriving by vehicle have access to free parking. If youВ’re looking for a barbeque restaurant, consider a visit to Butcher & The Boar, Market Bar-B-Que, or Dinkytown Baldy's BBQ, which are all conveniently located a short distance from Nicollet Island Hotel. Minneapolis is also known for some great waterfalls, including Minnehaha Park, St. Anthony Falls, and North Commons Park, which are not too far from Nicollet Island Inn. The staff at Nicollet Island Inn looks forward to serving you during your upcoming visit.","Mon - Sat: 7:00 am - 10:00 pm Sun: 9:30 am - 9:00 pm","Fax: (612) 331-6528 TollFree: (866) 636-2683",,"check, all major credit cards, amex, diners club, discover, master card, visa, cash",,"Nicollet Island Inn Restaurant",http://www.nicolletislandinn.com,"Parking: Lot, Private Wi-Fi: Free Bike Parking: Yes Attire: Dressy Good For Groups: Yes Good for Kids: No Take Out: No Cuisines: Fine Dining, Caterers, American, French, Breakfast, Brunch & Lunch, Steakhouse, European, Seafood, Continental Alcohol: Full Bar Takes Reservations: Yes Outdoor Seating: Yes Pets Allowed: No",MrsHamilton,11/09/2011,one,"We looked at this venue two years before and had it booked 2 years prior with a large deposit. I hosted my wedding here on the 22nd of October 2011. The EVENTS MANAGER made me CRY on my WEDDING DAY! She came in screaming at me, harrassed my guests and tried to charge us for things not in our contract to include a $650 extra charge for the day of my wedding because I was in the rooms decorating for my ceremony and reception! The extra charges were eventually dropped after a contract lawyer was involved however I never recieved an apology for her behavior. The venue is beautiful, all other staff were wonderful, food was good but my wedding was a disaster because of this one person and her horrible attitude. BEWARE! You definately can not judge a book (the Inn) by it's cover.","Verne Wagner",02/14/2011,one,"This was going to be a very romantic weekend. I had googled the top 10 most romantic restuarants and the Nicollet Island Inn was on the Top. We were seated overlooking the parking lot. The waiter never introduced himself and seem intent on hurry us along. When we did not immediately order a bottle of wine, he later told us they were giving a discount on wine this evening. The wine was bitter and $70 a bottle. He came out with a complimentary bread plate. Four thinly sliced pieces of french bread, Oh Wow! The Cheese Plate was good. My wife ordered the Five Beet Salad, she said was good. I ordered the Lobster Chowder. Was very bland. For our main dinner we ordered the Grouper it was recommended by the waiter. It was very bland and boring The waiter apologized a bit, but you could tell he was use to hearing these complaints. Never did the Manager come by and ask us about our dinner. You can tell that the staff is use to poor feedback. Romantic atmosphere perhaps better then some, but for a $230 dinner certainly not worth it. As I said, the Cheese plate was the highlight of the dinner"
5220843,1542815,"2020-09-27 04:59:49","The Old Warsaw",http://www.oldwarsaw.com,servicedirectory494@gmail.com,"(214) 528-0032","2610 Maple Ave",Dallas,TX,75201,"2610 Maple Ave,Dallas,TX 75201","American Restaurants, Caterers, Continental Restaurants, Fine Dining Restaurants, French Restaurants, Night Clubs, Party & Event Planners, Restaurants, Seafood Restaurants, Steak Houses","4,5","270 Reviews",A+,32.79578,-96.80425,https://i1.ypcdn.com/blob/64572783d1f72a1e003d30d8d2e0c9e6b439bf78_100x100_crop.jpg?f832250,,"The Old Warsaw is a elegant French steakhouse & fine dining restaurant with a full bar in Uptown Dallas serving premium steak, lobster, seafood, salads, chicken entrees and more with private dining and special event spaces available. Call us to make a reservation or if you have any questions. We look forward to having you!","Mon - Sun: 5:00 pm - 10:00 pm",,,"amex, carte blanche, company card, diners club, discover, jcb, mastercard, visa, all major credit cards",,,http://www.oldwarsaw.com,"Parking: Garage, Valet Wi-Fi: Free Bike Parking: No Attire: Dressy Wheelchair Accessible: Yes Takes Reservations: Yes Outdoor Seating: Yes Pets Allowed: No","Kathy R.",12/31/2017,one,"Have been going to The Old Warsaw for years, even when the food has not been great have always had a good time. Made a reservation for New Year's eve, for the first time ever they called and wanted a credit card to hold the reservation, I was hesitant because my dining partner was working out if town, was told we could probably work something out. Did have to cancel as partner could not drive back because of weather, when I called they insisted they would charge 60 per person for cancellation, and denied that I was told we could work it out. We have never cancelled before this. Very unhappy will never go back.","Jeff T.",04/18/2015,five,"Old Warsaw is my hangout every Friday night. The great food never disapoints."
5222637,1543123,"2020-09-27 04:59:56","Cafe Central",,,"(401) 254-6164","173 Bradford St",Bristol,RI,02809,"173 Bradford St,Bristol,RI 02809","Coffee Shops, Continental Restaurants, Restaurants, Sandwich Shops, Steak Houses",,,A+,41.67311,-71.27221,,,,"Tue - Thu: 11:00 am - 9:00 pm Fri - Sat: 11:00 am - 10:00 pm Sun: 11:00 am - 9:00 pm",,,"amex, discover, master card, visa, all major credit cards",,,,"Cuisines: Sandwiches, Cafeterias, Steakhouse, European, Continental Price Range : Average Parking: Street, Lot, Private Bike Parking: Yes Takes Reservations: No Wi-Fi: No Wheelchair Accessible: Yes Outdoor Seating: No",,,,,,,,
5223521,1543260,"2020-09-27 04:59:56","Bistro Provence",http://www.bistroprovence.us,info@bistroprovence.us,"(713) 827-8008","13616 Memorial Dr",Houston,TX,77079,"13616 Memorial Dr,Houston,TX 77079","French Restaurants, American Restaurants, Bar & Grills, Breakfast, Brunch & Lunch Restaurants, Continental Restaurants, Mediterranean Restaurants, Restaurants, Steak Houses",4,"31 Reviews",,29.77324,-95.58088,https://i1.ypcdn.com/blob/2d15630a4e6a5b84ec13ed57b135c2a067a44f6c_100x100_crop.jpg?f832250,,,"Mon: 11:00 am - 9:00 pm Tue - Thu: 11:00 am - 10:00 pm Fri: 11:00 am - 11:00 pm Sat: 12:00 pm - 12:00 am","Phone: (713) 827-0819 Fax: (713) 827-0819",,"diners club, discover, master card, visa, all major credit cards, amex",,,"http://www.bistroprovence.us http://bistroprovence.com https://www.bistroprovence.us","Parking: Lot, Private Wi-Fi: No Bike Parking: No Attire: Casual Wheelchair Accessible: Yes Cuisines: Mediterranean, American, French, Breakfast, Brunch & Lunch, Steakhouse, European, Continental, Bar & Grills Alcohol: Beer, Wine Takes Reservations: Yes Outdoor Seating: Yes",ararar,12/25/2010,one,"What a wonderful Christmas present Bistro Provence gave our family . We not only enjoyed the beet salad once but got to enjoy it two more times in the sink and toilet at three am . To say the least we should have left upon entering and realizing it is owned by the same family as another horrible gastraunomical experience at Don Quiote on Del Monte . I have grown up and lived in France. I have enjoyed food from The Tour D'argent to family owned cafes . Bistro Provence should be ashamed of themselves for calling themselves French . Not one thing was good . They figured out how to ruin Beef Bougenoine - no pastry . They also made the worst apricot tart in the world . I think they were too cheap to spring for sugar . All in all beyond belief putrid .","CP Teacher",07/27/2010,one,"The food we had at Bistro Provence was good and unique. The restaurant as a very interesting ambiance and we were looking forward to a nice lunch when we sat down. The wait staff was very nice but the maitre d'/ owner or manager was very obnoxious and rather offensive in his disdane for us. More than once he interjected his opinion into our private conversations and corrected my wife twice. We were made to feel unwelcome (maybe because we are not locals) and the way we were treated ruined our lunch. All in all, no matter how good the food is, one does not want to be treated poorly. And the food was NOT good enough to make up for his behaviour."
5223873,1543318,"2020-09-27 04:59:56","Bobby's Deerfield",http://www.bobbysdeerfield.com,depaulrhc@gmail.com,"(847) 607-9104","695 Deerfield Rd",Deerfield,IL,60015,"695 Deerfield Rd,Deerfield,IL 60015","American Restaurants, Bars, Caterers, Continental Restaurants, Hamburgers & Hot Dogs, Health Food Restaurants, Italian Restaurants, Mediterranean Restaurants, Night Clubs, Restaurant Delivery Service, Restaurants, Sandwich Shops, Steak Houses, Take Out Restaurants, Vegan Restaurants, Vegetarian Restaurants",,,,42.16718,-87.84552,https://i1.ypcdn.com/blob/d7475c3f3be928ad4d847ffadf0eb392b08e2fcb_100x100_crop.jpg?f832250,,"A true neighborhood spot with an inspired take on inventive food and drink. This is our version of an American bistro with influences from all over the world. We offer food you can understand but be inspired by. That means the very best seasonal ingredients with familiar but fresh, creative preparations. We present craft cocktails that are well-thought out with fresh ingredients and boutique spirits that all have a story to tell. Our wine list is a carefully curated collection full of depth and personality. We're small scale with big expectations for ourselves and we look forward to having you.","Mon - Thu: 11:00 am - 10:00 pm Fri: 11:00 am - 11:00 pm Sat: 4:00 pm - 11:00 pm Sun: 4:00 pm - 9:00 pm","Phone: (847) 607-8597 Primary Phone: (847) 607-8597",,"cash, amex, discover, all major credit cards, diners club, master card, visa",,,http://www.bobbysdeerfield.com,"Parking: Lot, Valet, Private Wi-Fi: Free Bike Parking: Yes Attire: Casual Wheelchair Accessible: Yes Cuisines: Burgers, Delivery, Caterers, American, European, Steakhouse, Healthy, Vegetarian, Continental, Vegan, Mediterranean, Sandwiches, Take Out, Hot Dogs, Italian Alcohol: Full Bar Takes Reservations: Yes Outdoor Seating: Yes Price Range : Average",,,,,,,,
5224016,1543339,"2020-09-27 04:59:56","Bernard Mediterranean Restaurant",http://bernardsintyler.com,,"(903) 534-0265","212 Old Grande Blvd Ste C106",Tyler,TX,75703,"212 Old Grande Blvd Ste C106,Tyler,TX 75703","Mediterranean Restaurants, American Restaurants, Banquet Halls & Reception Facilities, Caterers, Continental Restaurants, Family Style Restaurants, French Restaurants, Health Food Restaurants, Italian Restaurants, Restaurants, Seafood Restaurants, Steak Houses, Vegan Restaurants, Vegetarian Restaurants","3,5","3 Reviews",,32.28237,-95.30774,,,,"Mon: 5:30 pm - 9:30 pm Tue - Fri: 11:30 am - 9:30 pm Sat: 5:30 pm - 9:30 pm Sun Closed","Phone: (903) 534-5993 Fax: (903) 534-5993",,"amex, discover, all major credit cards, mastercard, visa",,"Bernard's Restaurant Bernard Mediterranean Rstrnt","http://bernardsintyler.com http://bernardsintyler.com/defaultsite http://bernardstyler.com","Parking: Lot, Free Bike Parking: Yes Wheelchair Accessible: Yes Cuisines: Caterers, French, American, Healthy, European, Steakhouse, Vegetarian, Continental, Vegan, Mediterranean, Family Style, Italian, Seafood Alcohol: Beer, Full Bar, Wine Wi-Fi: Free Attire: Dressy Takes Reservations: Yes Outdoor Seating: Yes Price Range : Average Pets Allowed: Yes","Lynne C.",03/16/2013,one,,deanmcc12,02/18/2008,five,"the new york strip steak, salmon, salads & dressings, chicken, are really outstanding. they have some excellent sauces for salads & foods. it is reasonable in cost for an upscale restaurant. dean mccracken"
5224793,1543485,"2020-09-27 04:59:56","Caribou Cafe",http://www.cariboucafe.com,,"(215) 625-9535","1126 Walnut St",Philadelphia,PA,19107,"1126 Walnut St,Philadelphia,PA 19107","Coffee Shops, Breakfast, Brunch & Lunch Restaurants, Caterers, Continental Restaurants, Restaurants, Sandwich Shops, Steak Houses","3,5","39 Reviews",,39.948803,-75.15986,https://i3.ypcdn.com/blob/fc001e8ae9e0a56a9308aa90e6034823816f6910_100x100_crop.jpg?f832250,,,"Mon - Thu: 11:30 am - 10:30 pm Fri - Sat: 11:30 am - 11:30 pm Sun: 11:30 am - 10:30 pm","Phone: (215) 627-3604 Fax: (215) 625-2423",,"all major credit cards, amex, visa, discover, master card",,"Caribou Caf?",http://www.cariboucafe.com,"Cuisines: Caterers, Sandwiches, Cafeterias, Breakfast, Brunch & Lunch, Steakhouse, European, Continental Wi-Fi: No Wheelchair Accessible: Yes Alcohol: Full Bar Parking: Street Bike Parking: Yes Attire: Casual Takes Reservations: Yes Outdoor Seating: Yes Price Range : Average",diner55,11/23/2008,one,"This was a very bad dining experience from start to finish. I was in a group of 8 from out of town. Not only did Caribou mishandle our reservations--bumping us from 8:30 to 9:00--they then made us wait until nearly 10:00 to be seated. The two young bartenders made up for this by ignoring our attempts to get a drink. they seemed to have little to do but did it very slowly and deliberately, almost as if they wanted to avoid helping us. The second we were joined by an attractive young woman, however, they rushed to get her a wine list. It was like getting helped by two high school kids with an attitude. When we were finally seated, the food turned out to be quite regrettable. I had a piece of salmon that was sub-par, and made even worse by being drenched in onion soup. my dining-mates didn't finish their appetizers or entrees. To make things worse, the waiter declined to give us separate checks, and then left our bill to another wait person without telling her. I'd give this place a pass--the food was as bad as the service, and both were quite poor.",ilurvefood,06/16/2008,five,"You can't go wrong with a mimosa from this place, fresh squeezed OJ and delish champagne! YUM! they make a killer bloody mary as well, heavy on the horseradish...in the BEST way. the atmosphere is lovely, it truly is reminiscent of meals had in europe. the escargot is delicious and the quiche may be the best i've ever had, perfectly fluffy. i would recommend caribou to any lover of brunch. i look forward to tasting their dinner menu someday soon!"
5226379,1543764,"2020-09-27 04:59:57","Jack's Place",https://www.jacksplacerestaurant.com,,"(407) 996-1787","9700 International Dr",Orlando,FL,32819,"9700 International Dr,Orlando,FL 32819","American Restaurants, Continental Restaurants, Restaurants, Seafood Restaurants, Steak Houses",,,,28.43006,-81.47053,https://i3.ypcdn.com/blob/13a7306296aae8767e98dbf0a74cf3477a543d69_100x100_crop.jpg?f832250,,"Iconic in cuisine and atmosphere, Jack's Place is a classic steakhouse experience in the heart of Orlando's International Drive. From the moment you walk in, you'll be immersed in authenticity, beginning with our impressive collection of celebrity caricatures drawn by Jack Rosen himself. Our chef-inspired menu, featuring sizzling prime steaks and fresh seafood, completes this refined, yet refreshingly fun, dining experience.","Mon - Sun: 5:00 pm - 10:00 pm","Fax: (407) 996-9111 TollFree: (800) 627-8258",,"amex, diners club, discover, master card, visa",,,"https://www.jacksplacerestaurant.com https://www.jacksplacerestaurant.com/#1",,,,,,,,,
13656398,1794515,"2020-09-27 05:25:26","Jake N Joes Sports Grille",http://www.jakenjoes.com,acostain@jakenjoes.com,"(781) 894-0169","70 Market Place Dr",Waltham,MA,02451,"70 Market Place Dr,Waltham,MA 02451","American Restaurants, Bar & Grills, Barbecue Restaurants, Bars, Caterers, Continental Restaurants, Family Style Restaurants, Night Clubs, Restaurants, Sandwich Shops, Sports Bars, Taverns",,,,42.3954,-71.2508,,,"Welcome to Jake n JOES Sports Grille in Waltham, located at 70 Market Place Drive off of I-95 N Exit 26. Voted NBC10В’s Boston's Best Sports Bar! We proudly serve a classic American Pub menu featuring Wings, Burgers, Seafood, Mac n Cheese, Appetizers and Featured Specials at reasonable prices with great service. Jake n JOES is known for Hand-Crafted Cocktails, Craft Beer and Classic Cocktails to accompany our Weekday Menu PromotionsВ…perfect for an after work gathering. A large bar, lots of tables and large outdoor patio help to create a fun atmosphere with a great crowd. Guaranteeing a view from any seat to watch the game with our state-of- the- art HDTVВ’s and sound system. Never miss your favorite team as NFL Sunday Ticket and most of the major sporting events are always available. Jake n JOES is the BEST place to watch the game!","Mon - Wed: 10:30 am - 12:00 am Thu - Sat: 11:00 am - 12:00 am Sun: 10:00 am - 12:00 am","Phone: (781) 966-3818 TollFree: (800) 748-2437",,discover,,"Jake n JOES Sports Grille - Waltham Jake N Joes - Waltham",http://www.jakenjoes.com,"Cuisines: Caterers, Barbecue, Family Style, American, Sandwiches, European, Continental, Bar & Grills Wi-Fi: Free Wheelchair Accessible: Yes Alcohol: Full Bar Parking: Lot, Private Bike Parking: Yes Attire: Casual Takes Reservations: Yes Outdoor Seating: Yes Price Range : Average",,,,,,,,
13660942,1794995,"2020-09-27 05:25:26","Wooden Nickel Bar & Grill",,editors@nuvo.net,"(831) 724-2600","1819 Freedom Blvd",Freedom,CA,95019,"1819 Freedom Blvd,Freedom,CA 95019","American Restaurants, Bar & Grills, Barbecue Restaurants, Bars, Brew Pubs, Continental Restaurants, Night Clubs, Restaurants, Taverns",5,"1 Review",,36.93444,-121.77323,,,,"Mon - Sun: 9:00 am - 11:00 pm",,,"amex, discover, master card, visa, all major credit cards",,"Wooden Nickle Bar & Grill",,"Parking: Lot, Private Wi-Fi: No Bike Parking: Yes Attire: Casual Wheelchair Accessible: Yes Cuisines: Brew Pubs, Barbecue, American, European, Continental, Bar & Grills Alcohol: Full Bar Takes Reservations: No Outdoor Seating: No Price Range : Average","Richard C.",03/14/2014,five,"Awesome food and the best people.",,,,
13673470,1796409,"2020-09-27 05:25:37","Jacks Place",https://www.jacksplacebistro.com,,"(256) 349-5429","118 W Mobile St",Florence,AL,35630,"118 W Mobile St,Florence,AL 35630","American Restaurants, Barbecue Restaurants, Continental Restaurants, Italian Restaurants, Restaurants",,,,34.80096,-87.67674,,,,"Tue - Thu: 5:00 pm - 9:00 pm Fri - Sat: 5:00 pm - 10:00 pm Sun: 11:00 am - 3:00 pm",,,,,"JackВ’s Place Jack's Place Bistro","https://www.jacksplacebistro.com http://jacksplacebistro.com",,,,,,,,,