business_x_category.id,business.id,business.ts,business.business_name,business.home_page,business.email_address,business.phone,business.street,business.city,business.state,business.zip_code,business.full_address,business.category,business.rating,business.number_of_reviews,business.bbb_rating_or_license,business.latitude,business.longitude,business.cover_image,business.slogan,business.general_info,business.regular_hours,business.extra_phones,business.services_products,business.payment,business.price_range,business.aka,business.other_links,business.other_information,business.review_1_name,business.review_1_date,business.review_1_rating,business.review_1_text,business.review_2_name,business.review_2_date,business.review_2_rating,business.review_2_text
17242251,2463626,"2020-09-27 06:30:17","Jackson, Javel",http://altinex.com,,"(770) 986-3860","4360 Chamblee Dunwoody Rd Ste 530",Atlanta,GA,30341,"4360 Chamblee Dunwoody Rd Ste 530,Atlanta,GA 30341","Counselors-Licensed Professional, Counseling Services, Mental Health Services, Psychological Clinics, Psychologists",,,,33.91816,-84.31714,https://i4.ypcdn.com/blob/41279859d3a124502767aefcaf08cb5be6d98c0a_100x100_crop.jpg?63f80dd,,,"Mon - Thu: 6:00 am - 8:00 pm Fri - Sun Closed","Phone: (770) 630-6843",,,,"Javel Jackson Psyd Dr. Javel Jackson, Psy D","http://altinex.com http://drjaveljackson.com",,,,,,,,,
17242424,2463691,"2020-09-27 06:30:17","Jane B Brotman LCSW",http://www.quarryarts.com,,"(608) 256-0942","715 Hill St",Madison,WI,53705,"715 Hill St,Madison,WI 53705","Marriage, Family, Child & Individual Counselors, Counseling Services, Counselors-Licensed Professional, Marriage & Family Therapists, Mental Health Services, Psychologists, Social Workers",,,,43.07449,-89.44299,,,,,"Phone: (608) 233-3000 Phone: (608) 698-5005 Fax: (609) 221-1143",,,,"Counseling Associates of Madison SC Jane B Brotman LCSW LLC Young, Nancy F Fulton Young Nancy F Jane Beth Brotman, LCSW Nancy F. Young, MA",http://www.quarryarts.com,"Certifications: Licensed Professional Counselors",,,,,,,,
17242432,2463693,"2020-09-27 06:30:17","Self & Family Behavioral Healthcare",http://www.selfandfamily.com,,"(734) 506-0153","7521 N Telegraph Rd",Newport,MI,48166,"7521 N Telegraph Rd,Newport,MI 48166","Psychologists, Counseling Services, Counselors-Licensed Professional, Marriage, Family, Child & Individual Counselors, Mental Health Clinics & Information, Mental Health Services, Physicians & Surgeons",,,,41.98652,-83.36881,,"Helping Selves and Families Grow","Biography If youВ’re looking for extra support and guidance through a challenging situation or youВ’re just ready to move in a new direction in your life, we look forward to working with you to achieve your goals. Self and FamilyВ’s Licensed Psychologists and Licensed Social Workers provide a variety of services. Privacy & Policy Confidentiality The law protects the relationship between a client and a psychotherapist, and information cannot be disclosed without written permission. Exceptions include: В•Suspected child abuse or dependent adult or elder abuse, for which we are required by law to report this to the appropriate authorities immediately. В•If a client is threatening serious bodily harm to another person/s, we must notify the police and inform the intended victim. В•If a client intends to harm himself or herself, we will make every effort to enlist their cooperation in insuring their safety. If they do not cooperate, we will take further measures without their permission that are provided to us by law in order to ensure their safety. counseling. therapy. support","Mon - Fri: 9:00 am - 6:00 pm Sat - Sun Closed Thanksgiving Day 2020/11/26 Closed Christmas Day 2020/12/25 Closed",,,"all major credit cards, debit, cash, check",,,http://www.selfandfamily.com,"Specialties: Family & Relationship Issues, Relationship Issues, Interpersonal Issues, Family Problems, Relational Therapy, Family & Relationship Counseling, Relationship Problems, Relationship Difficulties",,,,,,,,
17242569,2463745,"2020-09-27 06:30:17","Eaglecrest Counseling Center",http://www.eaglecrestcounseling.com,,"(417) 862-8282","636 W Republic Rd",Springfield,MO,65807,"636 W Republic Rd,Springfield,MO 65807","Psychologists, Child & Adolescent Guidance Counselors, Counseling Services, Counselors-Licensed Professional, Educational Services, Marriage, Family, Child & Individual Counselors, Mental Health Services",,,,37.13755,-93.29978,,"When You're Ready to Soar","Services/Products Individual Therapy Marriage Counseling Tricare children, teenagers, adults, Medicare, most insurance accepted.","Mon - Tue: 8:00 am - 7:00 pm Wed: 8:00 am - 5:00 pm Thu: 8:00 am - 7:00 pm Fri: 8:00 am - 12:00 pm",,,"visa, discover, mastercard, all major credit cards, check, debit, insurance",,,http://www.eaglecrestcounseling.com,,,,,,,,,
17242576,2463747,"2020-09-27 06:30:17","Cedar, Creek Counseling",http://www.cedarcreekcounseling.com,,"(262) 376-3890","1035 W Glen Oaks Ln Ste 110",Mequon,WI,53092,"1035 W Glen Oaks Ln Ste 110,Mequon,WI 53092","Counselors-Licensed Professional, Counseling Services, Marriage, Family, Child & Individual Counselors, Physicians & Surgeons, Psychiatry, Psychologists",,,,43.2344,-87.92224,,,,"Mon - Fri: 8:00 am - 8:00 pm Sat: 8:00 am - 3:00 pm",,,insurance,,,http://www.cedarcreekcounseling.com,,,,,,,,,
17242951,2463882,"2020-09-27 06:30:17","Marriage & Family Health Services Ltd",http://www.marriageandfamilyhealthservices.com,,"(715) 832-0238","2925 Mondovi Rd","Eau Claire",WI,54701,"2925 Mondovi Rd,Eau Claire,WI 54701","Marriage & Family Therapists, Counseling Services, Counselors-Licensed Professional, Marriage, Family, Child & Individual Counselors, Mental Health Clinics & Information, Mental Health Services, Psychologists",,,,44.78803,-91.52428,,,"**Confidential, Independent, Prompt, Professional, Evenings**","Mon - Fri: 8:00 am - 5:00 pm","Chippewa Falls 132 W. Columbia St.: (715) 726-9208 Durand 905 7th Ave. West: (715) 672-8585 2910 Enloe St. Hudson, WI 54016: (715) 381-5437 TollFree: (800) 639-4044",,,,,http://www.marriageandfamilyhealthservices.com,"Certifications: Licensed Professional Counselors",,,,,,,,
17243054,2463917,"2020-09-27 06:30:17","Karen Scherr Lundy, LCPC",http://www.klundycounseling.com,,"(618) 281-9282","221 S Metter Ave",Columbia,IL,62236,"221 S Metter Ave,Columbia,IL 62236","Counselors-Licensed Professional, Counseling Services, Marriage, Family, Child & Individual Counselors, Mental Health Services, Psychologists, Psychotherapists",,,,38.44267,-90.19691,,,,,"Fax: (618) 281-4641",,,,"Lundy Karen S Karen S Lundy Lcpc",http://www.klundycounseling.com,"Specialties: Attention Deficit Disorder, Counselor, Marriage & Divorce Issues, Obesity, Abuse Recovery, Substance Abuse, Depression, Anxiety, Career & Work Issues, Stress Management, Child Counseling, School Problems, Abuse Issues, Relaxation Training, Health Care, Career Counseling, Sadness, Worry, Attention Deficit Disorders, Adult Counseling, Walk-Ins, Anger Issues, Panic Disorders",,,,,,,,
17243075,2463923,"2020-09-27 06:30:17","Michael Watterson, MA",,,"(724) 543-2941","300 S Jefferson St",Kittanning,PA,16201,"300 S Jefferson St,Kittanning,PA 16201","Counselors-Licensed Professional, Counseling Services, Mental Health Services, Psychologists",,,,40.81166,-79.51666,,,,,"Fax: (724) 548-8119",,,,"Watterson, Michael: Michael Watterson Watterson, Michael",,,,,,,,,,
17243107,2463930,"2020-09-27 06:30:17","Matthew Bruhin, MFT, RAS, CAS",http://matthewbruhin.com,,"(619) 683-3774","4452 Park Blvd Ste 302","San Diego",CA,92116,"4452 Park Blvd Ste 302,San Diego,CA 92116","Marriage, Family, Child & Individual Counselors, Counseling Services, Counselors-Licensed Professional, Drug Abuse & Addiction Centers, Gambling Addiction-Information & Treatment, Mental Health Services, Physicians & Surgeons, Addiction Medicine, Psychologists, Social Service Organizations","4,5","7 Reviews",,32.7583,-117.14661,,,,"Mon - Fri: 9:00 am - 5:00 pm Sat - Sun Closed","Fax: (619) 243-7211",,"cash, check, debit, master card, all major credit cards, insurance",,"Matthew Bruhin & Associates Matthew J. Bruhin, MFT Matthew J Bruhin MRRG-Fmly Bruhin Matthew J Dr. Matthew Bruhin & Associates",http://matthewbruhin.com,"By Appointment Only: Yes",andyfmann,"Edited: 01/10/2018",five,"I found Matt several years ago off Google when searching for an addiction therapist in San Diego. I was really nervous about the entire thing but my parents pretty much gave me no choice, they were kicking me out unless I got help. I am not sure how other therapists work because this is the only one I have seen but he really made the process positive and overall a good experience. I was also nervous about seeing a male therapist but again Matt was great to work with. He always made me feel like he was an older brother sort of figure, never judgmental or too invasive. I still see him from time to time as it's always good to check in. Would score him 10 stars but it stopped me at 5.",tashasmama,04/23/2013,five,"I am surprised at the review posted below saying that Matt does not care, I am one of the clients he saw a few times for a reduced fee because he knew I was experiencing a difficult time in between jobs with a newborn and wanted to help me. All of the other therapists I reached out to before him told me to go fly a kite so it's kind of odd that someone would expect a therapist to just work for free. Besides that, I just wanted to say Matt has helped me immensely in all areas of my life. Getting back to work, repairing my marriage and becoming a better mother to my daughter. For anyone going through overwhelming life changes Matt is great because he really helps you sort it all out, issue by issue without making you feel like your life is a total mess... So thankful for finding him!"
17243146,2463939,"2020-09-27 06:30:17","Foundations Family Counseling, LLC",http://foundationsfamily.com,,"(614) 504-4466","6641 N High St",Worthington,OH,43085,"6641 N High St,Worthington,OH 43085","Counseling Services, Counselors-Licensed Professional, Marriage & Family Therapists, Marriage, Family, Child & Individual Counselors, Psychologists",,,A+,40.09973,-83.01814,,"Couples counseling.",,"Mon - Fri: 9:00 am - 6:00 pm","Fax: (614) 504-4464",,"visa, master card, discover, debit, check, cash, financing available, insurance",,,http://foundationsfamily.com,,,,,,,,,
17243213,2463963,"2020-09-27 06:30:17","Howard Sharp, LPC",,,"(512) 745-6350","1007 Mo Pac Cir Ste 102",Austin,TX,78746,"1007 Mo Pac Cir Ste 102,Austin,TX 78746","Counselors-Licensed Professional, Counseling Services, Marriage, Family, Child & Individual Counselors, Mental Health Services, Psychologists, Social Service Organizations",,,,30.26589,-97.78458,,,,,,,"cash, check",,,,,,,,,,,,
17243296,2463985,"2020-09-27 06:30:17","Borum and Associates",http://www.lakelandcounselors.com,,"(863) 608-9392","5110 S Florida Ave Ste 105",Lakeland,FL,33813,"5110 S Florida Ave Ste 105,Lakeland,FL 33813","Health & Welfare Clinics, Counselors-Licensed Professional, Marriage, Family, Child & Individual Counselors, Mental Health Services, Psychologists, Social Service Organizations",,,,27.97342,-81.96005,,"PEACE of Mind Counseling- Personal Empowerment through Analysis Counseling and Education","Your Lakeland counselors providing mental health counseling and personal coaching.","Mon - Fri: 9:00 am - 7:00 pm Sat - Sun Closed","Phone: (863) 333-0550 Phone: (863) 860-0531 Phone: (863) 510-5903 Fax: (863) 510-5903",,"cash, check, discover, master card, visa",,"Borum & Associates L.L.C. Borum & Assoc Borum & Associates Borum and Associates LLC","http://www.lakelandcounselors.com http://www.julieborum.com",,,,,,,,,
17243377,2464011,"2020-09-27 06:30:17","P.H.D Susan Toole K Ph.D.",,,"(937) 439-5040","77 W Elmwood Dr",Dayton,OH,45459,"77 W Elmwood Dr,Dayton,OH 45459","Counselors-Licensed Professional, Psychologists",,,,39.64201,-84.15946,,,,,,,,,,,,,,,,,,,
17243402,2464020,"2020-09-27 06:30:17","Journeys to Heal",,,"(818) 605-0089","2211 W Magnolia Blvd",Burbank,CA,91506,"2211 W Magnolia Blvd,Burbank,CA 91506","Hypnotists, Counseling Services, Counselors-Licensed Professional, Hypnotherapy, Marriage & Family Therapists, Marriage, Family, Child & Individual Counselors, Mental Health Clinics & Information, Mental Health Services, Psychological Clinics, Psychologists, Psychotherapists, Smokers Information & Treatment Centers",,,,34.172966,-118.33178,,,,"Mon: 10:00 am - 8:30 pm Tue - Fri: 10:00 am - 9:00 pm Sat: 10:00 am - 3:00 pm",,,,,,,,,,,,,,,
17243479,2464049,"2020-09-27 06:30:17","Attachment Center of Kansas",,,"(316) 688-9850","1650 S Georgetown St Ste 190",Wichita,KS,67218,"1650 S Georgetown St Ste 190,Wichita,KS 67218","Marriage, Family, Child & Individual Counselors, Counselors-Licensed Professional, Psychologists",,,,37.66317,-97.28533,,,,,,,,,,,,,,,,,,,
17243498,2464057,"2020-09-27 06:30:17","Jacqueline Berry CSW",,,"(315) 422-0300","3300 James St",Syracuse,NY,13206,"3300 James St,Syracuse,NY 13206","Psychologists, Counselors-Licensed Professional, Marriage, Family, Child & Individual Counselors, Physicians & Surgeons, Social Workers",,,,43.06858,-76.10084,,,,,,,,,,,,,,,,,,,
17243511,2464061,"2020-09-27 06:30:17","Dr. Komal Ramchandani, Psy D",,,"(415) 452-2200","1701 Ocean Ave","San Francisco",CA,94112,"1701 Ocean Ave,San Francisco,CA 94112","Psychologists, Counseling Services, Counselors-Licensed Professional, Mental Health Services",,,,37.72458,-122.46049,,,"Gender female",,,,,,,,,,,,,,,,
17243522,2464064,"2020-09-27 06:30:17","Family Psychology Institute",,,"(843) 662-6312","607 W Evans St",Florence,SC,29501,"607 W Evans St,Florence,SC 29501","Counseling Services, Counselors-Licensed Professional, Marriage, Family, Child & Individual Counselors, Mental Health Clinics & Information, Mental Health Services, Psychologists",,,,34.19693,-79.77604,,"Family Psychology Institute","Licensed PHD clinical psychologist specializing in the treatment of depression, anxiety, relationship issues, individual couples and family therapy.","Mon - Fri: 8:00 am - 5:00 pm",,,,,,,"Certifications: Licensed Professional Counselors Specialties: Sadness, Depression, Anxiety, Worry, Panic Disorders",,,,,,,,
17243696,2464134,"2020-09-27 06:30:17","Merkle Counseling Associates (MCA)",http://merklecounseling-mcminnville.com,,"(503) 472-9797","1004 NE Baker St",McMinnville,OR,97128,"1004 NE Baker St,McMinnville,OR 97128","Counselors-Licensed Professional, Counseling Services, Marriage, Family, Child & Individual Counselors, Psychologists",,,,45.214993,-123.19795,https://i4.ypcdn.com/blob/79fe0941b9180ff3a4e9c57d9c0cc337e53d2e0d_100x100_crop.jpg?63f80dd,,,,"Phone: (503) 472-0210",,"master card, visa, cash only",,"Family Life Counseling Assoc Merkle Counseling Associates, LLC (MCA) Family Life Counseling Associates Family Life Counseling Association",http://merklecounseling-mcminnville.com,,,,,,,,,
17243995,2464238,"2020-09-27 06:30:17","Aaron Herr Stewart, MA",,,"(336) 855-6314","3719 W Market St Ste A",Greensboro,NC,27403,"3719 W Market St Ste A,Greensboro,NC 27403","Counselors-Licensed Professional, Counseling Services, Mental Health Services, Psychologists",,,,36.07253,-79.84682,,,,,"Fax: (336) 855-6325",,,,"Aaron H Stewart MA Stewart, Aaron H",,,,,,,,,,
17244045,2464254,"2020-09-27 06:30:17","Council for Relationships",http://www.councilforrelationships.org,,"(215) 382-6680","4025 Chestnut St Fl 1",Philadelphia,PA,19104,"4025 Chestnut St Fl 1,Philadelphia,PA 19104","Counselors-Licensed Professional, Counseling Services, Marriage, Family, Child & Individual Counselors, Physicians & Surgeons, Psychiatry, Psychologists",,,,39.95587,-75.20358,,,,"Mon - Thu: 9:00 am - 9:00 pm Fri: 9:00 am - 5:00 pm","Primary Phone: (215) 682-6680 Phone: (215) 386-9327 Phone: (215) 546-3450 Phone: (215) 682-6680 Primary Phone: (215) 386-9327 Phone: (215) 386-1743 Phone: (856) 783-4200 Fax Number: (215) 386-1743",,"cash, check",,"Penn Council For Relationships Council For Relationships: Wanda Sevey",http://www.councilforrelationships.org,,,,,,,,,
17244112,2464281,"2020-09-27 06:30:17","Pender Counseling Services",http://pendercounseling.com,,"(800) 530-6916","8703 La Tijera Blvd Ste Suite#206","Los Angeles",CA,90045,"8703 La Tijera Blvd Ste Suite#206,Los Angeles,CA 90045","Psychotherapists, Counselors-Licensed Professional, Marriage, Family, Child & Individual Counselors, Mental Health Services, Psychologists",,,,33.95816,-118.3935,,,,,,,,,,http://pendercounseling.com,,,,,,,,,
17244124,2464283,"2020-09-27 06:30:17","Madison Deanna",,,"(910) 483-3373","103 Fountainhead Ln",Fayetteville,NC,28301,"103 Fountainhead Ln,Fayetteville,NC 28301","Counselors-Licensed Professional, Counseling Services, Medical Clinics, Mental Health Services, Psychologists",,,,35.0554,-78.89049,,,,,"Fax: (910) 426-3921",,,,"Deanna J Madison, LPC, LPA Deanna Madison Lpa Deanna Madison Ma LPA Madison MA Deanna Lpa",,,,,,,,,,
17244134,2464286,"2020-09-27 06:30:17","ThedaCare Behavioral Health",https://www.thedacare.org/Hospitals-and-Clinics/Behavioral-Health/Behavioral-Health-Waupaca.aspx,,"(920) 720-2300","902 Riverside Dr",Waupaca,WI,54981,"902 Riverside Dr,Waupaca,WI 54981","Psychologists, Alcoholism Information & Treatment Centers, Counseling Services, Counselors-Licensed Professional, Marriage, Family, Child & Individual Counselors, Mental Health Clinics & Information, Mental Health Services, Physicians & Surgeons",,,,44.34525,-89.07494,https://i4.ypcdn.com/blob/8e45851c73935a8023ac9420f217069f09db344f_100x100_crop.jpg?de203a1,,"Gender male","Mon - Tue: 8:30 am - 4:00 pm Wed: 8:30 am - 6:30 pm Thu: 8:30 am - 5:00 pm Fri: 8:00 am - 2:00 pm Sat - Sun Closed",,,,,,https://www.thedacare.org/Hospitals-and-Clinics/Behavioral-Health/Behavioral-Health-Waupaca.aspx,"Certifications: Licensed Professional Counselors",,,,,,,,
17244236,2464326,"2020-09-27 06:30:17","Teran Chartier, LPC",,,"(201) 675-3378","12 Madison Ave",Paramus,NJ,07652,"12 Madison Ave,Paramus,NJ 07652","Counselors-Licensed Professional, Counseling Services, Mental Health Services, Psychologists",,,,40.92178,-74.07071,,,,"Mon - Sun: 9:00 am - 9:00 pm",,,"cash, check",,"Chartier, Teran",,,,,,,,,,
17244257,2464334,"2020-09-27 06:30:17","Psychology Associates",http://psychology.org,,"(601) 693-8307","5004 39th Ave",Meridian,MS,39305,"5004 39th Ave,Meridian,MS 39305","Psychologists, Counseling Services, Counselors-Licensed Professional, Marriage, Family, Child & Individual Counselors, Mental Health Services",,,,32.41031,-88.71682,,,,,,,,,,http://psychology.org,,,,,,,,,
17244496,2464422,"2020-09-27 06:30:17","Gartland Diane PsyD",http://www.drgartland.com,,"(734) 302-0309",,"Ann Arbor",MI,48105,"Ann Arbor,MI 48105","Marriage, Family, Child & Individual Counselors, Counseling Services, Counselors-Licensed Professional, Marriage & Family Therapists, Psychologists",,,,,,,,,,,,,,,http://www.drgartland.com,,,,,,,,,
17244514,2464427,"2020-09-27 06:30:17","Shane M Jones & Associates PA",http://shanemjones.com,,"(785) 266-7732","2708 NW Topeka Blvd Suite 202",Topeka,KS,66617,"2708 NW Topeka Blvd Suite 202,Topeka,KS 66617","Marriage, Family, Child & Individual Counselors, Business & Trade Organizations, Community Organizations, Counseling Services, Counselors-Licensed Professional, Mental Health Services, Psychologists, Psychotherapists",,,A+,39.09564,-95.66396,,,"You deserve a healthy, happy life. Don't let your problems make you lose hope. Whether you've suffered childhood trauma or have issues in parenting or marriage, we'll help you through your recovery process. You'll find all the assistance and support you need to deal with grief. Founded in 1993 by Shane M. Jones, LSCSW. Shane M. Jones & Associates, P.A. has provided quality counseling for individuals, couples, and families. Many have been referred to Shane M. Jones & Associates, P.A. from the Christian community. However, others who do not hold to the Christian faith have come to understand that those they refer for counseling will be treated with respect and sensitivity to their uniqueness as a human being. There exists only one God, creator and sustainer of all things, infinitely perfect and eternally co-existing in three persons Father, Son, and Holy Spirit. Human nature derives from two historical persons, male and female, created in Gods image. They were created perfect, but they sinned, plunging themselves and all human beings into sin, guilt, suffering, and death. Do you see a gap in your relationship with your spouse, child, friends, or other near and dear ones? We'll help you understand the fundamental issues and handle them with our counseling services. You can recover from your emotional trauma with support and assistance from Shane M. Jones & Associates, P.A. Have you been sensing a distance in the relationship with your partner? Married life takes a toll on everyone and it is a rare individual who claims they have not entertained thought of what life would be if they could break the marriage. When marital issues become too much to handle, it's time for you to visit us! Through The Bedrock Book of Acceptance, a to-the-point and concise book, our therapists will help you move forward with your recovery process. Shane M. Jones has put together his 28 years' experience in this book to help you understand the effects that childhood deprivation.","Mon - Fri: 8:00 am - 5:00 pm",,,,,,http://shanemjones.com,"Specialties: Compulsive Eating, Depression, Family of Origin issues, Anxiety, Men's issues, Overeating, Marriage, Dissociative Disorders, Intimacy & Trust Issues, Step Families, Personality Disorders",,,,,,,,
17244528,2464432,"2020-09-27 06:30:17","Upperbay Counseling",http://www.upperbay.org,,"(410) 620-7168","1275b W Pulaski Hwy",Elkton,MD,21921,"1275b W Pulaski Hwy,Elkton,MD 21921","Counselors-Licensed Professional, Alcoholism Information & Treatment Centers, Counseling Services, Drug Abuse & Addiction Centers, Mental Health Services, Physicians & Surgeons, Psychiatry, Psychologists",,,,39.626434,-75.84584,,,,"Mon - Thu: 8:00 am - 5:00 pm Fri: 8:00 am - 3:00 pm","Phone: (410) 620-5637 Phone: (410) 793-1758 Phone: (410) 881-6228 Phone: (410) 620-7161 Primary Phone: (410) 620-5637 TollFree: (800) 467-0304 TollFree: (844) 225-9241",,,,"Upper Bay Counseling & Support Services, Inc. Upper Bay Counseling and Support Services","http://www.upperbay.org https://www.upperbay.org",,,,,,,,,