business_x_category.id,business.id,business.ts,business.business_name,business.home_page,business.email_address,business.phone,business.street,business.city,business.state,business.zip_code,business.full_address,business.category,business.rating,business.number_of_reviews,business.bbb_rating_or_license,business.latitude,business.longitude,business.cover_image,business.slogan,business.general_info,business.regular_hours,business.extra_phones,business.services_products,business.payment,business.price_range,business.aka,business.other_links,business.other_information,business.review_1_name,business.review_1_date,business.review_1_rating,business.review_1_text,business.review_2_name,business.review_2_date,business.review_2_rating,business.review_2_text
1184646,380416,"2020-09-27 03:08:06","Luxury Limousine of Scottsdale",,llofscottsdale@gmail.com,"(602) 849-0295","Po Box 1121",Scottsdale,AZ,85252,"Po Box 1121,Scottsdale,AZ 85252","Airport Transportation, Hotels, Limousine Service, Taxis, Transportation Services",,,,33.4873,-111.9247,,"We Drive, You do business.","Transportation Anywhere in Arizona","Sat - Sun: Open 24 Hours","Reservations: (602) 849-0295",,"debit, check, cash, all major credit cards, paypal",,,,,,,,,,,,
1184796,380479,"2020-09-27 03:08:06","Park City Taxi",,pbare@parkcitytaxi.cab,"(608) 436-1617","1605 E Memorial Dr",Janesville,WI,53545,"1605 E Memorial Dr,Janesville,WI 53545","Taxis, Airport Transportation, Hotels, Lodging, Transportation Services",5,"20 Reviews",,42.6936,-89.00265,https://i4.ypcdn.com/blob/27468a2e32458900e59616cd6606c1a6b4ac5cfa_100x100_crop.jpg?912a958,"Affordable, Safe, Reliable","Traveling to the store, going to the doctor, a night on the town, or a ride to the airport? Then Park City Taxi in Janesville is perfect for you! Our transportation service offers reliable travel, privacy, at an affordable rate. DonВ’t worry about getting where youВ’re going В– weВ’ll take you to your destination so you can take care of business. Affordable, safe taxi services to the Janesville and surrounding area. And airport shuttle service to Madison Milwaukee and Chicago.",,"Airport Shuttle Reservations: (608) 436-5567",,"discover, visa, mastercard, amex, debit, all major credit cards",,,,,"Becky M.",10/02/2016,one,"Called for a ride from Sonic Boom to hotel 12 minute ride and was told $50 per person!! Are you kidding me.. It's pathetic you are trying to completely rip people off... DO NOT USE","Robert F.",06/27/2015,five,"Great service and Value Thank You"
1186115,381146,"2020-09-27 03:08:15","Central City Taxi",,,"(315) 679-6769","422 7th North St",Syracuse,NY,13208,"422 7th North St,Syracuse,NY 13208","Hotels, Limousine Service, Taxis",,,,43.08174,-76.15526,,"serving all of central new york",,"Mon - Sun: Open 24 Hours",,,"visa, master card",,,,,,,,,,,,
1187026,381590,"2020-09-27 03:08:15","NEO EXECUTIVE SEDANS & TAXI'S",http://www.neosedans.com,neosedans@yahoo.com,"(330) 777-5454",,,,,,"Airport Transportation, Casinos, Hotels, Shuttle Service, Taxis",,,,,,,"On time every time!","A Dependable Airport Hotel and Casino Transportation Business","Mon - Sun: Open 24 Hours",,,"all major credit cards, debit",,,"Online Reservation System Online Reservation",,,,,,,,,
1188441,382258,"2020-09-27 03:08:25","Lux Trans & Taxi",https://stores.express.com/us/ia/west-des-moines/101-jordan-creek-parkway,nikolas1327@yahoo.com,"(515) 975-5973",,"West Des Moines",IA,50266,"West Des Moines,IA 50266","Airport Transportation, Bars, Driving Service, Hotels, Restaurants, Shuttle Service, Taxis, Transportation Providers, Transportation Services",5,"2 Reviews",,,,https://i4.ypcdn.com/blob/f66870b645ef6761432de9ef3b11b0fc9ee444f5_100x100_crop.jpg?912a958,"A taxi service above the original","Senior and Military Discounts over 10miles 15% Credit Card over Phone Travelers Checks and Money Orders Executive Transports Serving West Des Moines, Adel, Grimes, Johnston, Beaverdale, Clive, Urbandale, Ames, Fort Dodge, and All Other City's in Iowa Executive Transport Discounts Available Non-Smoking and Smoking Cars Available Long Hauls from Des Moines or anywhere in the Mid-West to Any Destination with Prepaid Appointments Package Delivery Most Pickups within 20min Wet Bar for Long Hauls","Sat - Sun: Open 24 Hours","MobilePhone: (515) 975-5973",,"travelers checks, visa, master card, amex, discover, debit, cash",,"Lux Trans TB Express Eco Taxi",https://stores.express.com/us/ia/west-des-moines/101-jordan-creek-parkway,,djmasterpiece,08/26/2013,five,"i have been meaning to get on and review Jeffrey again just haven't had time anyway i have used him several times and he has always been on time and friendly he lets me listen to what ever i want to on the radio his cab is clean fresh and comfortable keep up the good work",johnia6510,08/19/2013,five,"i am a regular customer of Lux Trans the review below is nothing more then slander and is probably competition slandering to hurt this small business owner In short i use Lux Trans 5-8 times a week they are always on time clean friendly and they pride their company on being clean and always early never late if i could i would rate this company with 10 stars all the time"
1190063,383051,"2020-09-27 03:08:28","Imperium Transportation",http://orlandoluxurycarservice.com,cynthiabustos@aol.com,"(407) 692-1065","11109 Aries Dr",Orlando,FL,32837,"11109 Aries Dr,Orlando,FL 32837","Hotels, Taxis, Transportation Services",,,,28.40537,-81.41469,,,"Transportation services in Orlando Florida. SERVICIOS DE transporte EN EL area DE Orlando Florida.","Mon - Sun: Open 24 Hours",,,"all major credit cards, debit, cash, paypal, visa",,,"http://orlandoluxurycarservice.com http://imperiumtransportation.com",,,,,,,,,
1190488,383272,"2020-09-27 03:08:28","United Sedans",,unitedsedans@gmail.com,"(206) 331-4242",,,,,,"Hotels, Bed & Breakfast & Inns, Limousine Service, Night Clubs, Taxis",,,,,,,,"We Provide Late Model Luxury Sedans and Suv's at the taxi rate.","Mon - Sun: Open 24 Hours","toll free: (877) 675-9227",,,,,,,,,,,,,,
1190792,383423,"2020-09-27 03:08:28","All Time Yellow Cab",http://www.alltimecab.com,alltimeycab@gmail.com,"(650) 799-8300","301 Acalanes Dr",Sunnyvale,CA,94086,"301 Acalanes Dr,Sunnyvale,CA 94086","Airport Transportation, Hotels, Taxis",,,,37.37917,-122.05868,https://i4.ypcdn.com/blob/b24dffd322bd0aa25cbca8e2cba372a7cf8946bb_100x100_crop.jpg?912a958,,,,"(408)6852425: (877) 806-2333",,"all major credit cards, debit, financing available, travelers checks",,,"Taxi Service",,,,,,,,,
1191826,383937,"2020-09-27 03:08:28","A Orlando Taxi Cab Company",http://www.caleystaxi.weebly.com,caleystaxi@ymail.com,"(407) 259-7381",,Orlando,FL,32812,"Orlando,FL 32812","Hotels, Cruises, Sightseeing Tours, Taxis",,,,,,,"Tours, Theme Parks, Beaches, Night life, Airport, Shopping...","Taxi rides 24 hours a day, Metered or flat rates available, Theme Parks, Beaches, Airport, Shopping, etc...","Mon - Sun: Open 24 Hours","Phone: (321) 945-7034",,"cash only",,"Caley's Taxi",http://www.caleystaxi.weebly.com,,,,,,,,,
1192172,384094,"2020-09-27 03:08:35","Night Owl Taxi",,,"(515) 770-8745","5465 Mills Civic Pkwy","West Des Moines",IA,50266,"5465 Mills Civic Pkwy,West Des Moines,IA 50266","Bars, Hotels, Limousine Service, Taxis, Transportation Services",,,,41.55928,-93.78185,,,"Night Owl Taxi operates primarily at night, during bar & nightclub hours. We're based in West Des Moines and serve all cities surrounding Des Moines to Any Destination. Cash & All Major credit cards accepted. Call Today!",,,,,,,,,,,,,,,,
1192348,384168,"2020-09-27 03:08:35","Monterey Bay Shuttle",http://www.montereybaylodge.com,info@montereybaylodge.com,"(831) 869-1957","55 Camino Aguajito",Monterey,CA,93940,"55 Camino Aguajito,Monterey,CA 93940","Historical Places, Hotels, Lodging, Motels, Places Of Interest, Taxis",3,"2 Reviews",,36.59471,-121.88169,https://i4.ypcdn.com/blob/d5deecfb8803d69777966e7bedb69f4f1866d3d8_100x100_crop.jpg?912a958,,"* Open 7 Days a Week * Open Holidays","Mon - Sun: Open 24 Hours",,,"diners club, mastercard, amex, visa, discover",,,"http://www.montereybaylodge.com http://www.montereybayshuttle.com","Wi-Fi: Free Swimming Pool: Outdoor Check-Out Time: 11 AM Policy: 24-hour check-in Property Amenities: 24-hour front desk, Restaurant, Concierge services, Spa tub, Garden, Business center, Tours/ticket assistance, Dry cleaning/laundry service Room Amenities: Daily housekeeping, Iron/ironing board, Shower/tub combination, Private bathroom, Digital TV service, Hair dryer, Free local calls, Refrigerator, Microwave, LED TV, Coffee/tea maker, In-room safe",rhino83,05/23/2011,one,"This place sucks. They have no AC, the rooms R small & stuffy",cin1964,02/12/2009,five,"We stayed in December 2008. Originally for 1 night turned to 3 nights. My girls loved the pool and I loved the hot tub. Larry helped us check in and gave us maps and directions to see the butterflies migrating. We used breakfast coupons for their restaurant was very good. I met the manager Cindy and she gave us directions to laundry and grocery facilities and THE PARK. (Thank you Cindy It kept the energetic girls busy) We used and loved the fridge in the room.I'm told they are adding microwaves soon. What a plus! Everything you need is in these rooms. I was able to use the comp in the lobby and print without any problems. We do not live too far about 3 hours away and will stay many more times."
1483714,470791,"2020-09-27 03:16:38","Life's A Beach Family Photography Inc.",http://lifesabeachphoto.com,info@lifesabeachphoto.com,"(910) 575-3900","395 S Crow Creek Dr Unit 2304",Calabash,NC,28467,"395 S Crow Creek Dr Unit 2304,Calabash,NC 28467","Portrait Photographers, Architectural Support Services, Bed & Breakfast & Inns, Cabins & Chalets, Campgrounds & Recreational Vehicle Parks, Cheerleading, Children's Party Planning & Entertainment, Churches & Places of Worship, Clubs, Commercial Photographers, Corporate Lodging, Cruises, Cultural Centers, Entertainment Agencies & Bureaus, Executive Suites, Family & Business Entertainers, Fashion Consultants, Golf Courses, Hotels, Motels, Personal Services & Assistants, Pet Portrait Photographers, Photo Finishing, Photography & Videography, Photography Schools, Physical Fitness Consultants & Trainers, Private Clubs, Resorts, Sports Clubs & Organizations, Tours-Operators & Promoters, Trade Shows, Expositions & Fairs, Transportation Services, Travel Clubs, Travel Services-Commercial, Vacation Homes Rentals & Sales, Veterans & Military Organizations, Wedding Chapels & Ceremonies, Wedding Music & Entertainment, Wedding Photography & Videography, Wedding Planning & Consultants, Wedding Reception Locations & Services, Wedding Supplies & Services",5,"1 Review",A+,33.93348,-78.58001,https://i1.ypcdn.com/blob/e3897e3d721bfe8840c68d820b5424e49dc51834_100x100_crop.jpg?f832250,"We Come to you, We proof at your Rental, We Guarantee!!!",,"Mon - Sun: 9:00 am - 5:30 pm",,,"check, debit, financing available, visa, mastercard, all major credit cards",,,"Fine Art Personal & Commercial Photography Studio Specializing in being the ultimate mobile photographic solution for those who demand the best quality & service. Fine Home Photography for Builders, Developers & Fine Home Sales",,allison,06/18/2012,five,"What a great photogrphy company and great photgrapher, Andrew Fox. I had a family beach reunion will all our memories taken in pictures that were beyond words. I was surprised by the great prices, the beautiful memories in pcitures and above all Andrew. He was so helpful in every way. He was patient with all 15 of us! I went to his proofing session and he was not pushy just sooo helpful. Anyone coming or living in this area should use this company.",,,,
2072823,637554,"2020-09-27 03:32:47","The Riverview Hotel & Spa",http://www.riverviewhotel.com,rvhreservations@gmail.com,"(386) 428-5858","103 Flagler Ave","New Smyrna Beach",FL,32169,"103 Flagler Ave,New Smyrna Beach,FL 32169","Hotels, Beauty Salons, Cosmetologists, Day Spas, Massage Services, Massage Therapists, Medical Spas, Nail Salons, Skin Care",,,,29.03862,-80.90398,https://i4.ypcdn.com/blob/e86991b18544f3e2f4bca9272e4f7a598f7f0e3c_100x100_crop.jpg?41e4770,,"Welcome to the Riverview Hotel. Enjoy a unique historic experience for both romantic getaways and family vacations alike. Established in 1885 the Victorian style Riverview Hotel is a picturesque icon of New Smyrna Beach, Florida. Overlooking the Indian River and lively Flagler Ave., we offer the perfect location for boutique shopping or a day at the beach and a variety of unique bars and restaurants at night. You're visit will include a complimentary expanded continental breakfast brought to your room every morning, mint-chocolates placed on your plush robes at turn down, free Wi-Fi, complimentary bike rentals and access to our tropical pool area. During your stay we invite you to visit our ""World Class Spa"", The Spa At Riverview, where you can relax and unwind all day. For a romantic meal overlooking the river, delicious food, beautiful sunsets and superb entertainment, there's no place in town better than The Grille At Riverview located adjacent to us.No matter when you visit there's always something fun and exciting to do. One of the trendiest little beach towns in the U.S. through its booming art and surf community, New Smyrna Beach has become a diverse vacation destination hot spot. Both Flagler Ave and Canal Street provide events almost every week for your entertainment. Whether you enjoy wiggling your toes in the sand, boating, fishing, surfing, hiking, kayaking, biking, shopping, dining or just plain relaxing, New Smyrna Beach is the place for your next get-a-way.","Mon - Sun: Open 24 Hours","Phone: (386) 424-6262 TollFree: (800) 945-7416",,"visa, amex, discover, mastercard, check, travelers checks, cash, all major credit cards, debit",,"The Riverview Hotel & Spa","http://www.riverviewhotel.com http://www.spaatriverview.com http://www.riverviewhotel.com/spa","Parking: Lot Bike Parking: Yes",,,,,,,,
2090824,641322,"2020-09-27 03:33:42","Cypress Grove Wedding Venue",http://www.cypressgroveplace.com,joy@cypressgroveplace.com,"(337) 304-1727","150 Seale Ln",Eunice,LA,70535,"150 Seale Ln,Eunice,LA 70535","Party & Event Planners, Antiques, Bed & Breakfast & Inns, Hotels, Lodging, Wedding Chapels & Ceremonies, Wedding Planning & Consultants, Wedding Reception Locations & Services, Wedding Supplies & Services",,,,30.46658,-92.40992,https://i1.ypcdn.com/blob/84203299da2ca7df79acca9af8db4f07b1862b86_100x100_crop.jpg?f9d23e1,"""Say I do!""","Wedding Venue set in Eunice, LA. Historical Building that was the last attempted Robbery of Bonnie & Clyde, built in 1886. In addition to this beautiful cypress building, there is a 1920 Farmhouse that can be rental as a Bridal Home/Suite. Wedding decor rentals also available. Outside Caterers welcome! Outdoor/Indoor options for wedding. Rustic Vintage Wedding set in a Lush Grove of Cypress Trees within a short drive of Lafayette, LA, Crowley, LA, Rayne, LA, Opelousas, LA, Washington, LA, Jennings, LA, Iota, LA","Mon - Sat: 8:00 am - 5:00 pm","Phone: (337) 546-4177",,"visa, discover, mastercard, all major credit cards, amex, cash, check, travelers checks",,,http://www.cypressgroveplace.com,,,,,,,,,
2098741,644741,"2020-09-27 03:33:54","D.H.Burrell Overlook Mansion",,overlookmansion@yahoo.com,"(315) 823-1907","55 Douglas St","Little Falls",NY,13365,"55 Douglas St,Little Falls,NY 13365","Hotels, Antiques, Bed & Breakfast & Inns, Party & Event Planners, Wedding Reception Locations & Services",,,,43.04806,-74.86117,https://i1.ypcdn.com/blob/5a0bd3a28d65af6477aeb09c7293d08a6f2884f8_100x100_crop.jpg?f9d23e1,,,"Mon - Sun: Open 24 Hours",,,"debit, check, all major credit cards",,,,"Parking: Lot, Free Tennis Courts: Outdoor Check-In Time: 2 PM Check-Out Time: 11 AM Property Amenities: Express check-in, Express check-out, Free breakfast, Designated smoking areas, Barbecue grill(s), Fireplace in lobby, Laundry facilities, Bar/lounge, Computer station, Front desk (limited hours), Concierge services, Library, Airport transportation, Wedding services, Tours/ticket assistance Room Amenities: Fireplace, Cable TV service, Individually decorated, Air conditioning, Television Wi-Fi: Free",,,,,,,,
2130827,659076,"2020-09-27 03:35:34","Hickory Ridge Lodge",http://www.hickoryridgelodge.com,,"(334) 343-6192","27388 Straughn School Rd",Andalusia,AL,36421,"27388 Straughn School Rd,Andalusia,AL 36421","Bed & Breakfast & Inns, Antiques, Banquet Halls & Reception Facilities, Caterers, Conference Centers, Hotels, Meeting & Event Planning Services, Retreat Facilities, Wedding Chapels & Ceremonies, Wedding Reception Locations & Services",,,,31.37306,-86.44575,,,"Hickory Ridge Lodge and Inn is Andalusia's premier bed-and-breakfast, event venue, and retreat center for visitors, weddings, honeymoons, reunions, church groups, corporate events, and so much more. With three picturesque homes, down-home cooking, an antique store, and a secluded six-acre pond, Hickory Ridge Lodge and Inn is a beautifully quiet treasure tucked away in the heart of south Alabama.",,"Phone: (334) 222-6647",,,,,http://www.hickoryridgelodge.com,,,,,,,,,
2168955,676016,"2020-09-27 03:37:24","Beach Baby Equipment Rental",,,"(727) 369-6295","2460 Grand Central Pkwy Apt 14",Orlando,FL,32839,"2460 Grand Central Pkwy Apt 14,Orlando,FL 32839","Vacation Homes Rentals & Sales, Hotels, Rental Service Stores & Yards",,,,28.49117,-81.41283,,,"Providing quality baby equipment rentals to Orlando and Kissimmee area resorts. Condos and homes.","Mon - Sun: 9:00 am - 7:00 pm","Primary Phone: (321) 250-2950 Phone: (321) 250-2950",,,,,,,,,,,,,,
2174251,677469,"2020-09-27 03:37:35","Maples Ridge Cabin Rentals",http://www.maplesridge.com,visitpigeonforge@comcast.net,"(865) 908-8970",,Sevierville,TN,37862,"Sevierville,TN 37862","Cabins & Chalets, Cottages, Hotels, Rental Service Stores & Yards",5,"6 Reviews",,,,https://i4.ypcdn.com/blob/9a1c52a43727030fb35d9204e170f43932baf467_100x100_crop.jpg?63f80dd,"YOUR PLACE TO STAY IN THE SMOKIES!","At Maples Ridge Cabins we offer Getaways in our Pigeon Forge Cabins for friends and family retreats to large group accommodations. Guest satisfaction and life long memories are our number one priority. Visit our luxury log Pigeon Forge cabins and youВ’ll see that our Pigeon Forge cabin rentals speak for themselves. From one to six bedrooms, weВ’re sure we have your dream cabin in the Smokies. When you visit Pigeon Forge, youВ’ll see why Maples Ridge is В“Your Place to Stay in the Smokies.В“","Mon - Sat: 9:00 am - 7:00 pm Sun: 1:00 pm - 7:00 pm","Fax: (865) 774-4053 TollFree: (800) 752-9052",,"all major credit cards, mastercard, visa, discover, debit",,,http://www.maplesridge.com,"Wheelchair Accessible: Yes Parking: Lot, Free","Sally A.",08/09/2017,five,"What a vacation! Creekside Lodge at Cedar Falls Resort is beautiful. This cabin is constructed out of large timbers, a real lodge. The access is easy, nice flat parking. We entered In the front- the door is a large curved wooden door. The dining table is large round looks hand made, it had chairs and benches. I've never seen a table so large, our family including children enjoyed eating together. The kitchen had nice new stainless steel appliance, photos show older appliances, nice surprise. The kitchen is so organized and many serving dishes, even has crock pots. The living room has 2 nice leather couches and love seat. The gas fireplace has doors that look hand made, perfect for a lodge. All bedroom were very spacious with different lodge theme. Back screened porch was an extension of the lodge with two large tables, kids and adults loved playing uno at night. Oh and the hot tub under the stars, very nice. Large rocking chairs and tables on all porches were very nice. Theatre room is very large with two leather sectionals, movies time was very nice. Our grownup boys loved the gameroom with 3 TVs- they could watch the game while playing pool. We had our own private fishing pond with waterfall. Children loved catching the fish. We had to buy the poles but it was worth it to watch them. We made many photos and many memories. We saw many fish, turtles, turkeys and birds. The small stream beside the cabin was less that a foot deep in most places, very nice for small children. We enjoyed walking to the resort swimming pool every day. We also shopped at the Five Oaks Mall in Pigeon Forge, only a few miles. We went to Ripleys aquarium in Gatlinburg, the glass tunnel with sharks was amazing!! Dollywood was nice but very crowed so we didn't stay long. This cabin/lodge is the more that we could ever dream of. We will recommend Maples Ridge Vacation Rentals to everyone. And we will be back!","Melinda B.",04/22/2017,five,"- [ ] Gamblers Cove is awesome. Very clean. Convenient to Pigeon Forge, lots of room for our family. Maples Ridge Rentals are incredible. They are truly a southern family full of southern hospitality. The maintenance gentleman, Seth is an angel. The tv would not show a picture, he repaired very quickly. The kitchen had everything to prepare a meal for my family. Our beds were very comfortable. Grandchildren loved bunk beds and hot tub. We called to check out and lady said ""Have a safe trip home and Hope to See Y'all again soon"" We had a wonderful vacation."
2174357,677506,"2020-09-27 03:37:35","Mountain Vista Luxury Rental",http://www.mvlr.com,,"(866) 430-7550","514 Ski Mountain Rd",Gatlinburg,TN,37738,"514 Ski Mountain Rd,Gatlinburg,TN 37738","Vacation Homes Rentals & Sales, Hotels, Rental Service Stores & Yards",,,A+,35.70678,-83.53039,,,,"Mon - Sun: 8:00 am - 6:00 pm","Primary Phone: (865) 430-7550 Phone: (865) 430-7550",,,,,http://www.mvlr.com,,,,,,,,,
2175626,677843,"2020-09-27 03:37:35","Heartland Cabin Rentals",http://www.heartlandrentals.com,accommodationsbyheartlandrentals@msn.com,"(865) 430-9093","745 Powdermill Rd",Gatlinburg,TN,37738,"745 Powdermill Rd,Gatlinburg,TN 37738","Cabins & Chalets, Cottages, Hotels, Lodging, Real Estate Rental Service, Rental Service Stores & Yards, Resorts, Vacation Homes Rentals & Sales",,,A+,35.74515,-83.45779,https://i4.ypcdn.com/blob/7573b39868a6abc0d7cef3067091b9e263da0e2a_100x100_crop.jpg?63f80dd,,"Heartland Rentals has beautiful mountain rentals nestled away in the Gatlinburg Smoky (or Smokey) Mountains of Gatlinburg, Tennessee. We welcome you to come and stay in our beautiful cabins and chalets in Gatlinburg, Tennessee","Mon - Tue: 9:00 am - 6:00 pm Wed: 9:00 am - 5:00 pm Thu - Fri: 9:00 am - 6:00 pm Sat: 9:00 am - 5:00 pm Sun Closed","Office: (800) 836-9541",,"check, debit, mastercard, visa",,,"http://www.heartlandrentals.com http://www.heartlandrentals.net",,,,,,,,,
2176182,677989,"2020-09-27 03:37:35","Hearthside Cabin Rentals",https://www.hearthsidecabinrentals.com,info@hearthsidecabinrentals.com,"(865) 429-0955","702 Wears Valley Rd","Pigeon Forge",TN,37863,"702 Wears Valley Rd,Pigeon Forge,TN 37863","Cabins & Chalets, Cottages, Hotels, Real Estate Rental Service, Rental Service Stores & Yards, Resorts, Vacation Homes Rentals & Sales",,,A+,35.79589,-83.59254,https://i4.ypcdn.com/blob/d7d4f5093f41a7c769d7a1a1c12ec03480690713_100x100_crop.jpg?63f80dd,,"Locally owned and operated, Hearthside Cabin Rentals treats guests like family and offers cabins in Gatlinburg, Pigeon Forge with amenities including jacuzzis, hot tubs, pools and pet access.","Mon - Fri: 9:00 am - 9:00 pm Sat - Sun: 9:00 am - 6:00 pm",,,"amex, visa, discover, mastercard",,,https://www.hearthsidecabinrentals.com,"Parking: Lot Wi-Fi: Free Price Range : Above Average",,,,,,,,