business_x_category.id,business.id,business.ts,business.business_name,business.home_page,business.email_address,business.phone,business.street,business.city,business.state,business.zip_code,business.full_address,business.category,business.rating,business.number_of_reviews,business.bbb_rating_or_license,business.latitude,business.longitude,business.cover_image,business.slogan,business.general_info,business.regular_hours,business.extra_phones,business.services_products,business.payment,business.price_range,business.aka,business.other_links,business.other_information,business.review_1_name,business.review_1_date,business.review_1_rating,business.review_1_text,business.review_2_name,business.review_2_date,business.review_2_rating,business.review_2_text
2468,814,"2020-09-27 02:30:37","Coastal Scapes",,,"(757) 213-3032","1365 Taylor Farm Rd","Virginia Beach",VA,23453,"1365 Taylor Farm Rd,Virginia Beach,VA 23453","Landscape Designers & Consultants, Lawn & Garden Equipment & Supplies, Playground Equipment, Rubber Products-Manufacturers",,,,36.79275,-76.06196,,"""Never Mulch Again""",,"Mon - Fri: 8:00 am - 5:00 pm","MobilePhone: (757) 651-0673",,,,,,,,,,,,,,
5636,1924,"2020-09-27 02:30:39","FOREVERMULCHSYSTEMS, LLC.",http://forevermulchsystems.com,forevermulchsystems@gmail.com,"(330) 298-5423","9724 Crow Rd",Litchfield,OH,44253,"9724 Crow Rd,Litchfield,OH 44253","Landscape Designers & Consultants, Landscape Contractors, Mulches, Playgrounds, Rubber Products-Manufacturers",,,,41.18453,-82.03887,,,,"Mon - Fri: 7:30 am - 8:00 pm Sat: 9:00 am - 5:00 pm Sun: 10:00 am - 2:00 pm",,,"cash, all major credit cards, financing available, insurance, check, paypal",,,"The evolution in landscape technology custom",,,,,,,,,
5777,1973,"2020-09-27 02:30:39","Rainbow Turf Products",http://www.rainbowturfproducts.com,info@rainbowturfproducts.com,"(888) 653-7529","3125 Skyway Cir",Melbourne,FL,32934,"3125 Skyway Cir,Melbourne,FL 32934","Landscape Designers & Consultants, Playground Equipment, Rubber Products, Rubber Products-Manufacturers, Rubber Products-Molded",,,,28.11123,-80.6752,,,,"Mon - Fri: 8:00 am - 5:00 pm","Phone: (321) 775-0600 TollFree: (888) 653-7529",,"check, cash, all major credit cards, financing available",,,"http://www.rainbowturfproducts.com http://www.rubberdesigns.com","Wheelchair Accessible: Yes Parking: Lot",,,,,,,,
16389,6925,"2020-09-27 02:31:05","Prominent Memories",,,"(980) 297-3308","po box 423",Duncan,SC,29334,"po box 423,Duncan,SC 29334","Landscape Designers & Consultants, Modeling Schools, Photography & Videography, Portrait Photographers, Wedding Photography & Videography",,,,34.917645,-82.125824,,,"prominent memories Photography with train photographers we are here to help you with all your needs and portraits","Mon - Sun: 7:00 am - 5:00 pm",,,debit,,,,,,,,,,,,
229363,76598,"2020-09-27 02:36:53","Peace & Love Jewelry By Nancy",,,"(310) 502-7530","519 N Sam Houston Pkwy E",Houston,TX,77060,"519 N Sam Houston Pkwy E,Houston,TX 77060","Jewelry Engravers, Jewelers, Jewelry Buyers, Jewelry Supply Wholesalers & Manufacturers, Landscape Designers & Consultants",,,,29.93903,-95.39232,,,,,,,,,,,,,,,,,,,
348523,114643,"2020-09-27 02:41:15","Schlegel Barkdust",http://www.schlegelbarkdustinc.com,ericsenko17@gmail.com,"(503) 476-3299","2706 SE Tualatin Valley Hwy",Hillsboro,OR,97123,"2706 SE Tualatin Valley Hwy,Hillsboro,OR 97123","Landscape Designers & Consultants, Automation Systems & Equipment, Building Contractors, Concrete Contractors, Crushed Stone, Foundation Contractors, General Contractors, Landscaping & Lawn Services, Manufacturing Engineers, Masonry Contractors, Mechanical Engineers, Mulches, Oil & Gas Exploration & Development, Paper Manufacturers, Paper Products, Patio Builders, Professional Engineers, Sand & Gravel, Stone Natural, Stone Products, Stone-Retail, Topsoil, Wood Products",5,"2 Reviews",A+,45.50354,-122.95514,https://i3.ypcdn.com/blob/bbf839e1c00331243551adc805a9fb5247c5cb23_100x100_crop.jpg?63f80dd,"Always Fresh Barkdust At A Really Great Price, We Deliver Barkdust And Crush Rock To Your Home Or Business","Schlegal Barkdust is located right off of TV HWY, between Beaverton and Hillsboro, right next door to Lowes home improvement. We have been serving our customers for over 10 years with great quality barkdust, crushed Rock sand and gravel. We offer great pricing with all of our products. Schegal Barkdust and rock offers a large variety of Hemlock, Mulch, Fir, and playground bark chips. If you are looking to really spruce up your home or business landscape, stop in and look at the assortment of decorative rock sand and gravel, and drainage crushed rock. We are open to the pubic, landscape design. Call us a call today and Eric will offer free consultation and estimates on your landscaping needs. Ask about our free delivery","Mon - Sat: 9:00 am - 5:00 pm Sun Closed","Phone: (503) 648-5849",,"check, visa, discover, mastercard",,,http://www.schlegelbarkdustinc.com,,"Mike J.",04/09/2013,five,,jaredhelbig,04/23/2010,five,"Fair prices. Great products. Easy to find location right off TV Hwy. .....And they deliver at reasonable rates. I highly recommend Schlegel. Eric is great to work with."
427263,146264,"2020-09-27 02:44:40","MP LAWN MAINTENANCE",,mplawnmaintenance@hotmail.com,"(786) 402-5952",,Miami,FL,33135,"Miami,FL 33135","Landscape Designers & Consultants, Condominiums, Gardeners",,,,,,,,"Complete LandscapingServices, Condominium Maintenance, tree trimming, weeding, edging, garden design, installation & maintenance, fully licensed & insured. Free Estimates. Jardineria Completa, mantenimiento de edificios, casas, apartamentos. Limpieza de terrenos, estimados gratis, buen servicio, precios razonables, licensia y seguro.","Mon - Sat: 7:00 am - 7:00 pm Sun Closed","Phone: (786) 597-3071",,"cash only",,,,,,,,,,,,
457632,157764,"2020-09-27 02:45:38","Blue Oak Landscaping",http://www.blueoaklandscaping.com,ben@blueoaklandscaping.com,"(530) 518-7248","1125 Nord Ave",Chico,CA,95926,"1125 Nord Ave,Chico,CA 95926","Audio-Visual Creative Services, Landscape Contractors, Landscape Designers & Consultants, Landscaping & Lawn Services, Recording Service-Sound & Video",,,,39.73174,-121.86167,,,"Blue Oak Landscaping is a locally owned and operated custom landscaping company that specializes in custom residential projects and custom landscape installations nestled in Northern Californias very own Chico. We concentrate on quality work and cutting edge concepts that transform your home into a peaceful and comforting home, our precision to detail and our highly skilled landscapers make the transformation easy. Blue Oak installs plants, trees, lawns and irrigation, but our passion lies in our ability to install hardscaping (paved areas like walkways or pavers) and other sought after landscape elements. Some of these include: Patios, driveways, entryways and walkways built from Pavers, Travertine, slate and flagstone Decorative walls and retaining walls Water features Outdoor kitchens Patio covers and pergolas Low voltage lighting using computer assisted automation Drainage solutions Fire features Bocce courts Green fences and decorative fencing High end custom maintenance Blue Oak Landscaping is able to deliver the highest quality landscaping products and services through the combined experience of its employees. We own and operate the newest equipment that allows our seasoned landscapers to do extraordinary projects. What makes Blue Oak Landscaping stand out is that our employees take pride in every aspect of the projects theyre working on and personally connect with each client. It is this passion for perfection, unique design and cutting edge concepts that separate our company from the rest. Sit back, relax, let us help you design your next backyard, front yard and beyond! Blue oak landscaping is at the forefront of quality landscaping in Northern California. Our dedication to quality shows through in all aspects of our work, from the design to the execution. By working with you and applying fresh ideas and expertise Blue Oak landscaping will create your perfect outdoor environment. Foresight, experience and technology are the main ingredients in bringing Blue Oak's designs to new levels. While innovation, equipment and attention to detail help bring your dreams to life. Blue Oak Landscaping is a trusted, friendly, reliable and very capable company that has the experience and ability to design and install your landscapes. We take pride in every project we do with a degree of perfection that can rival the best craftsman in the world. Our craftsmanship always exceeds our clients expectations. We specialize in working with the client to execute amazing hardscape and softscape designs. We are an honest company that does what we say we are going to do in a timely manner. We enjoy what we do and it shows in our work and stand behind that work 110%","Mon - Fri: 7:30 am - 4:30 pm",,,,,,http://www.blueoaklandscaping.com,,,,,,,,,
498295,169528,"2020-09-27 02:46:56","Orange County Night Lights Inc.",http://www.ocnightlights.com,ocnightlights@gmail.com,"(714) 875-3591","16027 Brookhurst St Ste 504","Fountain Valley",CA,92708,"16027 Brookhurst St Ste 504,Fountain Valley,CA 92708","Lighting Fixtures, Audio-Visual Repair & Service, Electric Contractors-Commercial & Industrial, Landscape Contractors, Landscape Designers & Consultants, Lighting Contractors",,,,33.72998,-117.95576,https://i2.ypcdn.com/blob/5f484cafa1f3500f4cb0ebc95c34fa81eff88533_100x100_crop.jpg?e66d351,,,,"Phone: (949) 280-1255",,,,,http://www.ocnightlights.com,,,,,,,,,
505667,171677,"2020-09-27 02:47:08","McCord Landscape Architecture PLLC",http://www.mccordla.com,dmccord@mccordla.com,"(585) 218-0300","2129 Five Mile Line Rd",Penfield,NY,14526,"2129 Five Mile Line Rd,Penfield,NY 14526","Audio-Visual Creative Services, Animation Services, Graphic Designers, Landscape Designers & Consultants, Landscaping & Lawn Services",,,,43.12934,-77.47613,,,"Founded by Douglas C. McCord, ASLA in 1992 as McCord Landscape Architecture, McCord Snyder Landscape Architecture, PLLC was formed in 2012. We serve municipalities, institutions, businesses, developers, and other design professionals. Our goal as landscape architects is to provide our clients with the highest quality service and appropriate, cost-effective solutions. Our broad site planning experience will save you dollars by doing it right the first time. Our office is located in Penfield, New York, just east of Rochester.","Mon - Fri: 8:00 am - 5:00 pm","Fax: (585) 218-0372",,,,,http://www.mccordla.com,,,,,,,,,
607579,214711,"2020-09-27 02:51:07","UTS Ink.",,,"(907) 385-2402","1320 Carat Loop","North Pole",AK,99705,"1320 Carat Loop,North Pole,AK 99705","Landscape Designers & Consultants, Advertising Specialties, Graphic Designers, Tattoos",,,,64.78049,-147.36935,,,,,,,,,,,,,,,,,,,
659869,230533,"2020-09-27 02:52:36","Light At The End Of The Road Services",,,"(304) 358-3128","50 Sweeney Pl",Franklin,WV,26807,"50 Sweeney Pl,Franklin,WV 26807","Landscape Designers & Consultants, Caterers, Courier & Delivery Service, Graphic Designers, Masonry Contractors",,,,38.63556,-79.33434,,,,,,,,,,,,,,,,,,,
671764,233612,"2020-09-27 02:52:49","YPMI ENTERPRISE LLC & YPMI MOVING LLC",,,"(303) 482-1508","922 e girard ave",Denver,CO,80231,"922 e girard ave,Denver,CO 80231","Landscape Designers & Consultants, Courier & Delivery Service, Heating Equipment & Systems-Repairing, Moving Services-Labor & Materials, Plumbing Fixtures, Parts & Supplies-Used",,,,39.679325,-104.88432,,"we bring your yard baack to life",,"Mon - Sun: 9:00 am - 5:00 pm",,,"visa, discover, mastercard, all major credit cards",,,,,,,,,,,,
693130,239252,"2020-09-27 02:53:24","BLACK MOUNTAIN LANDSCAPING MICHAEL A. GRECO LANDSCAPING & REPAIR",http://www.facebook.com/deminglandscaping,blkmtnland@yahoo.com,"(575) 694-3877","406 S Platinum ave",Deming,NM,88030,"406 S Platinum ave,Deming,NM 88030","Landscaping & Lawn Services, Artificial Grass, Building Maintenance, Excavation Contractors, Fountains Garden, Display, Etc, Gardeners, Handyman Services, Home Repair & Maintenance, Irrigation Systems & Equipment, Landscape Contractors, Landscape Designers & Consultants, Mobile Home Repair & Service, Parking Lot Maintenance & Marking, Patio Builders, Power Washing, Property Maintenance, Sod & Sodding Service, Tree Service, Welders",,,,32.26565,-107.75568,,,"MICHAEL A. GRECO LANDSCAPING & REPAIR is a full service Landscaping & Home repair service. I take great pride in my work and do not take short cuts. I guarantee all my work against my craftsmanship. Give me a call for a free local estimate!","Mon - Fri: 7:00 am - 5:00 pm Sat: 7:00 am - 3:00 pm Sun Closed New Year's Day 2020/01/01 Closed Emergency Hours Mon - Sun Open 24 Hours Thanksgiving Day 2020/11/26 Closed Christmas Day 2020/12/25 Closed","mike greco: (575) 694-3877",,"debit, check, cash, all major credit cards, travelers checks, visa, mastercard, amex, discover",,"Deming Landscaping",http://www.facebook.com/deminglandscaping,,,,,,,,,
693454,239360,"2020-09-27 02:53:24","GreenWorks, Lawn, Landscape",http://greenworkslawnandtree.com,greenworkslawn@gmail.com,"(502) 780-5368","1030 Morris Ave",Jeffersonville,IN,47130,"1030 Morris Ave,Jeffersonville,IN 47130","Landscaping & Lawn Services, Gardeners, Landscape Designers & Consultants, Lawn Maintenance, Parking Stations & Garages-Construction, Snow Removal Service",,,A+,38.29462,-85.72543,https://i3.ypcdn.com/blob/f908117b471e4e3d58122c6c8a4b1a5c192aab23_100x100_crop.jpg?63f80dd,,"Whether you need tree trimming or removal, Greenworks Lawn and Tree can do it for you. Since 2005, Greenworks Lawn and Tree has delivered outstanding tree services in Jeffersonville. We pride ourselves on always keeping your trees healthy and beautiful. When it comes to tree removal, our dedicated team of professionals will be there to help you as soon as possible. We have the proper equipment, skill, and knowledge to remove any tree of any size without damaging your property or nearby structures. You can count on us to provide quick tree care services in an efficient manner.","Mon - Fri: 8:00 am - 5:00 pm Sat - Sun Closed",,,"master card, visa, amex, cash, check, discover",,,http://greenworkslawnandtree.com,,,,,,,,,
696564,240352,"2020-09-27 02:53:34","All Star Paving & Construction",,gepker42269@gmail.com,"(417) 298-4445","271 E Highway 32","Fair Play",MO,65649,"271 E Highway 32,Fair Play,MO 65649","Driveway Contractors, Asphalt, Asphalt Paving & Sealcoating, Building Contractors-Commercial & Industrial, Concrete Contractors, Home Builders, Landscape Contractors, Landscape Designers & Consultants, Parking Lot Maintenance & Marking, Patio Builders, Pavement & Floor Marking Services, Paving Contractors",,,A,37.63018,-93.58337,https://i3.ypcdn.com/blob/80553229f849c72d46f3dd9f0f2bb365422e23f9_100x100_crop.jpg?63f80dd,,"Paving contractors and seal coating. Concrete work. chip seal. striping. offers military discount(active and retired).","Mon - Sun: Open 24 Hours",,,"cash, check, all major credit cards",,,,,,,,,,,,
698737,241050,"2020-09-27 02:53:42","MICHAEL GRECO LANDSCAPING & REPAIR LLC",http://www.facebook.com/deminglandscaping,mikeydidit1963@gmail.com,"(575) 694-3877","1100 S Diamond ave",Deming,NM,88030,"1100 S Diamond ave,Deming,NM 88030","Landscaping & Lawn Services, Artificial Grass, Building Maintenance, Excavation Contractors, Fountains Garden, Display, Etc, Gardeners, Handyman Services, Home Repair & Maintenance, Irrigation Systems & Equipment, Landscape Contractors, Landscape Designers & Consultants, Mobile Home Repair & Service, Parking Lot Maintenance & Marking, Patio Builders, Power Washing, Property Maintenance, Sod & Sodding Service, Tree Service, Welders",,,,32.25812,-107.75374,,"You have tried the rest, Now try the best!","MICHAEL A. GRECO LANDSCAPING & REPAIR is a full service Landscaping & Home repair service. I take great pride in my work and do not take short cuts. I guarantee all my work against my craftsmanship. Give me a call for a free local estimate!","Mon - Fri: 7:00 am - 5:00 pm Sat: 7:00 am - 3:00 pm Sun Closed Emergency Hours Mon - Sun Open 24 Hours New Year's Day 2020/01/01 Closed Thanksgiving Day 2020/11/26 Closed Christmas Day 2020/12/25 Closed","mike greco: (575) 694-3877",,"debit, check, cash, all major credit cards, travelers checks, visa, mastercard, amex, discover",,,http://www.facebook.com/deminglandscaping,,,,,,,,,
701790,241970,"2020-09-27 02:53:42","Accusweep Services",http://www.accusweep.com,accusweep@aol.com,"(803) 782-2900","1314 Pulaski St",Columbia,SC,29201,"1314 Pulaski St,Columbia,SC 29201","Sweeping Service-Power, Asphalt Paving & Sealcoating, Landscape Contractors, Landscape Designers & Consultants, Parking Lots & Garages, Paving Contractors, Sweepers-Power",,,,34.00027,-81.04391,,,,"Mon - Fri: 9:00 am - 5:00 pm",,,,,,http://www.accusweep.com,,,,,,,,,
706714,243464,"2020-09-27 02:53:52","Groundhogs Landscaping & Excav",https://www.groundhogsak.com,groundhogsllc@gmail.com,"(907) 474-4647","3670 Worrell Ave",Fairbanks,AK,99709,"3670 Worrell Ave,Fairbanks,AK 99709","General Contractors, Building Construction Consultants, Building Contractors, Building Specialties, Concrete Contractors, Excavation Contractors, Landscape Contractors, Landscape Designers & Consultants, Parking Stations & Garages-Construction, Septic Tanks & Systems, Sewer Contractors, Siding Contractors, Utility Contractors",,,,64.80974,-147.78357,,,,"Mon - Fri: 9:00 am - 5:00 pm",,,"cash, check, debit, master card, visa",,"Groundhogs Llc Groundhogs General Contractor","https://www.groundhogsak.com http://groundhogsak.com","Specialties: Decks, Cabinetry, Walkways, Cabinets, Bathrooms, Garages, Culverts, Kitchens, Sidewalks Services: Septic Tank Cleaning, Septic Tanks, Lawn Maintenance",,,,,,,,
708369,244024,"2020-09-27 02:54:01","Outdoor Innovations",http://www.omahacommercialservices.com,omahalandscapedesign@gmail.com,"(402) 290-2181","909 S 68th St",Omaha,NE,68106,"909 S 68th St,Omaha,NE 68106","Landscape Designers & Consultants, Graffiti Removal & Protection, Parking Lot Maintenance & Marking, Power Washing, Snow Removal Service",5,"1 Review",,41.25099,-96.01762,,,"We offer commercial services which include grease removal, line striping, parking lot sweeping, snow removal, graffiti removal, ice dam removal, lanscaping. We focus on quality work and eco friendly solutions for Omaha and the surrounding area.","Mon - Fri: 8:00 am - 6:00 pm","MobilePhone: (402) 957-2181",,"debit, check, paypal, cash, all major credit cards",,,"Commercial Services Landscaping",,nancy.cote.144,10/05/2012,five,"Outdoor Innovations recently completed a retaining wall and rebuilding the steps and cap on our front porch. My husband and I could not be happier with the results. Joe and his team were very professional, friendly and courteous. When we had questions or concerns they were addressed in a timely and complete manner. Joe always took to the time to make sure that all of our worries were laid to rest. I have already referred a friend that was equally happy with her results and would not hesitate to recommend Outdoor Innovations to friends and family. I will call Outdoor Innovations in the future for all my landscaping needs.",,,,
710412,244646,"2020-09-27 02:54:01","RB Paving & Landscape",http://beltranpavingandlandscape.com,ruben271@verizon.net,"(760) 947-4191","7965 Hemlock Ave",Hesperia,CA,92345,"7965 Hemlock Ave,Hesperia,CA 92345","Asphalt Paving & Sealcoating, Building Contractors, Cement, Concrete Contractors, General Contractors, Landscape Contractors, Landscape Designers & Consultants, Landscaping & Lawn Services, Masonry Contractors-Commercial & Industrial, Parking Lot Maintenance & Marking, Parking Stations & Garages-Construction, Paving Contractors, Sealers Asphalt, Concrete, Etc.",,,,34.39521,-117.34466,,"NO JOB TOO BIG OR TOO SMALL",,"Mon - Sat: 8:00 am - 5:00 pm Sun Closed",,,"amex, cash, check, mastercard, discover, visa",,,http://beltranpavingandlandscape.com,,,,,,,,,
721834,248306,"2020-09-27 02:54:28","Designs For ShadeВ®",https://www.designsforshade.com,info@designsforshade.com,"(949) 243-7814","27762 Antonio Pkwy","Ladera Ranch",CA,92694,"27762 Antonio Pkwy,Ladera Ranch,CA 92694","Awnings & Canopies, Awnings & Canopies-Repair & Service, Landscape Designers & Consultants, Parking Facilities-Equipment & Supplies",,,,33.56024,-117.62976,https://i3.ypcdn.com/blob/03b7d3a78aab9358d51d3995afb76551650c0b03_100x100_crop.jpg?63f80dd,"Quality Shade Structures from the Team Who Care's!","If youre looking for high quality permanent fabric shade structures for a hotel, restaurant, residential, assisted living community, or car wash, you've come to the right place. Fabric shade structures & canopies are ideal for covered entrances & walkways, hotel swimming pools, covered vehicle parking lots, residential driveways, backyards, patios, playgrounds, covered restaurant dining areas, common spaces, assisted living courtyards & waiting areas, and anything else under the sun.","Mon - Fri: 8:00 am - 7:00 pm Sat - Sun: 8:00 am - 5:00 pm","Toll-Free: (800) 245-2082",,"check, mastercard, amex, discover, visa, paypal, all major credit cards",,,"Fabric Shade Structures and Shade Canopies for hotels, restaurants,private/commercial residentail, assisted living, & car washes Pinterest Google+",,,,,,,,,
722670,248581,"2020-09-27 02:54:28","Seghetto & Sons",,,"(781) 500-1200",,,,,,"Landscape Designers & Consultants, Asphalt Paving & Sealcoating, Basement Contractors, Driveway Contractors, Parking Lot Maintenance & Marking",,,,,,,"Commercial & Residential Free Estimates","Asphalt drive-ways, retaining walls, patios, walkways, concrete patios & stonewalls.",,,,check,,,,,,,,,,,,
723740,248863,"2020-09-27 02:54:28","Bruce's Sweeping LLC",,,"(517) 712-4730","2732 E Saint Joe Hwy","Grand Ledge",MI,48837,"2732 E Saint Joe Hwy,Grand Ledge,MI 48837","Parking Lot Maintenance & Marking, Cleaning Contractors, Landscape Contractors, Landscape Designers & Consultants, Lawn Maintenance, Parking Stations & Garages-Construction, Snow Removal Service, Sweepers-Power, Sweeping Service-Power",,,,42.72631,-84.784,,,"We offer free estimates: * Sweeping Service * Lawn Care * Snow Plowing * Over 20 Years Experience * Call Now to Schedule an estimate * Hours by Appointment AMENITY We Come to You! Free Estimates",,,,check,,,,,,,,,,,,
724491,249132,"2020-09-27 02:54:32","Porter's Parking Area Maintenance",,,"(800) 543-1681","1108 Loft Cv",Evansville,IN,47715,"1108 Loft Cv,Evansville,IN 47715","Parking Lots & Garages, Cleaning Contractors, House Cleaning, Landscape Designers & Consultants, Landscaping & Lawn Services, Parking Lot Maintenance & Marking, Parking Stations & Garages-Construction, Sweeping Service-Power",,,A+,37.98681,-87.48775,,"""We Strive For Perrrrfection""",,,,,,,,,,,,,,,,,
724504,249135,"2020-09-27 02:54:32","Happy Lots Asphalt",http://happylotsasphalt.com,happylotsasphalt@yahoo.com,"(636) 395-3097",,Hazelwood,MO,63042,"Hazelwood,MO 63042","Asphalt Paving & Sealcoating, General Contractors, Landscape Designers & Consultants, Masonry Contractors, Parking Lot Maintenance & Marking, Paving Contractors",,,,,,,,,,"Snow plow services,Lawn maintenance,Tree trimming,Shrub trimming,Tree installations,Shrub installations,Retaining walls,Parking curb installation,Sealing,Complete stencil work: (636) 395-3097",,,,,http://happylotsasphalt.com,,,,,,,,,