business_x_category.id,business.id,business.ts,business.business_name,business.home_page,business.email_address,business.phone,business.street,business.city,business.state,business.zip_code,business.full_address,business.category,business.rating,business.number_of_reviews,business.bbb_rating_or_license,business.latitude,business.longitude,business.cover_image,business.slogan,business.general_info,business.regular_hours,business.extra_phones,business.services_products,business.payment,business.price_range,business.aka,business.other_links,business.other_information,business.review_1_name,business.review_1_date,business.review_1_rating,business.review_1_text,business.review_2_name,business.review_2_date,business.review_2_rating,business.review_2_text
4054154,1293147,"2020-09-27 04:35:31","Handy Home Services",,,"(425) 791-9930","14815 80th Ave SE",Snohomish,WA,98296,"14815 80th Ave SE,Snohomish,WA 98296","Handyman Services, Home Repair & Maintenance, Landscaping & Lawn Services, Organizing Services-Household & Business",,,,47.8627,-122.12506,,,,,,,,,,,,,,,,,,,
4056938,1293941,"2020-09-27 04:35:31","MoranCan Do It All Handyman Service",http://morancan.weebly.com,bmoran@tampabay.rr.com,"(727) 420-0254",,,,,,"Handyman Services, Home Improvements, Landscaping & Lawn Services, Organizing Services-Household & Business, Power Washing",,,,,,,,,,,,,,MoranCan,http://morancan.weebly.com,,,,,,,,,
4063553,1295899,"2020-09-27 04:35:51","The Magic Handyman",,themagichandyman@gmail.com,"(860) 212-9331","15 rosemary place",manchester,CT,06040,"15 rosemary place,manchester,CT 06040","Handyman Services, General Contractors, Organizing Services-Household & Business, Painting Contractors, Property Maintenance",,,,41.7741,-72.52803,https://i1.ypcdn.com/blob/5b6364792482f174b16fb77639e7d341f2077053_100x100_crop.jpg?adceb05,,,"Mon - Fri: 8:00 am - 9:00 pm Sat - Sun: 9:00 am - 9:00 pm",,,check,,,,,,,,,,,,
4071363,1298210,"2020-09-27 04:36:13","CM Organizing Plus",http://www.cmorganizing.citymax.com,clyde_64@msn.com,"(909) 496-3576",,Highland,CA,92346,"Highland,CA 92346","Handyman Services, Home Improvements, Interior Designers & Decorators, Organizing Services-Household & Business",,,,,,,"We Can Do That!",,"Mon - Fri: 9:00 am - 7:00 pm Sat: 9:00 am - 9:00 pm Sun Closed","MobilePhone: (909) 496-3766",,,,,"Organizing and Handy Man Services",,,,,,,,,
4073846,1298921,"2020-09-27 04:36:13","Earley & Sons Relocation,LLC.",http://www.earleyandsons.com,info@earleyandsons.com,"(330) 501-7004","7100 Lockwood Blvd PMB 313",Boardman,OH,44512,"7100 Lockwood Blvd PMB 313,Boardman,OH 44512","Handyman Services, Lawn Maintenance, Organizing Services-Household & Business, Relocation Service",,,,41.02683,-80.70986,,,,"Mon - Fri: 9:00 am - 5:00 pm Sat - Sun Closed","MobilePhone: (330) 501-7004",,"debit, check, all major credit cards",,,http://www.earleyandsons.com,,,,,,,,,
4082266,1301112,"2020-09-27 04:36:34","Clutter Cutters",http://www.clutter-cutters.us,babydoll070911@yahoo.com,"(563) 929-6917","821 E Howard ST",Manchester,IA,52057,"821 E Howard ST,Manchester,IA 52057","Handyman Services, Estate Appraisal & Sales, House Cleaning, Moving Services-Labor & Materials, Organizing Services-Household & Business",,,,42.48651,-91.44703,,"""Reduce the stress, get rid of the mess. We get it done!""","Clutter Cutters is a local Iowa family owned business that can help make your life easier! We can help you with cleaning, packing/unpacking for moves, de-cluttering/organzation, inventory, sorting, & packing estates, and even handyman jobs & interior painting. We are experienced and thorough, and are licensed and insured. Call us today to find out what we can get done for you at a very reasonable price! Read customer comments on our website www.clutter-cutters.us or call us at (563) 927-4642.","Sat: 9:00 am - 6:00 pm Sun Closed",,,"check, cash",,,"Clutter Cutters website","Parking: Self",,,,,,,,
4087200,1302459,"2020-09-27 04:36:40","Skete's Maid & Maintenance Services",,sketesmms@yahoo.com,"(386) 478-8457",,,,,,"Handyman Services, Home Repair & Maintenance, Maid & Butler Services, Organizing Services-Household & Business, Property Maintenance",,,,,,,"We have your maid and maintenance needs covered.","Typical cleaning includes vacuuming, dusting, scrubbing sinks, floors, countertops, loading dishwasher, and range hoods. In addition to these services, SketeВ’s Maid and Maintenance will provide a free home inspection and estimates for routine home maintenance issues such as, air condition filter replacement, sink washer replacement, check mechanical appliance operations, and ceiling fan blade tightening. The home inspection will include a list of everything that needs doing. This saves you time and money by having all your home service needs done at one time rather than individual projects. It is cheaper to hire a handyman instead of a licensed specialist for these small projects.",,,,"no credit cards",,"Skete's Maid and Maintenance Services",,,,,,,,,,
4093020,1303978,"2020-09-27 04:36:47","Northern Property Management, LLC",,Jeff@npmvt.com,"(802) 782-4159","720 Buck Hollow Rd",Fairfax,VT,05454,"720 Buck Hollow Rd,Fairfax,VT 05454","Handyman Services, Association Management, Building Contractors, Building Maintenance, Cleaning Contractors, Clearing Houses, Concierge Services, Construction Consultants, Deck Cleaning & Treatment, Deodorizing & Disinfecting, Home Repair & Maintenance, Lawn Maintenance, Maid & Butler Services, Organizing Services-Household & Business, Personal Shopping Service, Pressure Washing Equipment & Services, Property Maintenance, Real Estate Management, Wall Cleaning",,,,44.71813,-72.99842,https://i1.ypcdn.com/blob/356c5787054b4692f9eb2489c4edb59b51be50b6_100x100_crop.jpg?adceb05,"Our mission is to meet each property's individual requirements, provide exceptional service to its residents and owners, and maintain and enhance its value. In the process of completing our mission, we are sensitive to the fact that where and how people live is an emotionally powerful and complex issue. We also understand the necessity of balancing the Board of Director's objectives, as a client, with those of the individual resident/owners & the community in which you live. Northern Property Management provides a full range of commercial and residential property management services to Vermont property owners, condominium owners and associations. By utilizing our rental experience, property maintenance expertise and financial proficiency we proactively address our clientsВ’ needs and manage their assets with the care that each requires and deserves. Maintenance services, property management services and financial management can be combined into one comprehensive property management package or Northern Property Management can tailor a unique management package that meets the needs of your unique property. We are a full scale Property Management Company with a hometown touch.",,"Mon - Sun: Open 24 Hours","Kelly Crawford: (802) 782-4159 Jeff Clokey: (802) 782-4833",,check,,,,,,,,,,,,
4099116,1305544,"2020-09-27 04:37:00","Sunshine MistyMaid Services",,,"(786) 800-1327","150 NE 104th St","Miami Shores",FL,33138,"150 NE 104th St,Miami Shores,FL 33138","Handyman Services, House Cleaning, Janitorial Service, Maid & Butler Services, Organizing Services-Household & Business",,,,25.87051,-80.19425,,,,"Mon - Fri: Open 24 Hours",,,"cash only",,,,,,,,,,,,
4102958,1306519,"2020-09-27 04:37:05","Amy's Home Improvements",http://www.amyshomeimprovements.com,,"(262) 515-7283","Kenosha,53142",Kenosha,WI,53142,"Kenosha,53142,Kenosha,WI 53142","Deck Builders, Cabinet Makers, Cabinets-Refinishing, Refacing & Resurfacing, Furniture Designers & Custom Builders, Furniture Repair & Refinish, Furniture-Unfinished, Garage Cabinets & Organizers, Handyman Services, Kitchen Cabinets-Refinishing, Refacing & Resurfacing, Organizing Services-Household & Business, Patio & Outdoor Furniture",,,,42.57441,-87.85873,https://i1.ypcdn.com/blob/b71de4f0608291cfd6cfbc693a8d17878a5b7d33_100x100_crop.jpg?adceb05,,,"Mon - Sat: 8:00 am - 7:00 pm Sun Closed",,,,,,"Custom Wood Working",,,,,,,,,
4107661,1307696,"2020-09-27 04:37:06","WOW Pro Services",http://www.wowproservices.com,wowproservices@gmail.com,"(386) 748-4835",,Deland,FL,32724,"Deland,FL 32724","Handyman Services, Lawn Maintenance, Organizing Services-Household & Business, Power Washing",5,"1 Review",,,,,,,"Mon - Fri: 8:00 am - 6:00 pm Sat: 10:00 am - 5:00 pm Sun: 11:00 am - 4:00 pm","MobilePhone: (203) 616-0549",,,,,http://www.wowproservices.com,,theman32724,01/26/2011,five,"I needed a few small things done around the house and some yard work. I called them and they came out and took care of it. Very professional and great service. Would recomend them to anyone.",,,,
4108804,1308017,"2020-09-27 04:37:07","Turkey feathers cleaning LLC",,,"(509) 876-6029","735 Spears Ave se",Salem,OR,97302,"735 Spears Ave se,Salem,OR 97302","Janitorial Service, Handyman Services, House Cleaning, Moving Services-Labor & Materials, Organizing Services-Household & Business",,,,44.90098,-123.03739,,,"Property Preservation Move- ins/ Move-outs Interior Cleaning Window Cleaning Offices Garages Debris Removal Carpet Cleaning",,,,,,,,,,,,,,,,
4109287,1308141,"2020-09-27 04:37:07","Accent Painting",,mikejack163@gmail.com,"(812) 320-1141",,Bloomington,IN,47404,"Bloomington,IN 47404","Handyman Services, Bathroom Remodeling, Closets Designing & Remodeling, Home Improvements, Organizing Services-Household & Business, Painting Contractors, Wood Finishing",,,,,,,,,,,,"all major credit cards, check, debit",,,,,,,,,,,,
4109466,1308186,"2020-09-27 04:37:07","Hire the Handyman",,,"(770) 366-8224","5174 Legendary Tarn",Acworth,GA,30102,"5174 Legendary Tarn,Acworth,GA 30102","Handyman Services, Home Improvements, Home Repair & Maintenance, Organizing Services-Household & Business",,,,34.07751,-84.56888,,,,"Mon - Sat: 9:00 am - 5:00 pm Sun Closed","Cell Phone: (770) 366-8224",,check,,,,,,,,,,,,
4114975,1309627,"2020-09-27 04:37:11","Verrazano Home Services",,verrazanohomeservices@yahoo.com,"(248) 520-0452",,"Rochester Hills",MI,48309,"Rochester Hills,MI 48309","Handyman Services, Home Improvements, Organizing Services-Household & Business, Personal Shopping Service",,,,,,,"Errands and Concierge Services","Family-oriented and trustworthy local company.","Mon: 8:00 am - 5:30 pm Tue: 8:00 am - 8:00 pm Wed: 8:00 am - 5:30 pm Thu: 8:00 am - 8:00 pm Fri: 8:00 am - 5:30 pm Sat: 10:30 am - 3:00 pm Sun Closed",,,"check, paypal",,,,,,,,,,,,
4125240,1312263,"2020-09-27 04:37:19","Gots2Go, Garage Cleaning, De-cluttering and painting",,,"(817) 210-7581","Knowles Drive",Saginaw,TX,76179,"Knowles Drive,Saginaw,TX 76179","Handyman Services, Cleaning Contractors, Organizing Services-Household & Business, Painting Contractors, Pressure Washing Equipment & Services",,,,32.868587,-97.38521,,"Garage de-cluttering, cleaning & painting experts.","(817) 210-7581 De-cluttering And Cleaning Gutter Cleaning Moving Services Power Washing Residential and Commercial Painting ** Serving Fort Worth And The Following Areas... * Saginaw * Azle * Blue Mound * Haslet *Lake Worth * Samson Park * River Oaks * Haltom City * White Settlement *NAS JRB *North Richland Hills","Mon - Fri: 7:30 am - 5:00 pm",,,"all major credit cards",,,,,,,,,,,,
4126672,1312622,"2020-09-27 04:37:19","Gackle's Home Services",,gackles@outlook.com,"(970) 631-7582","2522 Cedar Dr",Loveland,CO,80538,"2522 Cedar Dr,Loveland,CO 80538","Handyman Services, Home Repair & Maintenance, House Cleaning, Landscaping & Lawn Services, Organizing Services-Household & Business",,,,40.41915,-105.07443,,,,"Mon - Fri: 9:00 am - 5:00 pm Sat - Sun Closed",,,check,,,,,,,,,,,,
4128817,1313182,"2020-09-27 04:37:20","BRANDON'S CUSTOM SERVICES, LLC",,,"(724) 331-9089","346 Highlands Drive",Hampstead,NC,28443,"346 Highlands Drive,Hampstead,NC 28443","Handyman Services, Concrete Restoration, Sealing & Cleaning, General Contractors, Landscape Contractors, Organizing Services-Household & Business",,,,34.40553,-77.70638,,,,"Mon - Sat: 8:00 am - 6:00 pm Sun: Open 24 Hours",,,,,,,,,,,,,,,
4130464,1313634,"2020-09-27 04:37:20","Traverse City Residential Care LLC",http://www.tcrcare.com,tcrcare@yahoo.com,"(231) 313-9633","176 Island View Dr","Traverse City",MI,49696,"176 Island View Dr,Traverse City,MI 49696","Building Cleaners-Interior, Building Contractors, Cleaning Contractors, Crime & Trauma Scene Clean Up, Handyman Services, Home Health Services, House Cleaning, Organizing Services-Household & Business, Personal Services & Assistants",5,"3 Reviews",,44.68596,-85.44757,,"The most affordable, licensed, professional care in North-West Michigan! "" Guaranteed ""","Our team of professinals proudly help with the best in care at the most affordable rate. Anything to help you live where you deserve to live. ( in your home) We are a team of commpassinate aids, ready and wanting to help make a diffrence in your life.","Mon - Sun: 7:00 am - 7:00 pm",,,"check, insurance, cash",,"tcrcare T.C. Residential Care","In home care and home clean out","By Appointment Only: Yes Services: Handyman","Sue S.",04/24/2016,five,"I will use them again and will recommend to all my friends and family. Thanks for the great service!",shirls51,04/23/2014,five,"Wonderful people, would recommend to anyone!"
4138179,1315354,"2020-09-27 04:37:31","Select Closets & Carpentry",http://selectclosets.com,Sales@selectclosets.com,"(888) 319-1119",,fairfield,CT,06824,"fairfield,CT 06824","Closets & Accessories, Carpenters, Closets Designing & Remodeling, Millwork, Organizing Services-Household & Business",,,A+,,,https://i2.ypcdn.com/blob/6bc361ff74a4ea273514600b8145aabeef1f9138_100x100_crop.jpg?8ad0f92,"We Build Space",,"Mon - Fri: 8:00 am - 6:00 pm Sat: 8:30 am - 5:00 pm Sun Closed","Phone: (203) 216-0991",,"visa, master card, check, cash",,,"Custom closets, pantries, garages","Services: Design and installation of custom closets, pantries, laundries, home office &amp. garages. &nbsp.Sales and installation of storage and organizing products. And&nbsp.installation of cabinets, doors, drawers, crown molding, base molding, window and door casings, and hardware.",,,,,,,,
4199525,1329509,"2020-09-27 04:38:56","Drake Remodeling LLC",http://drakeremodeling.com,Order@Drakeremodeling.com,"(908) 806-0111",,Flemington,NJ,08822,"Flemington,NJ 08822","Cabinets-Refinishing, Refacing & Resurfacing, Cabinet Makers, Carpenters, Counter Tops, Organizing Services-Household & Business",,,,,,https://i2.ypcdn.com/blob/a3f8c654581ca70e931ec4f6788e04dedd478b4f_100x100_crop.jpg?8ad0f92,,"Hire a local craftsman to redo your kitchen. All Wood Cabinet Refacing, Kitchen Remodeling, Granite Countertops, and Kitchen Cabinet Organization. Improve the look and functionality of your kitchen in 3-6 days!",,,,"visa, discover, mastercard, all major credit cards, check",,,http://drakeremodeling.com,"Services: Kitchen Remodeling",,,,,,,,
4207886,1331498,"2020-09-27 04:39:04","DO Home Improvement",,,"(865) 659-7458","Knoxville Local",Knoxville,TN,37918,"Knoxville Local,Knoxville,TN 37918","Computer Cable & Wire Installation, Carpenters, Home Improvements, Organizing Services-Household & Business, Painting Contractors",,,,35.96064,-83.92074,,,"Home Exterior Services: Exterior Home & Trim Painting Door Hanging / Repairs / Storm & Screen Doors Window Replacement Gutter Repairs & Cleaning Shutters Deck Repair Winterizing: (Insulation, Windows, Doors, Pipes) Lawn Tasks: (mowing, weed-eating, trimming, leaf blowing) Garage Organization & More Home Interior Services: Interior Wall & Trim Painting Door Hanging / Repairs Trim Carpentry Work Window Treatment Installation Door Knob & Lock Installation Shelf Erection Support / Grab rail Installation Insulation Installing Drywall Doorbell Installation & More Home Wiring Services: New / Replacement Wiring for Home Services Flat Screen TV Installation: (mounting & wiring all services) Computer Hook-up: (Wireless router installation) Entertainment Center / Theater Sound Hook-up Sound, Video, Electrical, Voice, Data, & HDMI Wiring & More","Mon - Fri: 8:00 am - 5:00 pm Sat: 8:00 am - 2:00 pm Sun Closed",,,,,,,,,,,,,,,
4241758,1339109,"2020-09-27 04:39:42","Sierra Nevada Cabinets & Closets",http://www.sncabinetsandclosets.com,,"(775) 232-8952","625 Spice Islands Dr Ste E",Sparks,NV,89431,"625 Spice Islands Dr Ste E,Sparks,NV 89431","Cabinets, Cabinet Makers, Cabinets-Wholesale & Manufacturers, Carpenters, Closets & Accessories, General Contractors, Kitchen Cabinets & Equipment-Household, Organizing Services-Household & Business",,,,39.51735,-119.73779,,,,"Mon - Thu: 9:00 am - 4:30 pm Fri: 9:00 am - 5:00 pm",,,,,,http://www.sncabinetsandclosets.com,"Services: EstimatesFree EstimatesGaragesWall Beds",,,,,,,,
4262511,1343445,"2020-09-27 04:40:05","Closets By Design - Reno",,Reno@closetsbydesign.com,"(775) 828-1900","1375 Greg St Ste 101",Sparks,NV,89431,"1375 Greg St Ste 101,Sparks,NV 89431","Carpenters, Altering & Remodeling Contractors, Bathroom Fixtures, Cabinets & Accessories, Building Contractors, Cabinet Makers, Cabinets, Cabinets-Wholesale & Manufacturers, Closets & Accessories, Closets Designing & Remodeling, Display Fixtures & Materials, Furniture Designers & Custom Builders, Furniture Stores, Garage Cabinets & Organizers, Garment Racks, General Contractors, Home Improvements, Home Repair & Maintenance, Interior Designers & Decorators, Organizing Services-Household & Business, Racks, Shelving, Shelving-Wholesale & Manufacturers, Store Fixtures",,,A+,39.52126,-119.72014,https://sapi.everyscape.com/XmlApi/Image.svc/Images/VSTHUMB/VS19115661_W287_H93,"Imagine Your Home Totally Organized!","At Closets by Design we work to simplify your life. We design, build and install custom closets, garage cabinets, home offices, laundries, pantries, wardrobe mirror doors and much more. With a wide selection of finishes, accessories and hardware, you will get the customized look you have always dreamt of.","Mon - Fri: 9:00 am - 5:00 pm",,,"amex, discover, visa, mastercard",,"Closets By Design-Reno",,"Services: Closet Design & Remodeling",,,,,,,,
4517203,1402373,"2020-09-27 04:46:01","Progressive Veterinary Management",,,"(858) 279-6553","2331 Cardinal Dr","San Diego",CA,92123,"2331 Cardinal Dr,San Diego,CA 92123","Organizing Services-Household & Business",,,,32.78647,-117.15695,,,,,,,,,"Progressive Veterinary Mgmt",,,,,,,,,,
4526464,1405521,"2020-09-27 04:46:12","Blinded Veterans Association - Rio Grande Regional Group",,,"(877) 629-0545","4905 Round Rock Dr","El Paso",TX,79924,"4905 Round Rock Dr,El Paso,TX 79924","Business Coaches & Consultants, Organizing Services-Household & Business",,,,31.9225,-106.43153,,,,,,,,,,,,,,,,,,,
4530862,1406980,"2020-09-27 04:46:14","Ms Miller Veterinary Mgmt PC",,,"(810) 694-1140","24655 Malibu Ct",Fenton,MI,48430,"24655 Malibu Ct,Fenton,MI 48430","Organizing Services-Household & Business",,,,42.7851,-83.72935,,,,,,,,,"Ms Miller Veterinary Management Pc",,,,,,,,,,
4533731,1407923,"2020-09-27 04:46:15","Veteran Memorial Building",,,"(337) 369-9156","500 Bayou Dr Ext","New Iberia",LA,70563,"500 Bayou Dr Ext,New Iberia,LA 70563","Organizing Services-Household & Business",,,,30.022,-91.778,,,,,,,,,,,,,,,,,,,
4586424,1421260,"2020-09-27 04:47:50","FINEST PILLOWS",,kathrynkidd@yahoo.com,"(818) 331-5076","801 S Glenoaks Blvd",Burbank,CA,91502,"801 S Glenoaks Blvd,Burbank,CA 91502","Hotel & Motel Consultants, Beauty Supplies & Equipment, Chiropractors & Chiropractic Services, Organizing Services-Household & Business, Pillows",,,,34.17785,-118.29947,,"TALALAY LATEX PILLOWS","TALALAY LATEX PILLOWS ARE ORGANIC AND MADE FROM RUBBER TREES THEY ARE THE BEST FOR YOUR HEALTH AND BEAUTY.","Mon - Fri: 9:00 am - 5:00 pm Sat - Sun Closed","Phone: (818) 845-3030 Fax: (818) 845-7915",,,,,,,,,,,,,,
4680076,1443855,"2020-09-27 04:50:07","ASPIRE Bootcamps",,,"(480) 320-9493",,Gilbert,AZ,85295,"Gilbert,AZ 85295","Training Consultants, Business & Personal Coaches, Educational Consultants, Organizing Services-Household & Business, Personal Fitness Trainers",,,,,,,"Check out our website and/or email us! We want to know what you ASPIRE for!",,"Mon - Sun: Open 24 Hours",,,"check, no credit cards",,,,,,,,,,,,
4683275,1445019,"2020-09-27 04:50:18","Immaculate Unicorn - Home Assistant Services, LLC.",http://www.immaculateunicorn.com,Immaculateunicorn@gmail.com,"(254) 855-5821","700 Lavaca St STE 1401",Austin,TX,78701,"700 Lavaca St STE 1401,Austin,TX 78701","Cleaning Contractors, Lawn Maintenance, Organizing Services-Household & Business, Personal Chefs, Personal Fitness Trainers",,,,30.27034,-97.74521,https://i2.ypcdn.com/blob/bff5f372418553c42518449613cf39d522d50651_100x100_crop.jpg?8297822,"""Excellent Housekeeping, and so much Extra!""",,"Mon - Sun: 9:00 am - 9:00 pm",,,"cash, invoicing available",,,http://www.immaculateunicorn.com,,,,,,,,,
4708723,1454377,"2020-09-27 04:51:18","Entrepreneurs Invoice",http://simdif.com,projectingmngmt@gmail.com,"(323) 852-2079",,,,,,"Temporary Employment Agencies, Automobile Upholstery Cleaning, Business & Personal Coaches, Cleaning Contractors, Mattresses-Renovating, Organizing Services-Household & Business, Personal Development, Personal Fitness Trainers, Steam Cleaning, Trash Containers & Dumpsters",,,,,,,,,,,,,,,primary,,,,,,,,,
4737835,1465217,"2020-09-27 04:52:14","Johnson Business Associates Inc",,me@7LoveJohnson.com,"(470) 315-2311","990 Peachtree Industrial Blvd Unit 1103",Suwanee,GA,30024,"990 Peachtree Industrial Blvd Unit 1103,Suwanee,GA 30024","Health & Fitness Program Consultants, Business & Personal Coaches, Organizing Services-Household & Business, Personal Fitness Trainers, Personal Services & Assistants",,,,34.05254,-84.08791,,"""Sharing Wealth Through Health and Wellness""","We are here to make your natural experience painless as possible while bringing great insight to the table because, as we have come to learn. Natural living can be difficult but Ive found choosing the finest associate and responsible, caring consultants should not be. Bringing your vision to life is JBAI ultimate goal so, enjoy the journey and remember we do take pride in our work as your private liaison. There is no middle men/women here, we are your direct source to better living. We design, engineer and deliver direct as your associate in organic and natural living.","Mon - Sun: Open 24 Hours","office transferred after hours: (470) 315-2311",,"visa, master card, amex, discover, paypal, debit, check, cash, financing available, insurance",,,,,,,,,,,,
4738135,1465323,"2020-09-27 04:52:14",room2improve,http://www.room2improve.us,vicki@room2improve.us,"(617) 610-9551",,"Newton Upper Falls",MA,02464,"Newton Upper Falls,MA 02464","Health & Fitness Program Consultants, Organizing Services-Household & Business, Personal Fitness Trainers, Stress Management & Prevention",,,,,,,,,,,,,,,http://www.room2improve.us,,,,,,,,,