business_x_category.id,business.id,business.ts,business.business_name,business.home_page,business.email_address,business.phone,business.street,business.city,business.state,business.zip_code,business.full_address,business.category,business.rating,business.number_of_reviews,business.bbb_rating_or_license,business.latitude,business.longitude,business.cover_image,business.slogan,business.general_info,business.regular_hours,business.extra_phones,business.services_products,business.payment,business.price_range,business.aka,business.other_links,business.other_information,business.review_1_name,business.review_1_date,business.review_1_rating,business.review_1_text,business.review_2_name,business.review_2_date,business.review_2_rating,business.review_2_text
265008,87009,"2020-09-27 02:38:24","Elegant Royale",,cs@elegantroyale.com,"(800) 403-7797",,Tampa,FL,33646,"Tampa,FL 33646","Bridal Shops, Gift Shops, Invitations & Announcements, Stationery Stores, Wedding Supplies & Services",,,,,,,,,"Mon - Fri: 10:00 am - 5:00 pm Sat - Sun Closed","Customer Service: (800) 403-7797",,"all major credit cards, paypal",,,,,,,,,,,,
265652,87209,"2020-09-27 02:38:24","Lilah's Invitations",,,"(323) 497-3240",,,,,,"Invitations & Announcements, Bridal Shops, Party Favors, Supplies & Services, Stationery Stores, Wedding Supplies & Services",,,,,,,,"Affordable customized invitations for all occasions.","Mon: 10:00 am - 7:00 pm Tue Closed Wed - Sat: 10:00 am - 7:00 pm Sun: 9:00 am - 4:00 pm",,,,,,,,,,,,,,,
265670,87216,"2020-09-27 02:38:24",Trueblooming,http://www.trueblooming.com,,"(626) 348-4351",,Anaheim,CA,92802,"Anaheim,CA 92802","Bridal Shops, Graphic Designers, Stationery Stores",,,,,,,,,"Mon: 9:00 am - 8:00 pm Tue Closed Wed: 9:00 am - 8:00 pm Thu Closed Fri - Sat: 9:00 am - 8:00 pm Sun Closed","Direct Line: (626) 348-4351",,"amex, check, debit, paypal, visa",,,"Company Website",,,,,,,,,
266148,87380,"2020-09-27 02:38:24","The Bridal and Tuxedo Shop",http://www.bridalandtuxedosny.com/,,"(646) 878-6098","3265 31st St",Astoria,NY,11106,"3265 31st St,Astoria,NY 11106","Bridal Shops, Formal Wear Rental & Sales, Invitations & Announcements, Shopping Centers & Malls, Stationery Stores, Tuxedos, Wedding Supplies & Services",,,,40.76048,-73.92657,https://i2.ypcdn.com/blob/9a9c3795c3859af250485a4602b9fd440cc2f7d7_100x100_crop.jpg?f9d23e1,"Tuxedo Rental Same Day Service, Wedding and Bridal Dresses, Quinceaneras, Prom Gowns!","The Bridal and Tuxedo Shop offers services for any special event. Let it be for Weddings, Prom, First Communions, Sweet 15/16/18, Graduation, etc. The Bridal and Tuxedo Shop of Astoria is a family-owned business for over 20 Years that believes in the importance of offering excellent customer service to each customer seeking dresses and tuxedos for his or her next formal occasion. Offering a diverse selection of bridal gowns, bridesmaid and mother of the bride dresses, quincea?era gowns, prom dresses, and tuxedos, Bridal and Tuxedo Shop prides itself on its ability to meet the needs of each customer while offering competitive discounts. Our mission is to provide excellent customer service, as well as fine quality apparel and merchandise at price points to suit everyone's budget. The Bridal and Tuxedo Shop is a full service bridal salon featuring prom & formal dresses, quincea?era dresses, bridal gowns, and tuxedos for the prom, grooms, groomsmen, fathers and ring bearers. We also carry a variety of accessories to ensure that everything you need for your special occasion is available to you from head to toe! Our inventory includes bridal veils, headpieces, shawls, jackets, belts, and dyeable shoes for your entire wedding party or formal dress. Our knowledgeable bridal consultants work with each bride every step of the way, from the first shopping day to the final fitting after alterations. They will help you navigate the various cuts and styles to identify potential wedding dresses and help you coordinate your dress with our selection of bridesmaid dresses, dresses for mothers and even find a matching dress for your flower girl. Interested in learning more? Please stop in or make an appointment to experience quality customer service at its best! Thank you!","Mon - Fri: 11:00 am - 7:30 pm Sat: 11:00 am - 6:00 pm Sun: 12:00 pm - 5:00 pm",,,"discover, master card, visa, check, amex",,,"Check us out at:","Parking: Lot",,,,,,,,
266214,87393,"2020-09-27 02:38:24","Made 4U by Me!",http://www.made4ubymejulieg.com,bymejulieg@gmail.com,"(559) 974-5722",,,,,,"Invitations & Announcements, Bridal Shops, Party & Event Planners, Party Favors, Supplies & Services, Stationery Stores, Wedding Supplies & Services",,,,,,,,"Design, print and hand assemble custom stationery for weddings and special occasions. Designs include invitations, save-the-date cards, rsvp cards, party favors, programs, dinner menus, escort cards, table numbers, monograms, labels and more...","Mon - Sun: Open 24 Hours",,,,,,http://www.made4ubymejulieg.com,,,,,,,,,
266334,87432,"2020-09-27 02:38:24","An Inviting Design",,aninvitingdesign@hotmail.com,"(209) 489-2134",,,,,,"Invitations & Announcements, Bridal Shops, Party & Event Planners, Party Favors, Supplies & Services, Stationery Stores, Wedding Supplies & Services",,,,,,,,"At An Inviting Design I will work with you personally to ensure you get the exact design you are looking for. Each person is unique and your invitations, announcements and more should reflect your unique personality!","Mon - Sun: Open 24 Hours",,,,,,,,,,,,,,,
266541,87507,"2020-09-27 02:38:24","Brides & Belles Of Tyler",http://bridesbellestyler.com/,brides-belles@juno.com,"(903) 581-8211","107 E 7th St",Tyler,TX,75701,"107 E 7th St,Tyler,TX 75701","Bridal Shops, Clothing Stores, Formal Wear Rental & Sales, Invitations & Announcements, Stationery Stores, Wedding Supplies & Services, Women's Clothing",4,"1 Review",A+,32.32896,-95.30032,https://i2.ypcdn.com/blob/50dbc47fe55f59230c28a54548f97f56a7c1ad06_100x100_crop.jpg?e66d351,,,"Mon: 10:00 am - 7:30 pm Tue - Fri: 10:00 am - 6:00 pm Sat: 10:00 am - 5:00 pm Sun Closed",,,"cash, check, amex, discover, master card, visa",,,http://bridesbellestyler.com,"Parking: Lot, Private Wheelchair Accessible: Yes Price Range : Average By Appointment Only: No Pets Allowed: No",davidsgirl08,01/10/2008,four,"Brides and Belles has been a Godsend for the most part. I found my dream dress and the sales women helped me pick out other things....When I went to buy my dress they were very pushy on me buying the veil as well...I didn't because the veil was a 185 dollars, beautiful but I can find a cheaper veil on ebay!",,,,
267063,87681,"2020-09-27 02:38:25","Castle Collection",http://www.castlecollection.com,info@thecastlehotelgroup.com,"(817) 645-5415","137 S Ridgeway Dr",Cleburne,TX,76033,"137 S Ridgeway Dr,Cleburne,TX 76033","Gift Shops, Bridal Registries, Business Coaches & Consultants, Draperies, Curtains & Window Treatments, Drapery & Curtain Fabrics, Interior Designers & Decorators, Novelties, Party & Event Planners, Souvenirs, Stationery Stores, Upholstery Fabrics, Wedding Planning & Consultants, Wedding Supplies & Services, Women's Clothing, Women's Fashion Accessories",,,,32.33995,-97.40805,,,,"Mon - Fri: 10:00 am - 5:00 pm Sat: 10:00 am - 3:00 pm",,,"master card, visa",,,"http://www.castlecollection.com https://www.castlecollection.com","Parking: Lot Specialties: Retreats, Interior, Houses, Modern, French, Residential, European, Country, Homes, Pictures, Movies, Bedspreads, Castles, Collectibles, Family Weddings, Wine",,,,,,,,
267133,87701,"2020-09-27 02:38:25","Mockingbird Lane Bridal",http://www.mockingbirdbridal.com,mockingbirdbridal@hotmail.com,"(214) 823-6873","5606 E Mockingbird Ln",Dallas,TX,75206,"5606 E Mockingbird Ln,Dallas,TX 75206","Bridal Shops, Gift Baskets, Invitations & Announcements, Stationery Stores, Wedding Supplies & Services",4,"10 Reviews",A+,32.83628,-96.77184,https://i2.ypcdn.com/blob/f4471c51dec2bc7521523fe57b6353e2eb650f27_100x100_crop.jpg?e66d351,,"Helen Shelton opened Mockingbird Bridal Boutique in 1954 in Oak Cliff, moving to our current location in 1968. Having the first true Bridal Boutique of its kind in the Dallas- Fort Worth area. Helen has had the opportunity of seeing true style trends through the years and the opportunity to grow and expand with an exuberant array of designers. Joining Helen in 1999, granddaughter Amber Harris graduate of Southern Methodist University has had the pleasure of following Helen's unbelievable talent in running the business. Most currently, granddaughter Ashley Pappas, also a Southern Methodist Graduate, has now joined her grandmother and sister in the most established and most respected Bridal Boutique. With one Goal in mind to give every bride our undivided attention to her Wedding Attire Dreams. Our sales Associates, certified bridal consultants, help to capture your hearts desire. We know your Wedding Day is the most important day of your life and we want your wedding attire to be timeless and unforgettable. Mockingbird Bridal Boutique offers one of the largest selections in the Southwest with over 300 styles of wedding dresses, gowns and bridesmaid's dresses! We carry 95% of all the featured bridal manufacturer's seen in the national Bridal magazines with prices ranging from $599 to $7, 000.","Mon - Fri: 8:00 am - 6:00 pm Sat: 8:00 am - 4:00 pm",,,"amex, discover, visa, mastercard, cash, diners club",,,"http://www.mockingbirdbridal.com http://www.mockingbirdflorist.com?m99tracker=224569860&redirrefer=mockingbirdflorist.com","Parking: Street, Lot, Private Bike Parking: Yes Wheelchair Accessible: No Price Range : Average By Appointment Only: No","Ann J.",01/06/2015,five,"I've used Mockingbird Florist for several funeral arrangements, and they are exceptional. I can give them a rough idea of what I want, and they bring it to life! Beautiful flowers, excellent service - what more could I want?",Sjweiser,06/20/2012,five,"Mockingbird Florist provided us with knock-out, amazing flowers for our wedding. They were absolutely breathtaking at our ceremony and reception. They took care of every detail and were such a pleasure to work with that I recommend them to anyone that is looking for excellent service."
267532,87830,"2020-09-27 02:38:25",Lawren's,http://www.lawrensgifts.com,info@lawrensgifts.com,"(256) 384-0939","809 Madison St SE",Huntsville,AL,35801,"809 Madison St SE,Huntsville,AL 35801","Bridal Registries, Candles, Candy & Confectionery, China, Crystal & Glassware, Chocolate & Cocoa, Gift Shops, Gourmet Shops, Grocery Stores, Housewares, Invitations & Announcements, Jewelers, Stationery Stores, Wedding Supplies & Services",,,A+,34.72215,-86.57968,,Elegance-Distinction-Quality,"Lawrens is a specialty retailer presenting over 600 current patterns of china from around the world В– casual, fine crystal, silver, table linens, gourmet cookware, serving accessories, party papers, candles, candies, and confections. Keeping the future generation of customers in mind, a collection of infant wear, toys, and baby gifts is also part of the product mix. The most recent enhancement has been the opening of a Villa VIETRI В– offering the largest in-stock collection of exciting and trendsetting Italian dinnerware and dining accessories in the state. Lawrensgifts.com is our online presence from Lawren's located in Huntsville, Alabama. We hope you enjoy shopping in our online store and that you find an array of perfect gifts for all occasions. We are proud to be an Authorized Dealer for several collections including Veitri, Herend, Spode, Mottahedeh, Villeroy and Boch, and many others. Our business philosophy has always been to provide a high level of customer service which allows us to build trust and integrity with our customers. This philosophy has brought back repeat customers year after year and driven our success as a leading retailer of fine china and gifts. We thank you for the business!",,,,"check, debit, discover, visa, mastercard, amex",,,http://www.lawrensgifts.com,"Specialties: Porcelain & China, Bridal, Elegant Weddings, Chinese",,,,,,,,
267658,87877,"2020-09-27 02:38:25","The Dowry",,thedowry@aol.com,"(918) 756-8730","106 S Morton Ave",Okmulgee,OK,74447,"106 S Morton Ave,Okmulgee,OK 74447","Chinaware & Glassware-Renting, Balloons-Retail & Delivery, Bridal Registries, China, Crystal & Glassware, Engraving, Gift Shops, Glassware, Shipping Services, Stationery Stores, Wedding Supplies & Services",,,A+,35.62318,-95.97273,,,,"Mon - Fri: 9:30 am - 5:30 pm Sat: 9:30 am - 1:30 pm Sun Closed",,,"all major credit cards, check, debit",,"The Dowry Ltd",,"Parking: Lot",,,,,,,,
268948,88303,"2020-09-27 02:38:32","Esmeralda Bridal Quinceanera",http://www.Esmeralda-Bridal.com,esmeraldabridal@hotmail.com,"(916) 256-2130","1338 Howe Ave Ste 100",Sacramento,CA,95825,"1338 Howe Ave Ste 100,Sacramento,CA 95825","Bridal Shops, Formal Wear Rental & Sales, Invitations & Announcements, Party Favors, Supplies & Services, Stationery Stores, Wedding Supplies & Services",,,,38.59064,-121.41519,,,,"Mon - Fri: 11:00 am - 7:00 am Sat: 10:00 am - 6:00 am Sun Closed",,,,,,http://www.esmeralda-bridal.com,,,,,,,,,
269140,88364,"2020-09-27 02:38:32","Linda's Hallmark Shop",http://lindashallmarkandgiftgallery.com,,"(707) 263-8316","991 11th St",Lakeport,CA,95453,"991 11th St,Lakeport,CA 95453","Greeting Cards, Bridal Registries, Chinaware & Glassware-Renting, Collectibles, Gift Shops, Gift Wrapping Materials, Glassware, Greeting Cards-Wholesale & Manufacturers, Invitations & Announcements, Novelties, Souvenirs, Stationery Stores, Wedding Supplies & Services",5,"1 Review",,39.04898,-122.92358,https://i2.ypcdn.com/blob/48d98869aefd4e8200a2a88bd5aedf379ec91066_100x100_crop.jpg?e66d351,"Life is a Special Occasion.","Visit Linda's Hallmark Shop in Lakeport, CA for a selection of greeting cards, ornaments, and gifts. Linda's Hallmark Shop helps you celebrate all of life's special occasions.","Mon - Sat: 9:30 am - 6:00 pm Sun: 11:00 am - 4:00 pm",,,"amex, discover, visa, mastercard",,"Hallmark Hallmark-Linda's",http://lindashallmarkandgiftgallery.com,"Parking: Lot Wi-Fi: Free Wheelchair Accessible: Yes Pets Allowed: Yes","denise simpsonn",01/19/2012,five,"i would like to take this opportunity to tell you that Linda's Hallmark gift store has something for everyone who wants to get a personalized type of gift, from figurines, stationary, novelty items, jewelry. You name it, this little gem in Lake County has saved me the drive to Santa Rosa or another out of way city and/or county. i live in clearlake ca. the staff is very helpful but not pesty is the only word that comes to mind when you are shopping and a sales clerk keeps hounding you. They only ask once if they can help you with anything, and will advise what they have to offer for what you are shopping for. have purchased a number of gifts and items for myself thru the years at this store. Their prices are competitive.",,,,
270199,88707,"2020-09-27 02:38:32","Elegant Lace Bridals",http://www.elegantlacebridal.com,info@elegantlacebridal.com,"(408) 978-2230","1061 Blossom Hill Rd","San Jose",CA,95123,"1061 Blossom Hill Rd,San Jose,CA 95123","Bridal Shops, Invitations & Announcements, Stationery Stores, Wedding Supplies & Services",,,A+,37.25095,-121.87382,https://i2.ypcdn.com/blob/d6d44a1753d7438e81027baf477d26bdf3ee5ed2_100x100_crop.jpg?e66d351,"Let Us Help You Find Your Dream Wedding Gown","Full service Bridal shop with a large selection of designer wedding gowns & bridesmaid dresses at affordable prices. Friendly service from experienced consultants","Mon: 10:00 am - 6:00 pm Tue - Thu: 10:00 am - 8:00 pm Fri - Sat: 10:00 am - 6:00 pm Sun: 11:00 am - 5:00 pm",,,"cash, check, visa, mastercard, amex, discover",,,"Primary Website","Parking: Lot, Private Bike Parking: Yes Wheelchair Accessible: Yes By Appointment Only: Yes",,,,,,,,
271523,89143,"2020-09-27 02:38:35","Village Inscriber",http://www.villageinscriber.com,info@villageinscriber.com,"(760) 568-4206","74921 Us Highway 111","Indian Wells",CA,92210,"74921 Us Highway 111,Indian Wells,CA 92210","Invitations & Announcements, Bridal Shops, Gift Shops, Office Equipment & Supplies, Printing Services, Stationery Engravers, Stationery Stores, Wedding Supplies & Services",,,,33.72119,-116.3575,,,"The Village Inscriber has earned its reputation for offering the latest and most modern designs of personalized stationery and invitatins, unique gifts and paper products. We carry numerous lines of designers for your perfect wedding invitation and all other occasion invitations. We also do in store printing of small to large orders, and done in just a matter of days. Our staff provides the service anyone would want, with help in selecting your invitation to helping you chose the perfect wording. We also carry unique gifts, frames, fine stationery, bridge accessories, frames, paper napkins and plates, fine art pieces, and Vera Bradley handbags.","Mon - Sat: 9:30 am - 5:30 pm Sun Closed","Phone: (760) 568-5226 Fax Number: (760) 568-5226",,"discover, amex, all major credit cards",,"The Village Inscriber",http://www.villageinscriber.com,"Parking: Free Wheelchair Accessible: Yes",,,,,,,,
271657,89188,"2020-09-27 02:38:35","Sisters Boutique & Gifts",http://sistersboutiqueandgifts.com,amaha@selpsis.net,"(830) 393-7993","918 10th St",Floresville,TX,78114,"918 10th St,Floresville,TX 78114","Gift Shops, Bridal Shops, Clothing Stores, Gift Baskets, Stationery Stores, Women's Clothing",,,A+,29.14407,-98.15531,https://i2.ypcdn.com/blob/963849acc5f233cf427705cfb7ee7875cf725687_100x100_crop.jpg?e66d351,,,"Mon - Sat: 9:30 am - 6:00 pm Sun: 12:00 pm - 6:00 pm",,,"master card, visa, all major credit cards",,"Sisters Gifts & Boutique","http://sistersboutiqueandgifts.com http://sistersflowers.net","Parking: Lot, Private Specialties: Bridal, Weddings Bike Parking: Yes",,,,,,,,
272915,89603,"2020-09-27 02:38:35","Simply Stamped",,,"(217) 622-3327",,,,,,"Invitations & Announcements, Bridal Shops, Party Favors, Supplies & Services, Stationery Stores, Wedding Supplies & Services",,,,,,,,"Providing custom invitations for all areas of life. Everything from wedding invitations to birthday invitations. Stock invitations available as well as custom invitations designed just for the client.",,,,,,,,,,,,,,,,
273543,89809,"2020-09-27 02:38:35","Perfect Settings",http://perfectsettingsga.com,tonyasmith@perfectsettingsga.com,"(229) 219-7751","3338 Country Club Rd",Valdosta,GA,31605,"3338 Country Club Rd,Valdosta,GA 31605","Invitations & Announcements, Bridal Registries, Gift Shops, Office Equipment & Supplies, Stationery Stores, Wedding Supplies & Services",,,,30.88113,-83.29532,,,"Perfect Settings offers the finest in Bridal Registry and Gift Items as well as distinctive Home Accessories, Invitations and Stationery. Our website features our excellent paper items. stop by our store to see our selection of gifts and home accessories!","Mon - Sat: 10:00 am - 6:00 pm",,,"master card, visa, all major credit cards",,,http://perfectsettingsga.com,,,,,,,,,
275327,90405,"2020-09-27 02:38:40","Lizzy's Gifts & Bridal",http://lizzysgifts.blogspot.com,lizzysgiftsheb@yahoo.com,"(210) 375-0163","2251 Lockhill Selma Rd","San Antonio",TX,78230,"2251 Lockhill Selma Rd,San Antonio,TX 78230","Bridal Shops, Collectibles, Gift Shops, Stationery Stores, Women's Clothing",,,,29.540737,-98.55212,https://i2.ypcdn.com/blob/322d25f7628c0e16004d97cc690636b307739091_100x100_crop.jpg?f9d23e1,"Unique gifts for unique people!","We carry a huge assortment of gifts and fashions. We carry: Jim Shore, Willow Tree, Lakeshore Candle Company, Home Grown, Hot Diggity. We also have an assortment of Cards for all occasions, Bridal Gowns, and accessories, dresses and clothing for all occasions!","Mon - Sat: 10:00 am - 7:00 pm Sun Closed",,,"debit, cash, all major credit cards",,,"Lizzy's Gifts Online!","Parking: Lot, Private Wheelchair Accessible: Yes Pets Allowed: No",,,,,,,,
278922,91609,"2020-09-27 02:38:44","Creations By You",http://www.cbyweddings.com/,cbydeb@gmail.com,"(808) 536-5255","1801 Liliha St",Honolulu,HI,96817,"1801 Liliha St,Honolulu,HI 96817","Party Favors, Supplies & Services, Arts & Crafts Supplies, Beads, Bridal Shops, Craft Supplies, Formal Wear Rental & Sales, Invitations & Announcements, Stationery Stores, Wedding Supplies & Services",,,,21.329453,-157.86147,https://i2.ypcdn.com/blob/a63de2c5c44dac7a8918c6f5e0bb68765aac5797_100x100_crop.jpg?e66d351,,"Creations By You is a creative DIY Concept store. Beading, Wedding & special trimming come in and experience our creative and sparkling world. Every bride dreams of a beautiful wedding and we can assist you! You will discover a wide selection of ideas and supplies to create beautiful and memorable favors, center-pieces, invitations, guest books and much much more. We provide the supplies and Knowledgeable creative staff that can assist you in turning your idea into a lovely creation by you! Creations By You, a family owned business, has been around for more than a decade. Sisters Val Hirata and Debbie Chaiprakorb together have built a solid reputation as color and texture specialists well-skilled in blending your idea with the latest trends, designs and colors for a unique and memorable creation by you. A personalized wedding favor intrigues, charms and becomes a memorable keepsake of your special day. Creations By You offers a large assortment of supplies to create your own distinctive wedding favor for any theme imaginable. From traditional candy boxes to keep-sake CD packaging, Creations By You has an endless supply of creative ideas and the knowledgeable staff who can assist you in selecting the right materials and latest designs that best reflects you own personal style. A truly inspired wedding invitation creates a personal statement and keepsake of a bride's special day. Today, designing your own wedding invitations, table cards, programs and thank you notes is easy with Creation By You. The store offers a wide selection of beautiful and unique paper stock, ribbons and all the elements you need to create a memorable piece to cherish for a lifetime.","Mon - Thu: 9:30 am - 6:00 pm Fri: 9:30 am - 5:00 pm Sat Closed Sun: 11:00 am - 5:00 pm",,,"visa, mastercard",,,http://www.cbyweddings.com,"Parking: Lot, Private Bike Parking: Yes",,,,,,,,
279343,91729,"2020-09-27 02:38:44","Sash & Bow",http://www.sashandbow.com,alliey@sashandbow.com,"(920) 347-9000","109 N Wisconsin St","de Pere",WI,54115,"109 N Wisconsin St,de Pere,WI 54115","Bridal Shops, Stationery Stores, Wedding Planning & Consultants, Wedding Supplies & Services",,,,44.44937,-88.05937,,,,"Mon - Fri: 11:00 am - 5:00 pm",,,"check, debit, mastercard, visa",,,http://www.sashandbow.com,,,,,,,,,
321356,106862,"2020-09-27 02:40:23","International Paper Kansas City Container Division",,,"(202) 628-1223","1101 Pennsylvania Ave NW",Washington,DC,20004,"1101 Pennsylvania Ave NW,Washington,DC 20004","Paper Products, Paper Products-Wholesale & Manufacturers, Stationery Stores",,,,38.89535,-77.02741,,,,"Mon - Fri: 9:00 am - 5:00 pm Sat - Sun Closed",,,"master card, visa",,,,,,,,,,,,