business_x_category.id,business.id,business.ts,business.business_name,business.home_page,business.email_address,business.phone,business.street,business.city,business.state,business.zip_code,business.full_address,business.category,business.rating,business.number_of_reviews,business.bbb_rating_or_license,business.latitude,business.longitude,business.cover_image,business.slogan,business.general_info,business.regular_hours,business.extra_phones,business.services_products,business.payment,business.price_range,business.aka,business.other_links,business.other_information,business.review_1_name,business.review_1_date,business.review_1_rating,business.review_1_text,business.review_2_name,business.review_2_date,business.review_2_rating,business.review_2_text
34109627,7628800,"2020-09-27 14:57:47","Blau Plumbing",http://c.ypcdn.com/2/c/rtd?vrid=n4l7y538y9&rid=210cc75d-c54b-45fd-b1ee-49a284255faf&ptid=n4l7y538y9&ypid=468189573&lid=1000866978746&tl=6&lsrc=IY&dest=http%3A%2F%2Fwww.trane.com%2Fresidential%2Fen%2Fb,dispatch@blauplumbing.com,"(414) 258-0256","12221 W Fairview Ave",Milwaukee,WI,53226,"12221 W Fairview Ave,Milwaukee,WI 53226","Plumbers, Air Conditioning Contractors & Systems, Backflow Prevention Devices & Services, Bathroom Remodeling, Bathtubs & Sinks-Repair & Refinish, Furnaces-Heating, Garbage Disposal Repair, Heat Pumps, Heating Contractors & Specialties, Leak Detecting Service, Pipe Thawing, Plumbing, Drains & Sewer Consultants, Plumbing-Drain & Sewer Cleaning, Pumps-Service & Repair, Sewer Cleaners & Repairers, Small Appliances, Sump Pumps, Water Heater Repair, Water Heaters",5,"11 Reviews",,43.03064,-88.0649,,,,"Mon - Fri: 8:00 am - 6:00 pm Sat: 8:00 am - 5:00 pm","Phone: (262) 251-2018 Phone: (414) 540-9595 Phone: (414) 247-9393 Phone: (414) 476-3100 Phone: (414) 258-4262",,"all major credit cards, amex, master card, visa",,"Blau Plumbing Inc A-A Plumbing","http://c.ypcdn.com/2/c/rtd?vrid=n4l7y538y9&rid=210cc75d-c54b-45fd-b1ee-49a284255faf&ptid=n4l7y538y9&ypid=468189573&lid=1000866978746&tl=6&lsrc=IY&dest=http%3A%2F%2Fwww.trane.com%2Fresidential%2Fen%2Fb http://www.blauplumbing.com",,Monmorning,09/13/2010,five,"Where do I even start? Having called several companies, Blau not only offered the fastest service at a very reasonable trip charge, they were also the only one who appeared to care that we needed their service. After about 1/2 hour, I received a follow-up call updating me on the status of the technician's arrival. The technician himself, Paul, was so informative, knowledgeable and courteous. In addition, he took his time explaining what he recommended and our options for the future. Though this was an evening call, we never felt like Paul was trying to rush through the job in order to go home. This being our first experience with Blau Plumbing, we were very impressed with the customer service from both the person who took our call to the technician. Timeliness was also a positive experience.",day12345,09/10/2010,five,"Keep doing great work as usual!"
34112578,7629749,"2020-09-27 14:57:52","CMP Trades Inc",http://cmptrades.publishpath.com,cmptrades@netzero.com,"(317) 933-9994","6695 S Nineveh Rd",Trafalgar,IN,46181,"6695 S Nineveh Rd,Trafalgar,IN 46181","Plumbers, Gas Lines-Installation & Repairing, Heating Contractors & Specialties, Leak Detecting Service, Major Appliances, Plumbing, Drains & Sewer Consultants, Plumbing-Drain & Sewer Cleaning, Pumps-Service & Repair, Sump Pumps, Water Heater Repair, Water Heaters",,,A+,39.3759,-86.08274,,,"CMP Trades has over 25-years in the plumbing business. We are located in Trafalgar, Indiana, but service the entire Central Indiana area.CMP Trades, Inc was founded in 1996 by Chad Paulin. Chad graduated from Center Grove High School in 1988 and began working in building trades. He went on to graduate from Vincennes University in 1990 earning an Associates Degree in Construction. In 1990 he began his career with Sanjo Plumbing as plumber apprentice, becoming a licensed plumber in 1993 and a Master Plumber in 1995. Then, in 1996 he formed CMP Trades, Inc","Mon - Thu: 8:00 am - 4:00 pm",,,"all major credit cards, amex, master card, visa",,,"http://cmptrades.publishpath.com http://www.cmptrades.com","Services: Drain Cleaning",,,,,,,,
34113364,7629997,"2020-09-27 14:57:52","David Leroy Plumbing Inc",http://www.davidleroy.com,david@davidleroyplumbing.com,"(717) 938-8214","539 Old York Rd","New Cumberland",PA,17070,"539 Old York Rd,New Cumberland,PA 17070","Plumbers, Air Conditioning Contractors & Systems, Backflow Prevention Devices & Services, Bathroom Remodeling, Furnaces-Heating, Garbage Disposal Repair, Gas Lines-Installation & Repairing, Geothermal Heating & Cooling Contractors, Heating Contractors & Specialties, Leak Detecting Service, Major Appliances, Plumbing, Drains & Sewer Consultants, Plumbing-Drain & Sewer Cleaning, Pumps-Service & Repair, Septic Tank & System Cleaning, Septic Tanks & Systems, Sewer Cleaners & Repairers, Sewer Contractors, Small Appliances, Sump Pumps, Ventilating Contractors, Water Heater Repair, Water Heaters, Water Softening & Conditioning Equipment & Service",1,"1 Review",A+,40.17865,-76.83313,https://i2.ypcdn.com/blob/90a42863767d9c506dc06c6189a35ab4c0b8851a_100x100_crop.jpg?e66d351,,"We offer service for all plumbing and AC needs toboth residential and commercial locations. Call ustoday.","Mon - Sun: Open 24 Hours","Phone: (717) 219-4727 Phone: (717) 256-1085 Phone: (717) 219-4622 MobilePhone: (717) 938-8214",,"discover, master card, visa, amex, cash, check, financing available, all major credit cards",,,"http://www.davidleroy.com http://www.davidleroyplumbing.com http://davidleroy1.com","Parking: Lot Services: Septic System Repair, Septic Tank Cleaning, Geothermal Heating & Cooling, Commercial Air Conditioning","Joseph M.",06/28/2017,one,"I used their service last week and I really want to share my experience with them. First of all, I was misrepresented by their agent when they told me they charge for quote fee only if the plumber comes during out of service hours. Since I was using plumber for first time, I was little worried about their cost which is why I checked this before hand. After plumber came they charged me an exorbitant rate of $375 to change my kitchen faucet. I asked them the time to fix it and it would be between 1-2hours. It was too expensive for me and when I declined their service the plumber gave bill for inspection fee. He was adamant that it needs to be paid and I called the customer service again to raise my concern. The manager who took the call not only did not hear my concern but was very disrespectful which was what prompted me to write this review. I will pay the $69 fee as I do not want my credit history to be affected. I called another service Roto-rooter who offered a free quote option and their quote was $225. The plumber from Roto-rooter who came was very courteous and even offered to fix another leak issue at my house for no additional cost. Please be wary of this firm as they are really pricey. You can get much better options at lower price.",,,,
34116682,7631031,"2020-09-27 14:57:55","Reese Plumbing HTG & A/C Inc.",http://reeseplumbinghtgandac.com,reeseplumbing@yahoo.com,"(806) 797-9037","4808 N County Road 1700",Shallowater,TX,79363,"4808 N County Road 1700,Shallowater,TX 79363","Plumbers, Air Conditioning Contractors & Systems, Heating Contractors & Specialties, Major Appliances, Plumbing Contractors-Commercial & Industrial, Plumbing, Drains & Sewer Consultants, Plumbing-Drain & Sewer Cleaning, Pumps-Service & Repair, Sewer Cleaners & Repairers, Sewer Contractors, Small Appliances, Sump Pumps, Ventilating Contractors, Water Heater Repair",,,A+,33.64539,-101.95713,https://i2.ypcdn.com/blob/a48e9f3a0e83eb2389cc593db0bdbd80fcfb30c3_100x100_crop.jpg?f9d23e1,,,"Mon - Sun: Open 24 Hours",,,,,,http://reeseplumbinghtgandac.com,,,,,,,,,
34124913,7633586,"2020-09-27 14:58:00","Blakeman Plumbing & Heating Inc",http://www.blakemanplumbing.com,,"(715) 682-6050","44941 State Highway 13",Ashland,WI,54806,"44941 State Highway 13,Ashland,WI 54806","Plumbers, Air Conditioning Contractors & Systems, Dishwashing Machines Household Dealers, General Contractors, Geothermal Heating & Cooling Contractors, Heating Contractors & Specialties, Major Appliances, Pipe Thawing, Plumbing Contractors-Commercial & Industrial, Plumbing, Drains & Sewer Consultants, Plumbing-Drain & Sewer Cleaning, Pumps-Service & Repair, Septic Tanks & Systems, Sewer Cleaners & Repairers, Sump Pumps, Water Heater Repair",5,"1 Review",A+,46.47042,-90.84201,,,,"Mon - Sun: Open 24 Hours","Phone: (715) 682-6068 Phone: (715) 682-6862 Fax: (715) 682-6862",,,,"Blakeman Plumbing & Htg Inc","http://www.blakemanplumbing.com https://blakemanplumbing.com",,"R W.",06/06/2018,five,"Dave and his workers were very professional. Dave explained everything they were doing and kept me posted on how much longer they would be. I would recommend him and his crew to everyone.",,,,
34127467,7634407,"2020-09-27 14:58:03","Peterson Plumbing Heating Cooling Drains",http://www.petersonphc.com,,"(970) 249-3606","3045 Aerotech Pkwy Unit 2",Montrose,CO,81401,"3045 Aerotech Pkwy Unit 2,Montrose,CO 81401","Plumbing-Drain & Sewer Cleaning, Air Conditioning Contractors & Systems, Backflow Prevention Devices & Services, Bathroom Remodeling, Bathtubs & Sinks-Repair & Refinish, Building Contractors, Excavation Contractors, Gas Lines-Installation & Repairing, Heat Pumps, Heating Contractors & Specialties, Leak Detecting Service, Major Appliances, Pipe Thawing, Piping Contractors, Plumbers, Plumbing, Drains & Sewer Consultants, Pumps-Service & Repair, Septic Tank & System Cleaning, Septic Tanks & Systems, Sewer Cleaners & Repairers, Sewer Contractors, Sump Pumps, Water Filtration & Purification Equipment, Water Heater Repair, Water Heaters, Water Softening & Conditioning Equipment & Service",5,"1 Review",,38.51016,-107.90943,,,,"Mon - Sun: Open 24 Hours","Phone: (970) 497-3123 Phone: (970) 497-2212 Phone: (970) 497-2203",,"discover, visa, all major credit cards, amex, master card",,"Peterson Plumbing Heat Cooling Drain Peterson Plumbing Inc","http://www.petersonphc.com http://www.petersonservices.com",,adobie,07/14/2011,five,"First, the encouragement and optimism of the young lady handling the phone call. Second, the technician's courtesy, knowledge, refined attention, polite communication making sure I understood his explanations.",,,,
34135310,7636836,"2020-09-27 14:58:19","Speedy Rooter",http://www.centralpaplumbing.com,andreacrone@hotmail.com,"(717) 292-0857",,Dover,PA,17315,"Dover,PA 17315","Plumbers, Major Appliances, Plumbing-Drain & Sewer Cleaning, Pumps-Service & Repair, Septic Tank & System Cleaning, Septic Tanks & Systems, Sewer Cleaners & Repairers, Sewer Contractors, Small Appliances, Sump Pumps, Water Well Drilling & Pump Contractors","1,5","6 Reviews",,,,https://i2.ypcdn.com/blob/ff4ec9f53f95198cbd26b705b0b7bb53cca73571_100x100_crop.jpg?f9d23e1,"If you can't flush - call us!","Speedy Rooter is a plumbing business specializing in clearing drains and handling small repair jobs that the average residential customer would come across. They also handle larger commercial jobs on a bid basis and do take care of septic and sewer systems for a few townships.","Mon - Sun: Open 24 Hours",,,"visa, mastercard",,,"Primary Website","Services: Construction Project Management, Dock Construction, Construction Document Preparation, Floor Joist Construction, Exterior Remodeling, Apartment Building Construction, Bedroom Remodeling, Basement Remodeling, Bathroom Remodeling, Conventional Electric Water Heater, Carport Installation, Building Fireproofing, Backflow Preventer Installation Licensed: Yes","Debbie B.",02/02/2018,four,"I have used them a few times in the last two months and they have great. Been on time for an emergency job and the same with my other jobs","Sara B.",09/06/2016,one,"I was told the tech would be there between 8 and 10. 10:45 I call to make sure they were still coming. the lady said they were running late and were finishing up. they would be calling me soon. 1:35 rolls around and no phone call, no tech. I call again. they tell me that the tech was still at his emergency call from 7am. they said that they can reschedule me in. I said I thought that they were unprofessional by not contacting me in anyway and I would be using another company. they said ok and told me to have a nice day. they were not apologetic for wasting my whole day. they did nothing to try to reconcile the issue. i would not waste your day, spend the extra $50 and call roto-rooter. used them before, will be using them again"
34136458,7637194,"2020-09-27 14:58:28","Thorne Plumbing Inc",http://www.thorneplumbingwi.com,,"(920) 336-6966","3765 Creamery Rd","De Pere",WI,54115,"3765 Creamery Rd,De Pere,WI 54115","Water Heaters, Garbage Disposal Repair, Plumbers, Plumbing Fixtures, Parts & Supplies, Pumps, Pumps-Service & Repair, Small Appliance Repair, Sump Pumps, Water Heater Repair, Water Softening & Conditioning Equipment & Service",,,A+,44.43211,-88.01978,https://i2.ypcdn.com/blob/9f70d5457271bede8fb7f73283921ec3bf1ec99c_100x100_crop.jpg?f9d23e1,"Quality Installation & Service At An Affordable Price","Thorne Plumbing, Inc., in De Pere, WI, is the area's leading plumber serving De Pere and surrounding areas since 1997. We specialize in water heaters, plumbing, sump pumps, and much more. We also offer kitchen and bathroom remodeling, cross connection control, high pressure water jetting, TV pipe inspection and more! For all your plumbing needs, contact Thorne Plumbing, Inc. in De Pere.","Mon - Fri: 6:00 am - 5:00 pm Sat - Sun Closed","Fax: (920) 964-0264",,check,,"Thorne Plumbing, Inc.","Primary Website","Specialties: Bathrooms, Lavatories",,,,,,,,
34141137,7638690,"2020-09-27 14:58:37","Capital Plumbing",,,"(717) 236-7366","6851 Bluebird Ln",Dover,PA,17315,"6851 Bluebird Ln,Dover,PA 17315","Plumbers, Major Appliances, Plumbing-Drain & Sewer Cleaning, Pumps-Service & Repair, Septic Tanks & Systems, Sewer Cleaners & Repairers, Sewer Contractors, Small Appliances, Sump Pumps, Water Well Drilling & Pump Contractors",,,,40.07932,-76.86152,,,,,"Phone: (717) 292-0857",,"master card, visa",,,,,,,,,,,,
34142603,7639136,"2020-09-27 14:58:42","A-Fordable Plumbing & Mechanical",http://www.a-fordableplumbing.com,johnc@a-afordableplumbing.com,"(248) 309-8794","1147 Centre Rd","Auburn Hills",MI,48326,"1147 Centre Rd,Auburn Hills,MI 48326","Plumbing, Drains & Sewer Consultants, Backflow Prevention Devices & Services, Bathtubs & Sinks-Repair & Refinish, Building Construction Consultants, Construction Consultants, Garbage Disposal Repair, Gas Lines-Installation & Repairing, Heating Contractors & Specialties, Leak Detecting Service, Pipe Thawing, Plumbers, Plumbing Fixtures, Parts & Supplies, Plumbing-Drain & Sewer Cleaning, Pumps, Pumps-Service & Repair, Septic Tank & System Cleaning, Sewer Cleaners & Repairers, Small Appliance Repair, Sump Pumps, Tanks-Removal & Installation, Water Heater Repair, Water Heaters, Water Heaters-Wholesale & Manufacturers, Water Treatment Equipment-Service & Supplies",5,"3 Reviews",A+,42.65607,-83.24965,,,,"Mon - Sun: Open 24 Hours","Phone: (248) 371-1821",,,,"A-Fordable Plumbing & Mechanical Inc Affordable Plumbing Dash Plumbing & Mechanical Affordable Plumbing & Mechanical",http://www.a-fordableplumbing.com,"Services: Septic System Repair, Septic Tank Cleaning",kzoosoccermom,09/22/2010,five,"Our sump pump water was squirting out of the pipe on the side of our house. Another company came out and said we needed our line replaced at a cost of $3500. We called A-fordable to video the line. The plumber had to snake the line first but when he cameraed it he found the pipe was fine and must have been blocked with some dirt or debris. Anyone who is told they need to have a line replaced should call this company first to have it videoed - It saved us over $3000. They were very honest and did a good job.",UNITEDROAD,02/23/2010,five,"Our company called A-fordable Plumbing to repair a leak in our ceiling. They found the problem was coming from a toilet on the second floor. Within a short time they had the problem fixed. Adam did an excellent job. Great Company В– Will definitely use them again!"
34142639,7639143,"2020-09-27 14:58:42","Keough Clifford R Plumbing Heating & Air Conditioning",http://www.carrier.com,,"(412) 271-7770","225 Mckinley Ave",Wilkinsburg,PA,15221,"225 Mckinley Ave,Wilkinsburg,PA 15221","Plumbers, Air Conditioning Contractors & Systems, Gas Lines-Installation & Repairing, Heating Contractors & Specialties, Leak Detecting Service, Major Appliances, Plumbing, Drains & Sewer Consultants, Plumbing-Drain & Sewer Cleaning, Pumps-Service & Repair, Sewer Cleaners & Repairers, Sump Pumps, Water Heater Repair",,,A+,40.41882,-79.86764,,,,"Mon - Sun: Open 24 Hours","Phone: (412) 271-7877",,"all major credit cards, amex, discover, visa, master card",,"Keough Clifford R Plumbing Heating & Air Conditioning LLC Keough Plumbing Heating & Cooling Clifford R Keough Plumbing Heating And Air LLC . Clifford R Keough Plumbing, Heating and Air Conditioning, LLC . Clifford R Keough Plumbing, Heating and Air Conditioning Clifford R Keough Plumbing Heating And Air","http://www.carrier.com http://www.keoughplumbingheating.com","Specialties: Commercial Grade, Air Conditioning Systems",,,,,,,,
34150310,7641548,"2020-09-27 14:58:51","Chadsey Plumbing & Heating",https://api.superpages.com/xml/search?SRC=ypintfeed&subaffiliate=DXC&PGID=e02.7182.8182845904523&SPGID=1582464983619.0884598d&ADID=11645951&DEST=http%3A%2F%2Fwww.plumbersnearyou.com%2Fp%2Fsuperpages%2Fchadsey-plumbing-and-heating-attleboro-massachusetts.html&C=Appliance&T=Attleboro&S=MA&PH=(508)%20834-8466&FL=url&TL=off&position=302&PS=30&PI=11&Results=FEED_CLCK&uid=0884598d-5fb0-4c7d-9539-b3ab54df6f96&REF=&IP=35.228.145.83&UserAgent=Mozilla%2F5.0%20(iPad%3B%20CPU%20OS%2012_1%20like%20Mac%20OS%20X)%20AppleWebKit%2F605.1.15%20(KHTML%2C%20like%20Gecko)%20Version%2F12.0%20Mobile%2F15E148%20Safari%2F604.1,chadseyplumbing@yahoo.com,"(508) 834-8466","274 Phillips St",Attleboro,MA,02703,"274 Phillips St,Attleboro,MA 02703","Plumbers, Air Conditioning Contractors & Systems, Air Conditioning Service & Repair, Appliance Installation, Bathroom Remodeling, Bathtubs & Sinks-Repair & Refinish, Boiler Repair & Cleaning, Building Contractors, Dishwasher Repair & Service, Drainage Contractors, Garbage Disposal Repair, Garbage Disposals, Heating Contractors & Specialties, Heating Equipment & Systems, Home Improvements, Home Repair & Maintenance, Leak Detecting Service, Major Appliance Refinishing & Repair, Pipe, Pipe Inspection, Piping Contractors, Pumps, Pumps-Service & Repair, Refrigerators & Freezers-Repair & Service, Sewer Pipe, Small Appliance Repair, Sump Pumps, Washers & Dryers Service & Repair, Water Consultants, Water Heater Repair, Water Heaters, Water Softening & Conditioning Equipment & Service, Water Supply Systems",1,"1 Review",A+,41.91469,-71.32223,,"Specializing In ECO Friendly Heating Systems","Our company provides the highest quality service. Whether you're in need of home plumbing maintenance and repairs, bathroom remodeling, we are there to provide you with the most dependable service available. We Offer A full line of efficient plumbing and heating systems. We Pride ourselves on our reputation of quality work, dependable service and immediate response. We are fully licensed and Insured in the state of Massachusetts.","Mon - Fri: 7:00 am - 5:00 pm Sat - Sun Closed",,,"amex, cash, check, diners club, discover, master card, visa, all major credit cards",,,http://www.PlumbersNearYou.com/ChadseyPlumbingandHeating,"Services: Bathroom Remodeling, Sump Pumps Insured: 1 Licensed: 1","Chris J.",03/04/2014,one,"I wish I could give this company no stars. Extremely unprofessional and rude. I won't be recommending them to anyone.",,,,
34152829,7642334,"2020-09-27 14:58:55","Ankeny Plumbing Service",http://www.ankenyplumbingservice.com,rcjbraun@msn.com,"(515) 203-0851","1033 Florida Ave",Ames,IA,50014,"1033 Florida Ave,Ames,IA 50014","Plumbers, Altering & Remodeling Contractors, Backflow Prevention Devices & Services, Bathroom Remodeling, Bathtubs & Sinks-Repair & Refinish, Boiler Repair & Cleaning, Garbage Disposal Repair, Gas Lines-Installation & Repairing, General Contractors, Leak Detecting Service, Major Appliances, Pipe Thawing, Plumbing Contractors-Commercial & Industrial, Plumbing, Drains & Sewer Consultants, Plumbing-Drain & Sewer Cleaning, Pumps-Service & Repair, Septic Tanks & Systems, Sewer Cleaners & Repairers, Sewer Contractors, Sump Pumps, Water Heater Repair, Water Heaters, Water Treatment Equipment-Service & Supplies",,,,42.03211,-93.68139,,,,"Mon - Sun: Open 24 Hours","Phone: (515) 965-3926 Primary Phone: (515) 296-0501 Phone: (515) 296-0501",,"master card, visa",,"Ames Plumbing Service Ankeny Plumbing Svc Ames Plumbing Service Inc Ames Plumbing Svc",http://www.ankenyplumbingservice.com,,,,,,,,,
34164990,7646171,"2020-09-27 14:59:10","AFFORDABLE PLUMBING REPAIR",http://www.plumbingbyalan.com,chevblr55@live.com,"(740) 746-0639","3130 Chicken Coop Hill Rd SE",Lancaster,OH,43130,"3130 Chicken Coop Hill Rd SE,Lancaster,OH 43130","Water Heaters, Garbage Disposals, Major Appliances, Plumbers, Sump Pumps, Water Filtration & Purification Equipment",,,A+,39.67296,-82.50423,,"""QUALITY work for a FAIR price.""","We are a small family owned plumbing repair company. We specialize in any and all plumbing repair in a residential setting, offering fair pricing for our services. With 29 years in the plumbing business, we feel we give a service that is efficient and very economical for the home or property owner. We take pride in what we do.","Mon - Fri: 9:00 am - 5:00 pm Sat - Sun Closed","cell: (614) 546-5961",,"check, debit, discover, master card, visa",,,"main website",,,,,,,,,
34166097,7646494,"2020-09-27 14:59:11","Southport Heating Plumbing Geothermal",http://southportheating.com,,"(262) 654-6565","6919 51st St",Kenosha,WI,53144,"6919 51st St,Kenosha,WI 53144","Plumbers, Air Conditioning Contractors & Systems, Bathtubs & Sinks-Repair & Refinish, Garbage Disposal Repair, Geothermal Heating & Cooling Contractors, Heating Contractors & Specialties, Leak Detecting Service, Major Appliances, Plumbing Contractors-Commercial & Industrial, Plumbing, Drains & Sewer Consultants, Plumbing-Drain & Sewer Cleaning, Pumps-Service & Repair, Sewer Cleaners & Repairers, Small Appliances, Sump Pumps, Water Heater Repair, Water Heaters",,,,42.58956,-87.89222,,,,,,,,,,http://southportheating.com,,,,,,,,,