business_x_category.id,business.id,business.ts,business.business_name,business.home_page,business.email_address,business.phone,business.street,business.city,business.state,business.zip_code,business.full_address,business.category,business.rating,business.number_of_reviews,business.bbb_rating_or_license,business.latitude,business.longitude,business.cover_image,business.slogan,business.general_info,business.regular_hours,business.extra_phones,business.services_products,business.payment,business.price_range,business.aka,business.other_links,business.other_information,business.review_1_name,business.review_1_date,business.review_1_rating,business.review_1_text,business.review_2_name,business.review_2_date,business.review_2_rating,business.review_2_text
38322148,9139824,"2020-09-27 17:21:54","Service Force",https://api.superpages.com/xml/search?SRC=ypintfeed&subaffiliate=DXC&PGID=e02.7182.8182845904523&SPGID=1578622776519.08bcd7d5&ADID=12155863&DEST=http%3A%2F%2Fwww.plumbersnearyou.com%2Fp%2Fsuperpages%2Fservice-force-rockville-maryland.html&C=altering%20remodeling%20contractors&T=Rockville&S=MD&PH=(301)%20284-8736&FL=url&TL=off&position=20&PS=30&PI=1&Results=FEED_CLCK&uid=08bcd7d5-d85c-4dc5-a70d-004f838a7b5b&REF=&IP=157.245.87.121&UserAgent=Mozilla%2F5.0%20(Windows%20NT%2010.0%3B%20WOW64)%20AppleWebKit%2F537.36%20(KHTML%2C%20like%20Gecko)%20Chrome%2F69.0.3497.100%20YaBrowser%2F18.10.0.2724%20Yowser%2F2.5%20Safari%2F537.36,Serviceforcecorp@hotmail.com,"(301) 284-8736","1022 Baltimore Rd",Rockville,MD,20851,"1022 Baltimore Rd,Rockville,MD 20851","Altering & Remodeling Contractors, General Contractors, Heating Contractors & Specialties, Plumbers, Plumbing Contractors-Commercial & Industrial, Plumbing, Drains & Sewer Consultants, Plumbing-Drain & Sewer Cleaning, Pumps-Service & Repair, Septic Tank & System Cleaning, Septic Tanks & Systems, Sewer Cleaners & Repairers, Sump Pumps, Water Damage Emergency Service, Water Heater Repair",5,"1 Review",A+,39.08403,-77.13059,,"Satisfaction Guaranteed! / $50 Off Water Heater Installation! / No Truck Fee for 1st Time Customers!",,"Mon - Fri: 8:00 am - 6:00 pm",,,"check, all major credit cards",,,"http://www.PlumbersNearYou.com/ServiceForce http://serviceforcecorp.com",,royb74,01/02/2014,five,"Prompt, on time, professional, and reasonable rates.",,,,
38324333,9140313,"2020-09-27 17:21:58","Weinberg Plumbing Company Incorporated",http://www.weinbergplumbing.com,,"(773) 821-4414","846 W 119th St",Chicago,IL,60643,"846 W 119th St,Chicago,IL 60643","Plumbers, Altering & Remodeling Contractors, Building Contractors, Gas Lines-Installation & Repairing, General Contractors, Piping Contractors, Plumbing Contractors-Commercial & Industrial, Plumbing, Drains & Sewer Consultants, Plumbing-Drain & Sewer Cleaning, Septic Tank & System Cleaning, Sewer Cleaners & Repairers, Sewer Contractors, Sump Pumps, Water Heater Repair, Water Heaters","4,5","2 Reviews",A+,41.67804,-87.64383,,,,"Mon - Fri: 8:00 am - 4:30 pm Sat - Sun Closed","Fax: (773) 821-0135",,amex,,"Weinberg Plumbing Co, Inc","http://www.weinbergplumbing.com http://weinbergplumbingcompany.com","Services: Sewer Main Clearing, Sump Pumps, Sewer Main Repair","Patti G.",12/29/2016,four,"Tom came to our house and fixed the problem! He promptly returned when we thought there was another problem which there wasn't. We have always had a good experience with Weinberg Plumbing.",efredland,08/29/2012,five,"I have had my fair share of contractor-disasters, plumbers included. But, having seen Weinberg Plumbers around my condo, and knowing that they were highly regarded, I called them to help resolve several problems including the kitchen faucet leaking and the sprayer not working properly and clothes washer backing up into the bathroom sink when it drained. Todd arrived at 8 as scheduled В– already a good start В– and worked his way through the unexpected. The hole drilled in the granite counter top was too small for most replacement faucets. But Todd found the perfect one at an excellent price at the Faucet Shop. (Those guys are great, too.) There was not a working shut off valve under the sink (thanks, previous contractor). He installed one. The washer problem was solved with rodding, and he also replaced a partially-rotted pipe. He discovered other minor problems and just took care of them. It is clear that he takes pride in doing the job right. And he solves the unexpected problems creatively. I havenВ’t received the bill yet, but you know what? It will be well worth it no matter what it is."
38324919,9140440,"2020-09-27 17:21:58","The Plumbing Works",http://theplumbingworksor.com,drainman63@comcast.net,"(541) 484-9869","1704 W 6th Ave",Eugene,OR,97402,"1704 W 6th Ave,Eugene,OR 97402","Plumbing-Drain & Sewer Cleaning, Altering & Remodeling Contractors, Bathroom Remodeling, Bathtubs & Sinks-Repair & Refinish, Boiler Repair & Cleaning, Building Contractors, Gas Lines-Installation & Repairing, Heating Contractors & Specialties, Leak Detecting Service, Plumbers, Plumbing Fixtures, Parts & Supplies, Plumbing, Drains & Sewer Consultants, Septic Tank & System Cleaning, Septic Tanks & Systems, Sewer Cleaners & Repairers, Sewer Contractors, Sump Pumps, Water Heater Repair, Water Heaters",1,"4 Reviews",A+,44.05295,-123.11882,,,"The Plumbing Works offers the best local plumbing service from repairs, replacements and additions. Call us now to solve your plumbing problems.","Mon - Fri: 8:00 am - 5:00 pm Sat - Sun Closed",,,amex,,,http://theplumbingworksor.com,"Services: Bathroom Remodeling, Clear Drain Clogs","Marie K.",07/17/2014,one,"Either the number listed isn't a working number or you don't have a good line. Tried numerous times to get ahold of someone at 10:57am and nothing-",avoid_this_place,05/07/2012,one,"I couldn't find a plumbing part for my shower at the local big-box home supply and was referred here. I didn't mind not being greeted, but the person behind the counter provided the most unfriendly customer service I have ever encountered in my life. It was clear he didn't want to help me in the least, didn't look at me, or ever crack a smile. I left swearing I'd never do business there and would rather stand out naked in the rain (in the winter) and take a shower that way than ever give them my business or a penny of my money. After reading the other reviews here I can see that I am not the only person with a negative impression of this unfriendly place. If it's going to kill you to be friendly and try to help people - why be in business in the first place?????"
38334714,9142646,"2020-09-27 17:22:01","A Plus Sewer Service Inc.",https://www.aplussewerservice.net,aplus@citlink.net,"(845) 294-6103",,,,,,"Plumbing-Drain & Sewer Cleaning, Altering & Remodeling Contractors, Building Contractors, Drainage Contractors, Excavation Contractors, Pipe Thawing, Plumbers, Plumbing Fixtures, Parts & Supplies, Plumbing, Drains & Sewer Consultants, Pumps, Pumps-Service & Repair, Septic Tank & System Cleaning, Septic Tanks & Systems, Sewer Cleaners & Repairers, Sewer Contractors, Sump Pumps, Water Well Drilling & Pump Contractors",,,A+,,,,"NO JOB TOO BIG OR TOO SMALL","Property owners rely on their plumbing systems to get them through the day, but when disaster strikes, they turn to A Plus Sewer Service. This family-owned and operated business has served the New Hampton, NY, area for nearly 30 years. When sludge collects in your pipes to cause a clog or your sump pump suddenly stops working, their team of certified experts will be at your door. TheyВ’re proud to stand by their work and have earned a valued position within the Hampton and Goshen communities. Plumbing problems are unpredictable, but A Plus Sewer Service is your key to a fast and affordable solution. Customer satisfaction is their number one priority, and they strive to be the best in the business. If another plumber or septic service advises you your septic tank is in need of repair, one which involves digging up your yard, call A Plus Sewer Service for a second opinion. TheyВ’re known for fixing problems other companies canВ’t, and they keep their rates affordable. A Plus Sewer Service uses industrial equipment to offer customers a full range of plumbing services. When you hire them for drain cleaning, theyВ’ll show up with a high-pressure jet capable of returning your pipes to a like-new condition. When you need your sump pump repaired, they use their years of experience and professional training to get the job done correctly. Sewer cleaning and septic tank installation arenВ’t jobs to trust to just anyone. The plumbing experts at A Plus Sewer Service provide residential and commercial solutions you can count on. With 24-hour emergency service and flexible appointment scheduling, A Plus Sewer Service is committed to making your life easier. From toilet repair to hot water tank installation, theyВ’re New HamptonВ’s most-trusted resource. Learn more about their plumbing services by visiting them online or call (845) 294-6103 for more information.","Mon - Sun: Open 24 Hours",,,"amex, cash, discover, master card, visa, check",,,website,"Specialties: Tubs, Basements, Commodes, Leaks, Stools Services: Septic System Installation, Septic System Repair, Sewer Main Clearing, Sewer Main Repair, Septic Tank Cleaning, Septic Tanks, Drain Cleaning, Clear Drain Clogs",,,,,,,,
38340250,9143932,"2020-09-27 17:22:07","Hull Plumbing",http://www.hullplumbinginc.com,rich@hullplumbinginc.com,"(405) 324-0567","7135 NW 3rd St","Oklahoma City",OK,73127,"7135 NW 3rd St,Oklahoma City,OK 73127","Plumbers, Altering & Remodeling Contractors, Bathroom Remodeling, Bathtubs & Sinks-Repair & Refinish, Garbage Disposal Repair, Gas Lines-Installation & Repairing, Leak Detecting Service, Pipe Thawing, Plumbing, Drains & Sewer Consultants, Plumbing-Drain & Sewer Cleaning, Pumps-Service & Repair, Septic Tank & System Cleaning, Sewer Cleaners & Repairers, Sewer Contractors, Sump Pumps, Water Heater Repair, Water Heaters, Water Treatment Equipment-Service & Supplies",,,,35.47029,-97.63707,,,,"Mon - Fri: 8:00 am - 5:00 pm",,,,,,http://www.hullplumbinginc.com,,,,,,,,,
38352888,9146826,"2020-09-27 17:22:14","Laurel Plumbing",http://laurelplumbing.com,Laurelplumbing@verizon.net,"(301) 498-8084","132 Washington Blvd S",Laurel,MD,20707,"132 Washington Blvd S,Laurel,MD 20707","Plumbers, Air Conditioning Contractors & Systems, Altering & Remodeling Contractors, Backflow Prevention Devices & Services, Bathroom Remodeling, Bathtubs & Sinks-Repair & Refinish, Building Contractors, General Contractors, Heating Contractors & Specialties, Leak Detecting Service, Piping Contractors, Plumbing Fixtures, Parts & Supplies, Plumbing, Drains & Sewer Consultants, Plumbing-Drain & Sewer Cleaning, Pumps, Pumps-Service & Repair, Septic Tank & System Cleaning, Sewer Cleaners & Repairers, Sewer Contractors, Sump Pumps, Water Heater Repair, Water Heaters",,,,39.10282,-76.84452,https://i3.ypcdn.com/blob/698bfb9ed28b007d02dd86ad41db7646b2bbe3dc_100x100_crop.jpg?efea793,,,"Mon - Fri: 8:00 am - 5:00 pm Sat: 8:00 am - 1:00 pm Sun Closed",,,"master card, visa, amex, discover",,,website,"Specialties: Bathrooms Services: Bathroom Remodeling, Drain Cleaning",,,,,,,,
38358834,9148159,"2020-09-27 17:22:18","Aladdin Plumbing",http://www.aladdinplumbing.com,,"(201) 251-2717","178 E Ridgewood Ave",Ridgewood,NJ,07450,"178 E Ridgewood Ave,Ridgewood,NJ 07450","Plumbers, Air Conditioning Contractors & Systems, Altering & Remodeling Contractors, Backflow Prevention Devices & Services, Bathroom Remodeling, Bathtubs & Sinks-Repair & Refinish, Garbage Disposal Repair, Gas Lines-Installation & Repairing, Geothermal Heating & Cooling Contractors, Heating Contractors & Specialties, Home Improvements, Pipe Thawing, Plumbing, Drains & Sewer Consultants, Plumbing-Drain & Sewer Cleaning, Pumps-Service & Repair, Septic Tank & System Cleaning, Sewer Cleaners & Repairers, Sewer Contractors, Sprinklers-Garden & Lawn, Installation & Service, Sump Pumps, Water Heater Repair, Water Heaters",,,,40.9787,-74.11598,,,,,"Phone: (201) 488-8678 TollFree: (800) 664-8454",,"financing available",,"Aladdin Plumbing & Heating Aladdin Plumbing Heating Sewer & Drain Co Aladdin Plumbing & Mechanical Aladdin Plumbing Heating Sewer Drain Aladdin Plumbing Heating Sewer",http://www.aladdinplumbing.com,,,,,,,,,
38361344,9148740,"2020-09-27 17:22:18","Ray's Plumbing & Sewer Service",http://www.raysplumbingandsewer.com,,"(217) 544-4497","720 Patton Ave",Springfield,IL,62702,"720 Patton Ave,Springfield,IL 62702","Plumbers, Altering & Remodeling Contractors, Backflow Prevention Devices & Services, Building Contractors, Building Contractors-Commercial & Industrial, Excavation Contractors, General Contractors, Grease Traps, Heating Contractors & Specialties, Pipe, Piping Contractors, Plumbing Fixtures, Parts & Supplies, Plumbing, Drains & Sewer Consultants, Plumbing-Drain & Sewer Cleaning, Pumps-Service & Repair, Road Building Contractors, Septic Tank & System Cleaning, Septic Tanks & Systems, Sewer Cleaners & Repairers, Sewer Contractors, Sump Pumps, Tanks-Removal & Installation, Water Filtration & Purification Equipment, Water Heater Repair, Water Heaters, Water Softening & Conditioning Equipment & Service, Water Well Drilling & Pump Contractors",,,,39.81,-89.6661,,,,"Same Day Service/Delivery","Primary Phone: (217) 718-2033 Primary Phone: (217) 718-2040 Phone: (217) 718-2033",,"master card, visa, amex, discover",,,http://www.raysplumbingandsewer.com,,,,,,,,,
38361795,9148835,"2020-09-27 17:22:18","My Plumber",https://www.myplumber.com,MyPlumber@MyPlumber.com,"(301) 464-1790","4906 Ridgeview Ln",Bowie,MD,20715,"4906 Ridgeview Ln,Bowie,MD 20715","Plumbers, Altering & Remodeling Contractors, Backflow Prevention Devices & Services, Bathroom Remodeling, Bathtubs & Sinks-Repair & Refinish, Garbage Disposal Repair, Gas Lines-Installation & Repairing, General Contractors, Geothermal Heating & Cooling Contractors, Heating Contractors & Specialties, Leak Detecting Service, Plumbing, Drains & Sewer Consultants, Plumbing-Drain & Sewer Cleaning, Pumps-Service & Repair, Sewer Cleaners & Repairers, Sewer Contractors, Sump Pumps, Water Heater Repair, Water Treatment Equipment-Service & Supplies",,,,38.99894,-76.75737,,,,"Mon - Sun: Open 24 Hours","TollFree: (888) 784-8759",,"amex, discover, master card, visa, all major credit cards",,,"https://www.myplumber.com http://myplumber.com","Specialties: Clogs, Vanities, Plugs, Toilets, Broken Lines, Leaks, Garbage Disposals, Blockages, Pumps, Water Pressure Problems, Commodes, Broken Pipes, Stoppages, Stools",,,,,,,,
38363050,9149118,"2020-09-27 17:22:28","Hausman Plumbing, Inc.",http://www.hausmanplumbing.com,,"(513) 574-3105",,,,,,"Plumbers, Altering & Remodeling Contractors, Backflow Prevention Devices & Services, Bathroom Remodeling, General Contractors, Piping Contractors, Plumbing, Drains & Sewer Consultants, Pumps-Service & Repair, Sewer Cleaners & Repairers, Sewer Contractors, Sump Pumps, Water Heater Repair, Water Heaters",,,A+,,,,,"Full service Plumbing Company for all Residential or commercial needs.","Mon - Sat: 8:00 am - 6:00 pm Sun Closed",,,,,,http://www.hausmanplumbing.com,,,,,,,,,
38368405,9150403,"2020-09-27 17:22:36","Lake Cook Plumbing",http://lakecookplumbing.com,,"(847) 416-6050","500 E Il Route 22","Lake Zurich",IL,60047,"500 E Il Route 22,Lake Zurich,IL 60047","Plumbers, Altering & Remodeling Contractors, Building Contractors, Building Contractors-Commercial & Industrial, General Contractors, Heating Contractors & Specialties, Leak Detecting Service, Pipe, Piping Contractors, Plumbing-Drain & Sewer Cleaning, Pumping Contractors, Septic Tanks & Systems, Sewer Cleaners & Repairers, Sewer Contractors, Sump Pumps, Water Filtration & Purification Equipment, Water Heaters, Water Softening & Conditioning Equipment & Service",,,,42.19754,-88.07335,,,"Lake Cook Plumbing Service, Inc. is a top of the line plumbing company that has dedicated high-quality plumbing services to residents in the North Chicago area since 1954. With well-trained and experienced technicians, Lake Cook Plumbing is committed to superior quality and utilizes the latest technology to fit all of your plumbing needs and repairs. From installation to maintenance, Lake Cook Plumbing handles it all including drain cleaning, sewer, and water heater services.","Mon - Fri: 8:30 am - 4:30 pm","Phone: (847) 558-1490",,"amex, discover, master card, visa, cash, check",,"Lake Cook Plumbing Service, Inc.","http://lakecookplumbing.com https://lakecookplumbing.com",,,,,,,,,
38374294,9151791,"2020-09-27 17:22:38","A & C Plumbing and Heating",,,"(810) 516-8577",,,,,,"Plumbers, Air Conditioning Contractors & Systems, Altering & Remodeling Contractors, Bathroom Remodeling, Garbage Disposal Repair, Heating Contractors & Specialties, Plumbing, Drains & Sewer Consultants, Plumbing-Drain & Sewer Cleaning, Pumps-Service & Repair, Sump Pumps, Water Heater Repair",,,,,,,"Excellent Service, Quality and Prices you can Trust!!","Call for Quote. - Servicing All Major Brands. In Business since 1985 Work with a Company you can Trust!","Mon - Fri: 8:00 am - 5:00 pm Sat - Sun Closed",,,,,,,,,,,,,,,
38374768,9151900,"2020-09-27 17:22:38","Bob's Plumbing & Rooter Service",http://www.fixmydrip.com,fixmydrip@gmail.com,"(323) 664-2627","5417 Hollywood Blvd # 374","Los Angeles",CA,90027,"5417 Hollywood Blvd # 374,Los Angeles,CA 90027","Plumbing-Drain & Sewer Cleaning, Altering & Remodeling Contractors, Backflow Prevention Devices & Services, Bathtubs & Sinks-Repair & Refinish, Building Contractors, Gas Lines-Installation & Repairing, Leak Detecting Service, Plumbers, Plumbing, Drains & Sewer Consultants, Pumps-Service & Repair, Sewer Cleaners & Repairers, Sewer Contractors, Sump Pumps, Water Heater Repair, Water Heaters",5,"40 Reviews",,34.10184,-118.30754,,,,"Mon - Fri: 8:00 am - 4:00 pm Sat - Sun: 9:00 am - 1:00 pm","Fax: (661) 295-5539",,"amex, discover, master card, visa, cash, check, all major credit cards",,"Bob's Rooter & Plumbing BobВ’s Rooter & Plumbing",http://www.fixmydrip.com,,suesana,04/11/2012,five,"In 2005, when we moved to LA, we had Bob's Plumbing bidding for a job in our newly-bought home, along with over a dozen other plumbing companies. They offered the best bid, and provided outstanding service!! We've used them constantly for 8 years now, for our house, and for our commercial properties. We can't speak highly enough about their reasonable prices, high quality of work, promptness in services...and the whole family are so genuinely nice too. It's a family owned and run business. So one gets to know his daughters who do the booking via phone, and his sons and nephews who work with him in the jobs. Everyone is highly professional, and pleasantly nice. We're deeply grateful of the honest service.","lou williams",11/14/2011,five,"My house turned 100 this year and my mishmash pipes needed to be replaced. Bob's Rooter & Plumbing gave me the second, most specific, and last estimate I needed. For approximately the amount of my first quote, they also secured my gas pipe and a several other extras. They started and completed the job the day after I contracted with them. Bob's grandson, Shane, estimated and oversaw the job and I feel that I know this lovely, professional, and hardworking family now! Mat was the capable plumber in charge. He and the whole work crew were knowledgeable, polite, neat, and thorough. It was after dark when they finished, and Shane didn't even mention payment until he returned the next day to inspect the work, cleanup by daylight, answer questions, and and perform finishing touches. Oh, I had asked them to subtract the sink piping from the estimate because it had rather recent new/cheap piping. I wasn't charged for it, but Shane re-piped the sink because he didn't like the ugly stuff. Nice to know they are a family business. I plan to leave the house and their phone number to my daughter."
38375788,9152126,"2020-09-27 17:22:47","Water Boy's Plumbing Services, Inc.",http://www.waterboysplumbing.com,hey.plumber@waterboysplumbing.com,"(701) 746-4622","1723 Dyke Ave","Grand Forks",ND,58203,"1723 Dyke Ave,Grand Forks,ND 58203","Plumbers, Altering & Remodeling Contractors, Bathroom Remodeling, Bathtubs & Sinks-Repair & Refinish, Gas Lines-Installation & Repairing, Leak Detecting Service, Plumbing, Drains & Sewer Consultants, Plumbing-Drain & Sewer Cleaning, Pumps-Service & Repair, Sewer Cleaners & Repairers, Sump Pumps, Water Heater Repair, Water Heaters, Water Treatment Equipment-Service & Supplies",1,"1 Review",A+,47.91881,-97.0521,,,"Water Boys Plumbing is a Father/Son team serving clients in the Grand Forks and East Grand Forks area. We have over 13 years of experience in the plumbing business, handling everything from simple repairs to new construction and remodeling for homeowners and contractors. Residential services and products include: Backflow prevention New construction & remodeling Faucets, sinks & tubs Gas fittings Water heaters Garbage Disposals Dishwasher Installation Have you started a plumbing project and need help? Please call. We can help finish your project affordably. Whether you need faucet repair or an estimate on that new basement bathroom we can help. We are licensed and insured for your added peace-of-mind. For more details please visit our website or call today to schedule service.","Mon - Sun: 8:00 am - 5:00 pm","Phone: (701) 746-1155 Phone: (701) 314-4977 Fax: (701) 746-1155",,"discover, master card, visa, all major credit cards, cash, check",,,http://www.waterboysplumbing.com,"Services: Bathroom Remodeling","Neal M.",06/29/2018,one,"Installation of an American Standard walk-in spa tub Water Boys came highly recommended by a former employee of Northern Plumbing Supply. I called them and the owner said most people don't want one of those tubs installed once they find out how expensive they are. But, he did agree to take a look at the project ""next week"". Towards the end of that week, I was able to get him on the phone and he said he was busy and he will try to get a look at it ""next week"". Since then, he has literally hung the phone up on me twice without answering it and numerous voice mails have gone unanswered. At this point, after nearly 3 weeks, I would not hire Water Boys if they were the last plumber working in Grand Forks, ND!",,,,
38377104,9152421,"2020-09-27 17:22:47","Clearwater Plumbing Inc",http://www.clearwaterplumbingservice.com,,"(770) 443-4860","209 Commerce Dr",Dallas,GA,30132,"209 Commerce Dr,Dallas,GA 30132","Plumbers, Altering & Remodeling Contractors, Bathroom Remodeling, Bathtubs & Sinks-Repair & Refinish, General Contractors, Home Improvements, Leak Detecting Service, Plumbing Contractors-Commercial & Industrial, Plumbing, Drains & Sewer Consultants, Plumbing-Drain & Sewer Cleaning, Pumps-Service & Repair, Sump Pumps, Water Heater Repair, Water Treatment Equipment-Service & Supplies",,,,33.90711,-84.80385,,,,,"Phone: (770) 443-2042 Phone: (770) 693-9568 Primary Phone: (770) 693-9568 Primary Phone: (770) 443-2042 Phone: (770) 443-7249 Fax: (770) 443-7249",,,,"Plumbing Clearwater Clearwater Plumbing Inc Clearwater Plumbing Inc",http://www.clearwaterplumbingservice.com,,,,,,,,,