business_x_category.id,business.id,business.ts,business.business_name,business.home_page,business.email_address,business.phone,business.street,business.city,business.state,business.zip_code,business.full_address,business.category,business.rating,business.number_of_reviews,business.bbb_rating_or_license,business.latitude,business.longitude,business.cover_image,business.slogan,business.general_info,business.regular_hours,business.extra_phones,business.services_products,business.payment,business.price_range,business.aka,business.other_links,business.other_information,business.review_1_name,business.review_1_date,business.review_1_rating,business.review_1_text,business.review_2_name,business.review_2_date,business.review_2_rating,business.review_2_text
3746972,1219469,"2020-09-27 04:29:13","High Tech Auto Body",http://hightechautobodyinc.com,hautobody@verizon.net,"(302) 633-1323","107 Baltimore Ave",Wilmington,DE,19805,"107 Baltimore Ave,Wilmington,DE 19805","Automobile Body Repairing & Painting, Auto Repair & Service, Automobile Detailing, Car Wash, Dent Removal, Towing, Truck Painting & Lettering, Wheel Alignment-Frame & Axle Servicing-Automotive",5,"1 Review",A+,39.739,-75.58919,https://i1.ypcdn.com/blob/fe8a48b12713235ce6467b4da37750e8349b9486_100x100_crop.jpg?adceb05,,,"Mon - Thu: 8:00 am - 5:30 pm Fri: 8:00 am - 5:00 pm","Phone: (302) 298-1143",,"all major credit cards, amex",,,http://hightechautobodyinc.com,,"Steve J.",07/13/2018,five,"Joel and his team are the best auto repair service I have been to!!! They just repaired my car today and I couldn't tell it was ever damaged... The price was the less than all the others I received... As a matter of fact, while repairing my car fender they also repaired the attached bumper which was not included in the quote at no additional cost... That tells me they have integrity and I can trust their prices and they are not motivated by greed like some of the other shops... In the future, I will go to them first, no one else...",,,,
3748718,1220194,"2020-09-27 04:29:22","Moran's Auto Frame & Body Repair",,moranafbr@yahoo.com,"(559) 268-7699","2330 E Date Ave",Fresno,CA,93706,"2330 E Date Ave,Fresno,CA 93706","Automobile Body Repairing & Painting, Auto Repair & Service, Car Wash, Towing, Truck Body Repair & Painting, Truck Painting & Lettering",5,"2 Reviews",A+,36.70186,-119.78369,https://i1.ypcdn.com/blob/eea1cd843c96f109f101de0ae86f77200fe5ed61_100x100_crop.jpg?adceb05,"26 YEARS EXPERIENCE",,"Mon - Fri: 9:00 am - 5:00 pm","Phone: (559) 268-7695 Primary Phone: (559) 268-7695",,"master card, visa",,"Moran's Auto Frame & Auto Body Repair Moran's Auto Frame and Body Repair Moran's Auto Frame & Auto Repair Moran's Auto Frame & Auto Rpr",,,"Jennifer E.",06/28/2017,five,"Great guys and great work done. Glad they are friends of ours because I wouldn't take my vehicles anywhere else for body work and repairs. Thanks guys.","Jesse Z.",04/04/2017,five,"The guys are very professional and care about the work they do. Would definitely recommend them to family and friends."
3749615,1220561,"2020-09-27 04:29:22","Brant's Precision Auto Body & Detailing, Inc.",http://brantsprecisionautobody.net,brant@ticon.net,"(920) 568-9962","1205 Industrial Dr","Fort Atkinson",WI,53538,"1205 Industrial Dr,Fort Atkinson,WI 53538","Automobile Body Repairing & Painting, Automobile Customizing, Automobile Detailing, Automobile Restoration-Antique & Classic, Car Wash, Mufflers & Exhaust Systems, Truck Painting & Lettering, Truck Service & Repair",,,A+,42.91361,-88.85132,,,,"Mon - Fri: 8:00 am - 5:00 pm Sun Closed",,,,,"Brant's Precison Body Inc Brant's Precision Body Inc Brants Prcsion Auto Bdy Dtling",http://brantsprecisionautobody.net,"Parking: Lot",,,,,,,,
3754242,1222441,"2020-09-27 04:29:35","Custom Truck & Auto Shine Inc",http://customtruckandautoshine.biz,customtruckandautoshine@yahoo.com,"(701) 282-2777","3401 4th Ave S Ste A",Fargo,ND,58103,"3401 4th Ave S Ste A,Fargo,ND 58103","Automobile Body Repairing & Painting, Automobile Detailing, Car Wash, Sandblasting, Truck Equipment & Parts, Truck Painting & Lettering",,,A+,46.87177,-96.83564,,,"Auto detailing, semi truck detailing, Rhino Linings, carpet cleaning.","Mon - Fri: 8:00 am - 5:00 pm",,,"master card, visa",,,http://customtruckandautoshine.biz,,,,,,,,,
3754969,1222754,"2020-09-27 04:29:35","Jma Collision",http://www.jmacollisioncenter.com,jmaauto@verizon.net,"(814) 495-4399","190 Ragers Hill Rd","South Fork",PA,15956,"190 Ragers Hill Rd,South Fork,PA 15956","Automobile Body Repairing & Painting, Auto Oil & Lube, Auto Repair & Service, Automobile Detailing, Car Wash, Dent Removal, Towing, Truck Painting & Lettering, Wheel Alignment-Frame & Axle Servicing-Automotive, Windshield Repair",,,A+,40.34537,-78.7823,,,,"Mon - Fri: 9:00 am - 5:00 pm",,,,,"JMA Collision Center LLC JMA Collision Center Jma Auto Collision Center Jma Auto Collision Ctr",http://www.jmacollisioncenter.com,,,,,,,,,
3762851,1226056,"2020-09-27 04:29:45","Rhinelander Collision Center",http://www.rhinelandercollision.com,rhinelandercollision2@gmail.com,"(715) 369-1144","41 E Pearl St",Rhinelander,WI,54501,"41 E Pearl St,Rhinelander,WI 54501","Automobile Body Repairing & Painting, Auto Repair & Service, Car Wash, Truck Painting & Lettering",,,,45.64571,-89.40888,https://i1.ypcdn.com/blob/acb283fad963ed400873082129cfb8fdda2ecff7_100x100_crop.jpg?adceb05,,,"Mon - Fri: 8:00 am - 5:00 pm Sat - Sun Closed",,,amex,,"Custom Collision",http://www.rhinelandercollision.com,"Parking: Lot",,,,,,,,
3765321,1227033,"2020-09-27 04:29:49","Rupp's Unique Auto Body",http://ruppsauto.com,,"(218) 685-4400","PO Box 1013","Elbow Lake",MN,56531,"PO Box 1013,Elbow Lake,MN 56531","Automobile Body Repairing & Painting, Car Wash, Sandblasting, Towing, Truck Painting & Lettering",,,,45.995266,-95.96715,,,,"Mon - Fri: 8:00 am - 5:00 pm","Fax Number: (218) 685-6794",,,,"Rupp's Unique Auto Body LLC",http://ruppsauto.com,,,,,,,,,
3768735,1228458,"2020-09-27 04:29:56","Schneider's Paint & Body Inc",http://schneiderspaintandbody.com,schneiderpb@att.net,"(812) 423-3111","112 Clark St",Evansville,IN,47708,"112 Clark St,Evansville,IN 47708","Automobile Body Repairing & Painting, Auto Repair & Service, Automobile Detailing, Car Wash, Dent Removal, Paint, Towing, Truck Body Repair & Painting, Truck Painting & Lettering, Truck Service & Repair",,,A+,37.97391,-87.57744,,,,"Mon - Fri: 7:30 am - 5:00 pm",,,,,,"http://schneiderspaintandbody.com http://schneiderspaintbody.com","Parking: Lot Specialties: Cars",,,,,,,,
3768762,1228466,"2020-09-27 04:29:56","Domestic & Foreign Auto Body, Inc",http://www.domesticandforeignauto.com,,"(216) 481-8696",,Cleveland,OH,44110,"Cleveland,OH 44110","Automobile Body Repairing & Painting, Auto Repair & Service, Automobile Detailing, Automobile Restoration-Antique & Classic, Car Wash, Glass-Auto, Plate, Window, Etc, Truck Body Repair & Painting, Truck Painting & Lettering, Truck Service & Repair, Windshield Repair",,,A+,,,https://i1.ypcdn.com/blob/15f4337e85f3d150f54bdf1df32c5eb275f3fe62_100x100_crop.jpg?adceb05,"Building OUR future through service to YOU.","*Major & Minor Collision Repair *Complete Paint & Touch-ups *Car Rentals *Fleet Accounts Welcome *Accept All Insurance Claims, Trucks, Cars","Mon - Fri: 8:00 am - 5:30 pm Sat: 9:00 am - 1:00 pm",,,,,,http://www.domesticandforeignauto.com,,,,,,,,,
3774061,1230660,"2020-09-27 04:30:04","Across the Bridge Auto Services",http://autodetailingbyronthompson.com,detailsbyron@msn.com,"(503) 308-6875","18130 SE Division St Suite G",Portland,OR,97236,"18130 SE Division St Suite G,Portland,OR 97236","Automobile Customizing, Automobile Accessories, Automobile Detailing, Automobile Restoration-Antique & Classic, Automobile Upholstery Cleaning, Boat Cleaning, Boat Painting & Lettering, Car Wash, Dent Removal, Glass Coating & Tinting, Glass Coating & Tinting Materials, Glass-Auto, Plate, Window, Etc, Glass-Automobile, Plate, Window, Etc-Manufacturers, Motor Homes, Recreational Vehicles & Campers, Recreational Vehicles & Campers-Repair & Service, Rustproofing & Undercoating-Automotive, Steam Cleaning, Steam Cleaning Automotive, Truck Body Repair & Painting, Truck Painting & Lettering, Upholstery Cleaners, Window Tinting, Windows-Repair, Replacement & Installation, Windshield Repair",,,,45.50404,-122.47642,,,,,,,,,,http://autodetailingbyronthompson.com,,,,,,,,,
3777730,1232170,"2020-09-27 04:30:18","Steve Stymeist Auto Body",http://www.stymeistautobody.com,bramsey@stymeistautobody.com,"(530) 622-7588",,Placerville,CA,95667,"Placerville,CA 95667","Automobile Body Repairing & Painting, Auto Repair & Service, Auto Springs & Suspension, Automobile Body Shop Equipment & Supplies, Brake Repair, Car Wash, Tire Dealers, Towing, Truck Painting & Lettering, Wheel Alignment-Frame & Axle Servicing-Automotive, Windshield Repair",5,"1 Review",A+,,,,,,"Mon - Fri: 8:00 am - 5:00 pm Sat: 9:00 am - 1:00 pm Sun Closed","Phone: (530) 622-0353 Fax: (530) 622-0353 TollFree: (888) 742-3888",,"all major credit cards, debit, check",,"Stymeist Inc Steve Stymeist Auto Body-Paint","http://www.stymeistautobody.com https://www.stymeistautobody.com","Parking: Lot, Free","Cullen A.",07/24/2015,five,"Stymeist is a wonderful company with incredible service. I recommend going here for all your car repairs. They are prompt, helpful, and did wonderful work on my car.",,,,
4166793,1322012,"2020-09-27 04:38:18",Signcrafters,http://signcraftersgv.com,sidney@signcraftersonline.com,"(530) 273-1494",,"Grass Valley",CA,95949,"Grass Valley,CA 95949","Sign Lettering, Carpenters, Graphic Designers, Signs, Signs-Maintenance & Repair, Truck Painting & Lettering, Wood Carving, Woodworking",5,"1 Review",,,,https://i1.ypcdn.com/blob/71a9a1d4942e614deff0b989057be3a41d556f2e_100x100_crop.jpg?8ad0f92,,"Professional Reliable Creative Banners Vehicles Carved Gold Leaf Sand Blasted A-Frames Magnetics","Mon - Fri: 8:00 am - 5:30 pm",,,,,,http://signcraftersgv.com,,len.gorsky,08/28/2013,five,"Great design, solid construction, quick service and fair price. Couldn't ask for more. Sam was a joy to work with.",,,,
5291809,1571591,"2020-09-27 05:01:45","Ad Craft Sign",https://adcraftsignco.com,adcraft165@aol.com,"(302) 992-0700","334 B And O Ln",Wilmington,DE,19804,"334 B And O Ln,Wilmington,DE 19804","Truck Painting & Lettering, Architects & Builders Services, Architectural Designers",,,A+,39.73357,-75.59163,,,"It seems that truck lettering has been around since the dawn of time. Even before Henry Ford started rolling trucks off the assembly line, businesses have been lettering their trucks. Back in the day most lettering was painted onto the vehicle. Eventually painting evolved into vinyl vehicle lettering, and today into digitally printed vinyl vehicle wraps. Today, trucks are either lettered or wrapped, but which is best for your business? Here are some thoughts to help guide you. Branding Consistency - Whether you are a one truck company or a 1000 vehicle fleet, the idea is to present a brand consistency between all of your marketing collateral. Truck lettering does allow to a certain extent the recreation of your business logo, however if your logo incorporates any gradients or shadowing, a wrap would be the better option. Also the wrap offers more flexibility in terms of size and vehicle location. Brand Perception - Recent statistics have shown that over 35% of viewers form an opinion about the company based on their vehicle graphics. I have seen truck lettering that is very tasteful and makes great use of white space, leaving a great first impression. On the other had, I've seen trucks that are littered with bad color combinations and bullets upon bullets of services offered. A properly designed vehicle wrap can also give a great first impression, but look to avoid loud and proud wraps. Tasteful will always get the job done in either case. Lead Generation - With the recall rate of vehicle wraps being over 90%, truck wraps have the potential of drawing lots of attention, creating a buzz, and getting your business noticed. Truck lettering can still draw attention, but they lack the wow factor of wraps. As you can see both truck lettering and wraps have their advantages. In either case I recommend that you look to maximize the power of the miles you are driving everyday and create graphics that make full use of the vehicle canvas. If you are driving ar","Mon - Fri: 7:00 am - 5:00 pm Sat - Sun Closed",,,"amex, cash only, debit, discover, money order, visa, master card",,,https://adcraftsignco.com,,,,,,,,,
5606658,1675956,"2020-09-27 05:13:39","CRE@TIVE INC. PRINTING SIGNS AWNING",http://www.illustratedsigns.com,adstudios@hotmail.com,"(917) 860-9720","55 W 55th St Ph 208","New York",NY,10019,"55 W 55th St Ph 208,New York,NY 10019","Truck Painting & Lettering, Awnings & Canopies, Decals, Graphic Designers, Neon Novelties, Painting-Production, Printing Services, Signs, Signs-Maintenance & Repair, Vehicle Wrap Advertising, Web Site Design & Services",4,"5 Reviews",,40.76264,-73.977,https://i2.ypcdn.com/blob/a8e11d9101f11b992fb779b4d8c7d68d5f249bba_100x100_crop.jpg?cbd0284,"Most complete design firm","We offer custom Signs, Awning, vinyl lettering, and graphics. We can provide you with graphic designs. Our creative artists will offer many solutions for your signage needs. Store advertising is the most inexpensive type of advertising for most businesses, With a vehicle graphic wrap you can impress your clients and acquire visibility for new one. Give your website a new look with our creative artists, with a new branding of your business. Refurbish your store signage with our awning and signage repair team. We also manufacture retractable awnings. Same day dot lettering for new york, printing and sign repair. Give us a Call today! Tel:212.470.2582","Mon - Fri: 9:00 am - 5:00 pm Sat - Sun Closed",,,"amex, visa, discover, mastercard, all major credit cards, check",,,http://www.illustratedsigns.com,,"Ric S.",01/11/2019,five,"Best in the industry, call for an appointment and you'll love their professionalism. Fo signs awnings or truck lettering","Johnny G.",11/05/2017,five,"Great installers and they go out of their way to make the client happy. They won't ask you for a deposit until job is 100% completed. They also will give you a warrantee no one else will give you. Life time and they will fix it repair it"
5631379,1684207,"2020-09-27 05:14:32","SIGNS & AWNINGS ""R"" US",http://www.signsnmore.jimdo.com,creativesanchez09@gmail.com,"(646) 954-5537","39-2 111th St",corona,NY,11368,"39-2 111th St,corona,NY 11368","Signs, Awnings & Canopies, Awnings & Canopies-Repair & Service, Banners, Flags & Pennants, Graphic Designers, Murals, Neon Novelties, Printing Consultants, Printing Services, Sign Lettering, Signs-Maintenance & Repair, Store Fixtures, Store Fixtures-Used, Store Fronts, Truck Painting & Lettering, Web Site Design & Services, Web Site Hosting, Yard Signs",,,,40.74529,-73.86107,https://i2.ypcdn.com/blob/9f1dae7c6ab7dc0e2b94bbc16d459f93d45e95b8_100x100_crop.jpg?cbd0284,,"At our core, we, at Creative Inc., believe that each and every customer of ours deserves to receive the best possible quality. This is why our team always works hard toward this goal and gives only unique ideas and innovative solutions. What Sets Us Apart from the Other Shops in New York, New Jersey? The people working at our local sign shop are very creative and talented individuals who always satisfy the needs of our clients. Whether it comes to a concept development or graphic printing service, they have the know how and skills to deliver outstanding results that will amaze you. Put your trust in our diverse capabilities to make the most out of your investment. Why Should You Trust Creative Inc? We opened our local sign shop in N.Y and N.J more than 20 years ago and over this time, we have been providing our customers with innovative and stylish ideas. Whether it is an advertisement campaign or just logo creation, we will show you what flawless services are. Our skills, innovative thinking, and years of experience in this industry make our team the right choice for you. If you are interested in learning more about our excellent graphics printing service or you just would like to book an appointment, call us at (212) 470.2582 anytime you can. We accept calls 24/7.","Hours Appointment Only Hours Mon - Sun Open 24 Mon - Sun: Open 24 Hours Holiday Hours 2020/01/01 Closed",,,"amex, discover, all major credit cards, visa, mastercard, no credit cards, atm, cash, cash only, check, jcb, carte blanche, android pay, apple pay, samsung pay, diners club, financing available, invoicing available, travelers checks, insurance, company card",,"best prices in town",http://www.signsnmore.jimdo.com,,,,,,,,,
5650198,1690425,"2020-09-27 05:15:12","Eco Sign Solutions",http://www.ecosignsolutions.net,dave@EcoSignSolutions.net,"(734) 276-8585","45 Enterprise Dr","Ann Arbor",MI,48103,"45 Enterprise Dr,Ann Arbor,MI 48103","Editorial & Publication Services, Advertising Specialties, Advertising-Promotional Products, Banners, Flags & Pennants, Graphic Designers, Internet Products & Services, Outdoor Advertising, Printing Services, Sign Lettering, Signs, Signs-Erectors & Hangers, Signs-Maintenance & Repair, Truck Painting & Lettering, Web Site Design & Services",5,"1 Review",,42.29408,-83.86959,,"Where Old Fashioned Wisdom Meets Today's Technologies.","Welcome to Eco Sign Solutions! We are your home town sign company that provides you with all the necessary signage for your business. Our services include new signs, repair and maintenance, vinyl and vehicle graphics, LED lighting, neon replacements and much much more. We want to save you money and advise you on how to go green. Are you looking for someone who can design your logo, build your sign, create & install graphics? Do you want someone who can also personally build, install, and maintain all of your signage needs? Keep in mind we can do it all. Why hire a graphic design company to create your logo and branding, then turn around and hire a sign company to build your sign, and maybe another sign company to repair and maintain it? With that being said call Eco Sign Solutions where old fashion wisdom meets today technologies, and let our expertise, experience and knowledge work for you.","Mon - Fri: 8:30 am - 5:00 pm","MobilePhone: (734) 276-8585",,"check, debit, cash, all major credit cards",,"ESS Eco Signs David Small",http://www.ecosignsolutions.net,"Parking: Lot","Dave S.",03/18/2013,five,,,,,
5701742,1707619,"2020-09-27 05:16:45","lui designs",http://www.azautographics.com,azautographics@gmail.com,"(480) 650-9314",,Surprise,AZ,85374,"Surprise,AZ 85374","Truck Painting & Lettering, CAD Systems & Services, Computer Graphics, Sign Lettering, Web Site Design & Services",,,,,,,,"Surprise Arizona creative design service for small business and home based entrepreneurs. We offer web design, hosting, graphic design, CAD drafting service, logo design, vector conversion and vinyl graphics.",,,,"paypal, all major credit cards, debit",,,"Specialize in custom vehicle vinyl graphics like flames, flags, tribal designs, combo kits, signs specialize in creative design services for Small Business and home based entrepreneurs.",,,,,,,,,
5712592,1711141,"2020-09-27 05:17:10",SJL-FX,http://sjlfx.com,sjlfx@yahoo.com,"(508) 414-7929",,,,,,"Truck Painting & Lettering, Graphic Designers, Web Site Design & Services",,,A+,,,,"Vinyl Lettering/Graphics, Logo Design, Vector Creation/Conversion, Signs, Airbrush Work, and much more...","SJL-FX Custom Paint & More",,,,,,,http://sjlfx.com,,,,,,,,,
5720706,1713762,"2020-09-27 05:17:24","Holly's Signs Graphics & lettering",,hmstad@bellsouth.net,"(352) 208-0922","20110 SW 75th St",Dunnellon,FL,34431,"20110 SW 75th St,Dunnellon,FL 34431","Truck Painting & Lettering, Boat Painting & Lettering, Graphic Designers, Signs, Web Site Design & Services",,,,29.11106,-82.45476,,"Creatively showcasing your business","LETTERING . LOGO DESIGN . SIGNS WEBSITE DESIGN . MURALS COMMISSIONED ART WORK VEHICLE GRAPHICS AND LETTERING","Mon - Sat: 8:00 am - 5:00 pm Sun Closed",,,"all major credit cards, check, paypal",,,,,,,,,,,,
5725044,1715221,"2020-09-27 05:17:43","Digital Pallet Advertising",,,"(302) 725-7084","1 Helen St",Georgetown,DE,19947,"1 Helen St,Georgetown,DE 19947","Truck Painting & Lettering, Advertising Agencies, Outdoor Advertising, Signs, Web Site Design & Services",,,,38.64445,-75.33039,,"IMAGE IS EVERYTHING",,"Mon - Fri: 9:00 am - 5:00 pm Sat: 11:00 am - 3:00 pm Sun Closed","Mon - Fri 9am - 5pm: (302) 725-7084",,"debit, check, paypal, all major credit cards, financing available",,,,,,,,,,,,
5729825,1716800,"2020-09-27 05:17:46","Vox Vinyls",,info@voxvinyls.com,"(425) 320-4744",,Everett,WA,98208,"Everett,WA 98208","Truck Painting & Lettering, Boat Painting & Lettering, Garments-Printing & Lettering, Graphic Designers, Sign Lettering, Signs, Web Site Design & Services",,,,,,,"Display your voice. Our business is your solution.",,"Mon - Sun: 9:00 am - 9:00 pm",,,,,,,,,,,,,,,
5741830,1720763,"2020-09-27 05:18:08","Graphic Visions Inc",http://www.graphicvisionsinc.com,contact@graphicvisionsinc.com,"(248) 504-2798","16857 Northville Rd",Northville,MI,48168,"16857 Northville Rd,Northville,MI 48168","Web Site Design & Services, Advertising Specialties, Editorial & Publication Services, Graphic Designers, Internet Products & Services, Marketing Consultants, Marketing Programs & Services, Signs, Truck Painting & Lettering",5,"2 Reviews",,42.40901,-83.46962,https://i2.ypcdn.com/blob/d4ff0bec0bf5048ed4f72d84b61d1d07260935ca_100x100_crop.jpg?cbd0284,"Offering a variety of creative, low-cost marketing solutions that businesses of all sizes need to stand out in todays marketplace.","In business since 1986, Graphic Visions, Inc. features an in-house graphic design, printing department, and a custom sign fabrication shop. We've got the facilities to handle jobs from start to finish. Our talented design professionals, business marketing strategists, sign experts and detail-oriented account representatives have the knowledge and experience to produce dynamic, affordable marketing materials that will help your business succeed.","Mon - Fri: 7:30 am - 4:30 pm Sat - Sun Closed",,,"visa, check, mastercard",,GVI,http://www.graphicvisionsinc.com,"Specialties: Trucks","Chris W.",02/07/2017,five,"""Sue and her Crew are Great, They have always been able to make our Ideas come to light. There graphics are always bright and Clear and make our Golf Carts Pop with Flair when we add them to one of Custom Golf Carts. We do not trust anyone else for all our Graphic Designs. If you are looking for Professional Graphics make sure to See Sue at Graphic Visions. Chris Green Oak Golf ...""morecarts""less","Chris W.","Edited: 02/07/2017",five,"Sue and her Crew are Great, They have always been able to make our Ideas come to light. There graphics are always bright and Clear and make our Golf Carts Pop with Flair when we add them to one of Custom Golf Carts. We do not trust anyone else for all our Graphic Designs. If you are looking for Professional Graphics make sure to See Sue at Graphic Visions. Chris Green Oak Golf carts"