business_x_category.id,business.id,business.ts,business.business_name,business.home_page,business.email_address,business.phone,business.street,business.city,business.state,business.zip_code,business.full_address,business.category,business.rating,business.number_of_reviews,business.bbb_rating_or_license,business.latitude,business.longitude,business.cover_image,business.slogan,business.general_info,business.regular_hours,business.extra_phones,business.services_products,business.payment,business.price_range,business.aka,business.other_links,business.other_information,business.review_1_name,business.review_1_date,business.review_1_rating,business.review_1_text,business.review_2_name,business.review_2_date,business.review_2_rating,business.review_2_text
688992,238171,"2020-09-27 02:53:15","Advanced Delivery Service, LLC",https://www.facebook.com/Advanced-Delivery-Service-334701396561498,kimberly@advanceddeliveryservice.com,"(801) 886-2110","3752 W 2270 S","West Valley City",UT,84120,"3752 W 2270 S,West Valley City,UT 84120","Delivery Service, Courier & Delivery Service, Local Trucking Service, Mail & Shipping Services, Messenger Service, Packaging Service, Shipping Services, Trucking, Trucking-Heavy Hauling, Trucking-Motor Freight",,,,40.72223,-111.98076,,"Fastest & Reliable Hot Shot And Expedited Delivery Service. Call Now!","Specialized In All Your Delivery Needs. Advanced Delivery Service, LLC is a family owned hot shot delivery and local delivery service company serving the Salt Lake City, UT area from Logan to Payson and Tooele to Park city. Chris Wilkinson started Advanced Delivery Service in 2002 with one cargo van. Over the years Advanced Delivery Service also incorporated full service local pickup and delivery services. Today, Advanced Delivery Service can handle anything from a little envelope to a 65,000 lb. oversized piece of machinery and anything in between. From extremely hot freight to next day, specializing in hot shot delivery and local delivery service, we do it all! Our services include: Hot shot delivery Expedited delivery White glove delivery Cartage 1lb to 65,000lb Courier service Cross dock service Residential deliveries Pack and crate Advanced Delivery Service is licensed, insured, and BBB accredited. Our drivers are TSA certified and highly dependable. You can be sure that your delivery will be made on time and in good condition. Call Advanced Delivery Service, LLC and we will take care of your delivery needs today!","Mon - Sun: Open 24 Hours",,,"no credit cards, mastercard, visa, cash, check",,,Facebook,,,,,,,,,
693350,239324,"2020-09-27 02:53:24","Marietta Big Truck Parking & Storage",http://www.storemytruck.com,keithccars@aol.com,"(678) 769-9565","785 Pickens Drive Ext",Marietta,GA,30062,"785 Pickens Drive Ext,Marietta,GA 30062","Movers & Full Service Storage, Automobile Storage, Cargo & Freight Containers, Parking Lots & Garages, Trucking, Trucking Transportation Brokers, Trucking-Heavy Hauling",,,,33.97036,-84.52379,,,,"Mon - Sat: 9:00 am - 7:00 pm Sun: 11:00 am - 5:00 pm","Phone: (678) 570-8380",,"visa, discover, mastercard, all major credit cards, check, debit, amex",,,http://www.storemytruck.com,"Parking: Lot",,,,,,,,
695061,239892,"2020-09-27 02:53:25","GA Truck Parking",http://www.gatruckparking.com,info@gatruckparking.com,"(404) 328-6095",,McDonough,GA,30253,"McDonough,GA 30253","Parking Lots & Garages, Trucking, Trucking-Heavy Hauling",,,,,,,,"Monthly truck parking close to I-75.",,,,,,,http://www.gatruckparking.com,,,,,,,,,
697515,240675,"2020-09-27 02:53:34","RVS LINE LLC",http://www.rvslineinc.com,rvsrecruiting@gmail.com,"(916) 209-4777","8732 Fruitridge Rd",Sacramento,CA,95826,"8732 Fruitridge Rd,Sacramento,CA 95826","Parking Lot Maintenance & Marking, Truck Driving Schools, Truck Service & Repair, Trucking-Heavy Hauling, Vehicle License & Registration",,,,38.52459,-121.37949,,,,"Mon - Fri: 8:00 am - 5:30 pm","Phone: (916) 550-9851",,"check, cash, all major credit cards",,,http://www.rvslineinc.com,,,,,,,,,
698348,240921,"2020-09-27 02:53:34","Eastwood Towing Inc",https://eastwoodtowingct.com,eastwoodtowing@sbcglobal.net,"(203) 754-4171","3080 E Main St",Waterbury,CT,06705,"3080 E Main St,Waterbury,CT 06705","Parking Lots & Garages, Auto Repair & Service, Automobile Transporters, Crane Service, Machinery Movers & Erectors, Mobile Home Transporting, Movers, Shipping Services, Towing, Towing Equipment, Truck Trailers, Trucking, Trucking-Heavy Hauling",5,"3 Reviews",A+,41.54553,-72.98521,//i3.ypcdn.com/blob/2438a020ed205a2ad6aa2ae4d6f18c80c86f89a9_100.png?63f80dd,,"Welcome to Eastwood Towing Inc. We have been providing emergency towing and roadside services for every make and model of cards, vans, sports utility vehicles, and trucks -That's pickup trucks and semi's and everything in between. We have proudly served New Haven County CT since 1933, 24 hours a day and 7 days a week. For speedy, professional service contact Eastwood whenever you need towing or emergency roadside assistance. Se Habla Espa?ol! Experienced and dependable towing services is what we are noted for at Eastwood Towing. Our tow trucks and drivers will respond to you promptly, getting you and your vehicle up and moving again in a safe, secure manner.","Mon - Sun: Open 24 Hours",,,"cash, master card, visa, discover, amex",,,https://eastwoodtowingct.com,,"Kellie L.",04/13/2016,five,"Used Eastwood twice with roadside assistance. ..both times they arrived quickly, did a great job towing my daughter's car and were very professional.....would def recommend","Robert G.",12/21/2015,five,"Eastwood Drive was professional and courteous upon arriving on the scene of our accident. He allowed us to get our belongs. Experience was very good besides getting hit."
699161,241174,"2020-09-27 02:53:42","South Atlanta Big Rig TRUCK STOP Parking",http://www.storemytruck.com,storemytruck@gmail.com,"(678) 631-7275","4142 Stacks Rd",Atlanta,GA,30349,"4142 Stacks Rd,Atlanta,GA 30349","Trucking-Heavy Hauling, Parking Lots & Garages, Storage Household & Commercial, Trucking, Trucking Transportation Brokers",5,"1 Review",,33.60964,-84.52491,,,,"Mon - Sun: 9:00 am - 7:00 pm",,,"cash only",,,http://www.storemytruck.com,,"Keith C.",07/16/2016,five,"This is a great place to store Trucks, Tractor Trailers and Dump Trucks and the operators are nice people!",,,,
700279,241524,"2020-09-27 02:53:42","CB Asphalt Maintenance",http://www.cbasphaltmaintenance.com,Vicki@cbasphaltpaving.com,"(734) 341-0438","8625 Oakville Waltz Rd",Belleville,MI,48111,"8625 Oakville Waltz Rd,Belleville,MI 48111","Asphalt Paving & Sealcoating, Building Contractors-Commercial & Industrial, Excavation Contractors, General Contractors, Parking Lot Maintenance & Marking, Pavement & Floor Marking Services, Trucking-Heavy Hauling, Trucking-Light Hauling",,,,42.0842,-83.53413,https://i3.ypcdn.com/blob/2b192b0f67f617574a3b3015ed108d5f963adc8d_100x100_crop.jpg?63f80dd,"""Quality is our specialty""","We have 20 years of Asphalt Paving in Michigan and sealcoating experience and strive to exceed our customer's expectation, delivering the best Asphalt contractor experience on the market. Friendly and knowledgable sales staff will help provide information and piece of mind about your asphalt project, alleviating the stress of working with contracting services.","Mon - Sun: 9:00 am - 5:00 am",,,"visa, mastercard, amex, cash, check, financing available",,,"Primary Website",,,,,,,,,
704108,242657,"2020-09-27 02:53:50","Mableton Dump-Truck Parking & Storage",http://www.storemytruck.com,storemytruck@gmail.com,"(678) 631-7275","1889 Freeman Pkwy",Mableton,GA,30126,"1889 Freeman Pkwy,Mableton,GA 30126","Dump Truck Service, Parking Lots & Garages, Storage Household & Commercial, Trucking Transportation Brokers, Trucking-Heavy Hauling",5,"1 Review",,33.80871,-84.49838,https://i4.ypcdn.com/blob/c2e75cc79ec19d8d37a1d9989342fdbab3a4acab_100x100_crop.jpg?63f80dd,,,"Mon - Sat: 9:00 am - 7:00 pm Sun: 11:00 am - 5:00 pm",,,"visa, discover, mastercard, all major credit cards, check, debit, amex",,,http://www.storemytruck.com,,"Keith C.",09/13/2016,five,"Its a great place to park..... DROP LOT, Container, Truck, tractor trailer, Semi, Boat or RV Storage, Atlanta Commercial Trucks Try another choice... for Container, Truck, trailer, Boat or RV Storage... Atlanta Commercial Truck Parking has 10 locations in Atlanta at www.StoreMyTruck.com 10 Locations to park your truck... 9. At address 4650 Stacks Road College Park Georgia 30126, South Atlanta Tractor Trailer Parking & Storage ,LLC #2 is an open 7.6 acre lot on established gravel and some pavement. This busy location has amenities of Truck Scales, Offices for lease, Diesel Mechanics Shop, Rec Room, Bunk Rooms, Snack Area, Large entrance, Wide aisles, Key locked gate and secure 6 foot barb wired fencing. This location is easy to access and located off exit 61 off I-285 and just past the Roosevelt Highway. We are opening many more lots around Atlanta including Conyers, Norcross, Tucker, and more! Call us at 678-631-P-A-R-K",,,,
729856,250832,"2020-09-27 02:54:43","Stapleton Timber And Excavation",,,"(541) 461-1965","1709 Irving Rd",Eugene,OR,97402,"1709 Irving Rd,Eugene,OR 97402","Excavation Contractors, Concrete Contractors, Demolition Contractors, Driveway Contractors, Dump Truck Service, Grading Contractors, Logging Companies, Parking Lots & Garages, Septic Tanks & Systems, Sewer Contractors, Timber & Timberland Companies, Trucking-Heavy Hauling",,,,44.10353,-123.16495,,,,,"Phone: (541) 461-0729 Fax Number: (541) 461-0729",,,,"Stapleton Timber & Excavation",,"Specialties: Grading, Parking Lots, Parking Areas, Subdivision Development, Real Estate Development, Site Work, Driveways Services: Septic System Repair, Septic Tank Cleaning",,,,,,,,
731395,251395,"2020-09-27 02:54:54","ACM Contracting, LLC",,angela@acmcontractingllc.com,"(318) 451-4927","P.O. Box 3995",Pineville,LA,71361,"P.O. Box 3995,Pineville,LA 71361","Parking Lot Maintenance & Marking, Asphalt Paving & Sealcoating, Paving Contractors, Trucking-Heavy Hauling",,,,31.3324,-92.4085,https://i3.ypcdn.com/blob/10a980186a323666f083f1af81dead9db95db8de_100x100_crop.jpg?63f80dd,,"Asphalt and Concrete Pavement Asphalt Sealcoating Crack and Joint Sealing Pavement Markings Trucking",,"Phone: (318) 704-5388 Fax: (318) 704-5389",,,,,,,,,,,,,,
744009,255790,"2020-09-27 02:55:30","C & H Paving, Inc.",http://www.candhpaving.com,chpavinginc@bellsouth.net,"(706) 595-5351","204 Main Street",Thomson,GA,30824,"204 Main Street,Thomson,GA 30824","Asphalt Paving & Sealcoating, Asphalt & Asphalt Products-Wholesale & Manufacturers, Driveway Contractors, Parking Lot Maintenance & Marking, Trucking-Heavy Hauling",,,,33.46772,-82.50286,,,,"Mon - Fri: 8:00 am - 5:00 pm",,,,,,"http://www.candhpaving.com https://www.candhpaving.com",,,,,,,,,
756657,260409,"2020-09-27 02:55:52","Glenn Tech Enterprises",,jggilliam@gmail.com,"(828) 334-7007","82 Ridge Rd",Candler,NC,28715,"82 Ridge Rd,Candler,NC 28715","Building Construction Consultants, Arborists, Building Contractors, Construction Consultants, Driveway Contractors, Excavation Contractors, Fence-Sales, Service & Contractors, Parking Lot Maintenance & Marking, Retaining Walls, Sand & Gravel, Tree Service, Trenching & Underground Services, Trucking-Heavy Hauling",,,,35.579067,-82.71287,https://i3.ypcdn.com/blob/507a84fddff97056d835deabafde9f66e25861b9_100x100_crop.jpg?63f80dd,"For all your outdoor construction projects and improvements",,"Mon - Fri: 8:00 am - 5:00 pm",,,"cash, check",,,,,,,,,,,,
841145,286117,"2020-09-27 02:58:23",1-855-YOU-LOAD,,1855youload@gmail.com,"(855) 968-5623",,Fremont,CA,94538,"Fremont,CA 94538","Trucking-Heavy Hauling, Rubbish & Garbage Removal & Containers, Thrift Shops, Trash Hauling, Trucking-Light Hauling",,,,,,,"WE BRING THE TRUCK...YOU LOAD IT!","WE WILL HAUL AWAY YOUR USED GOODS FOR FREE!! NO JUNK ACCEPTED...","Mon - Sat Closed Sun: 2:00 pm - 6:00 pm",,,,,,,,,,,,,,,
948827,311169,"2020-09-27 03:01:01","Bennett Transportation",http://www.freenom.link/en/index.html?lang=en,bennetttransport@live.com,"(605) 381-5492","14462 139th Pl",Piedmont,SD,57769,"14462 139th Pl,Piedmont,SD 57769","Stone Natural, Boat Equipment & Supplies, Boat Trailers, Boat Transporting, Building Contractors, Building Materials, Crushed Stone, Lumber, Lumber Carriers, Lumber-Wholesale, Masonry Contractors, Recycling Centers, Sand & Gravel, Shipping Services, Stone Products, Stone-Retail, Transportation Services, Trash Hauling, Trucking, Trucking-Heavy Hauling, Wood Products",,,,44.21909,-103.26927,,"You Name It. We Haul It.","Bennett Transportation is a professional quality hauling company. Our specialties include livestock hauling, dirt hauling, gravel hauling, asphalt hauling, hay hauling, and more. A large part of our success has been due to a reputation of professionalism, honesty, and skill in this field. For more information, call us today.","Mon - Sun: Open 24 Hours",,,"check, money order, cash",,,http://www.freenom.link/en/index.html?lang=en,,,,,,,,,
955481,312659,"2020-09-27 03:01:11","Mayo Farms",,mayofarmsinc@gmail.com,"(336) 599-0604","1373 High Plains Rd",Roxboro,NC,27574,"1373 High Plains Rd,Roxboro,NC 27574","Stone Natural, Air Cargo & Package Express Service, Building Contractors, Crushed Stone, Excavation Contractors, Fill Contractors, Garden Centers, General Contractors, Greenhouses, Masonry Contractors, Nursery & Growers Equipment & Supplies, Sand & Gravel, Shipping Services, Stone Natural-Wholesale & Manufacturers, Stone Products, Stone-Retail, Topsoil, Trucking, Trucking-Heavy Hauling",,,A+,36.5198,-78.84771,,,"Mayo Farms Inc provides private and contract hauling of gravel, asphalt, fill dirt, sand, stone and riprap. We are insured and also deliver product to you. We also work in land & lot clearing. Locally owned and operated.","Mon - Fri: 7:00 am - 5:00 pm Sat - Sun Closed","Phone: (336) 599-0074",,cash,,,,"Specialties: Gravel",,,,,,,,
957986,313233,"2020-09-27 03:01:14","MacFarlane Excavating & Earth Products",,,"(989) 893-9300","2711 Center Ave",Essexville,MI,48732,"2711 Center Ave,Essexville,MI 48732","Trucking-Heavy Hauling, Building Contractors, Building Materials, Demolition Contractors, Excavation Contractors, Landscaping Equipment & Supplies, Lawn & Garden Equipment & Supplies, Mulches, Sand & Gravel, Shipping Services, Stone Natural, Trucking, Trucking-Motor Freight",,,,43.59567,-83.85048,,"MacFarlane Trucking & Excavating - Better Than You Expected!","For over thirty-five years MacFarlane Trucking & Excavating has offered a full range of trucking and excavating services. From septic systems, driveways, demolition, bulldozing, site preparation, water & sewer lines, grading, trenching, ditch digging, basements, asphalt patching, and bobcat work. To hauling dirt, top soil, sand, stone, mulch, asphalt, or whatever else we can put in a truck. We also have a landscape materials yard on Center Avenue in Essexville (across from KFC) where you can get natural cedar mulch, dyed pine mulches, hardwood mulch, field stone, boulders, decorative stone, pool sand, fill sand, mason sand, paver base, screened top soil. rubber mulch, and driveway stone. WE CAN EVEN HELP WITH YOUR LANDSCAPE PROJECTS! Stop in and see our new gazebo and pergola display!","Mon - Fri: 9:00 am - 5:00 pm Sat - Sun Closed","Georgia's Cell Phone: (989) 971-9916",,"cash, all major credit cards",,,,,,,,,,,,
960092,313710,"2020-09-27 03:01:15","Boren Contracting",https://boren-contracting-llc.business.site,rion_boren@yahoo.com,"(573) 330-3028","8944 Crossman Rd","Bonne Terre",MO,63628,"8944 Crossman Rd,Bonne Terre,MO 63628","Stone Natural, Building Contractors, Building Materials, Crushed Stone, Dump Truck Service, Excavation Contractors, General Contractors, Landscape Contractors, Landscaping & Lawn Services, Lime & Limestone, Masonry Contractors, Recycling Centers, Sand & Gravel, Shipping Services, Snow Removal Service, Stone Products, Stone-Retail, Topsoil, Trash Hauling, Trucking, Trucking-Heavy Hauling",,,A,37.97771,-90.57237,,,"Boren Contracting LLC for all of your gravel, dirt, and sand needs. We spread for driveways as well, weather and site permitting. Mention this add when you call or message for 10% off !","Mon - Sat: 6:00 am - 8:00 pm Sun Closed",,,"cash, check, master card, visa",,,https://boren-contracting-llc.business.site,,,,,,,,,
966681,315165,"2020-09-27 03:01:26","Maguire's Hauling",http://www.maguireshaulinginc.com,ford88@embarqmail.com,"(863) 634-2944","6905 NE 2nd St",Okeechobee,FL,34974,"6905 NE 2nd St,Okeechobee,FL 34974","Sand & Gravel, Building Contractors, Crushed Stone, Demolition Contractors, Dump Truck Service, Masonry Contractors, Recycling Centers, Shipping Services, Stone Natural, Stone Products, Stone-Retail, Trash Hauling, Trucking, Trucking-Heavy Hauling",,,,27.2468,-80.75481,https://i1.ypcdn.com/blob/ead5fda24727e2606a9e8ae77dc5df9ace7cdffb_100x100_crop.jpg?f9d23e1,"We are here for all of your hauling and land needs","Maguire's Hauling, Inc., is a privately owned and operated dump truck service. We are here to provide you with the best service possible to meet your material delivery and removal needs. We deliver a wide array of materials for both landscaping and construction needs. Call us for today for more information!","Mon - Fri: 8:00 am - 5:00 pm Sat - Sun Closed",,,"check, discover, master card, visa",,,http://www.maguireshaulinginc.com,,,,,,,,,
971786,316317,"2020-09-27 03:01:28","Simpson Trucking & Grading Co",http://www.simpsontrucking.com,angiesimpson@simpsontrucking.com,"(678) 928-9456","1364 Candler Rd",Gainesville,GA,30507,"1364 Candler Rd,Gainesville,GA 30507","Erosion Control, Building Contractors, Crushed Stone, Demolition Contractors, Dump Truck Service, Excavation Contractors, General Contractors, Grading Contractors, Hydrologists, Masonry Contractors, Mulches, Recycling Centers, Sand & Gravel, Shipping Services, Stone Natural, Stone Products, Stone-Retail, Trash Hauling, Trucking, Trucking-Heavy Hauling",2,"4 Reviews",A+,34.26089,-83.81192,https://i2.ypcdn.com/blob/b8f31040a17c3739ea61cf593072fc679dc789d8_100x100_crop.jpg?f9d23e1,"At Simpson Trucking & Grading It Is All About ""Quality Not Quantity""","Simpson Trucking is a full-service contractor that offers various site construction services. The company offers a range of services, including cleaning, burning, grinding, grading, demolition, paving, striping, rock excavation, hydroseeding and grassing services. It is located in Gainesville, Ga., and maintains a fleet of more than 60 trucks and trailers. Simpson Trucking also provides bridges, box culverts, walls, spillways and concrete structures.","Mon - Sat: 6:00 am - 7:00 pm",,,"amex, discover, visa, mastercard",,,"http://www.simpsontrucking.com http://simpsontrucking.com/contact http://www.simpsontrucking.net","Specialties: Gravel, Sand, Heavy Equipment, Fill Dirt, Topsoil, Mulch Services: Sand Delivery","Rebecca M.",12/15/2016,one,"You people are a flipping joke! You belittle your workers, basically pay them in dog pooo! Don't train them properly! I wouldn't let you do work for me for free! Greg Simpson... Get off your high horse and treat your workers right! No need in putting someone down that has already been dealing with so much. Remember..... God giveth and he can taketh away! TO ALL YOUR WORKERS.... IF YOU NEED A JOB AND WANT TO BE RESPECTED FOR YOUR HARD WORK AND PAID ACCORDINGLY LET ME KNOW!","Anthony S.",06/05/2015,one,"Called 6/4/15 to have a load of dirt dumped at my house the next day. Spoke with an Adam I believe, he told me they would be there at 8am. I called at 9am the next day and they said all the trucks already went out and they could be there sometime before lunch. Now I'm sure everyone there is nice but punctuality is to important to me to find out. I ended up canceling my dirt."
974708,316982,"2020-09-27 03:01:28","Action Trucking Corp",https://actionpavingcorp.wixsite.com/actionpavingcorp,actionpavingcorp66@gmail.com,"(863) 593-7482",,,,,,"Dump Truck Service, Asphalt, Asphalt Paving & Sealcoating, Building Contractors, Crushed Stone, Excavation Contractors, Fill Contractors, Grading Contractors, Landscaping Equipment & Supplies, Lawn & Garden Equipment & Supplies, Lawn & Garden Equipment & Supplies Renting, Local Trucking Service, Sand & Gravel, Shipping Services, Stone Natural, Topsoil, Trash Hauling, Trucking, Trucking-Heavy Hauling, Trucking-Light Hauling, Trucking-Liquid Or Dry Bulk",,,,,,,"When Delivery Matters, Choose Action Trucking Corp","At Action Trucking Corp., we pride ourselves in always going that extra mile for our customers, after all, we credit our success to our strong commitment to total customer satisfaction. Family Owned and Operated for over 40yrs. We are capable of all your big or small delivery needs. Sand, Gravel, Fill Dirt, Crushed Stone, Shell Rock, and Topsoil, Asphalt Millings, Excavation Hauling, Construction site Clean up, Rip Rap, Gravel Paver, Sand, Crush Concrete and much more. Give us a call","Mon - Sat: 9:00 am - 5:00 pm",,,"all major credit cards, check",,"Action Paving & Seal Coating INC",https://actionpavingcorp.wixsite.com/actionpavingcorp,,,,,,,,,
976378,317395,"2020-09-27 03:01:33","F S Rod",,stacy.fsrod@hughes.net,"(209) 826-2541","19701S Canyon Rd","Los Banos",CA,93635,"19701S Canyon Rd,Los Banos,CA 93635","Stone Natural, Asphalt, Building Contractors, Concrete Aggregates, Concrete Equipment & Supplies, Crushed Stone, Masonry Contractors, Paving Materials, Rock Shops, Sand & Gravel, Shipping Services, Stone Products, Stone-Retail, Trucking, Trucking-Heavy Hauling",,,A+,37.00329,-120.90876,,,"* For All Your Sand & Gravel Needs * Caltrans Certified MBE * Please Call for Additional Information Estimates or Price Quotes Available Saturdays by Appointment P o Box 2191 Los Banos CA, 93635","Mon - Fri: 9:00 am - 5:00 pm","Phone: (209) 587-0321",,"check, cash, all major credit cards",,,,,,,,,,,,
977725,317705,"2020-09-27 03:01:33","Carlyle Trucking Inc.",http://www.carlyletrucking.com,carlyletrucking@gmail.com,"(678) 725-9455","508 Chicken Lyle Rd",Winder,GA,30680,"508 Chicken Lyle Rd,Winder,GA 30680","Grading Contractors, Crushed Stone, Granite, Sand & Gravel, Trucking-Heavy Hauling",,,,34.02652,-83.75225,,,,,"Fax: (866) 392-4046",,"visa, master card, check, cash",,,http://www.carlyletrucking.com,,,,,,,,,
978651,317934,"2020-09-27 03:01:33","Blooming Glen Quarry",http://www.hkgroup.com/companies/blooming-glen-quarry,info@hkgroup.com,"(215) 257-5188","901 Minsi Trl","Blooming Glen",PA,18911,"901 Minsi Trl,Blooming Glen,PA 18911","Quarries, Crushed Stone, Stone Natural, Trucking-Heavy Hauling",,,,40.375942,-75.23759,,,"Crushed stone quarry, producing a full line of construction grade aggregates and asphalt batch plant, with storage silo capabilities, producing a wide variety of mix designs. We love homeowners!",,"Fax: (215) 257-2357",,"master card, check, visa",,,http://www.hkgroup.com/companies/blooming-glen-quarry,,,,,,,,,