business_x_category.id,business.id,business.ts,business.business_name,business.home_page,business.email_address,business.phone,business.street,business.city,business.state,business.zip_code,business.full_address,business.category,business.rating,business.number_of_reviews,business.bbb_rating_or_license,business.latitude,business.longitude,business.cover_image,business.slogan,business.general_info,business.regular_hours,business.extra_phones,business.services_products,business.payment,business.price_range,business.aka,business.other_links,business.other_information,business.review_1_name,business.review_1_date,business.review_1_rating,business.review_1_text,business.review_2_name,business.review_2_date,business.review_2_rating,business.review_2_text
720485,247893,"2020-09-27 02:54:22","ALINE PARKING LOT STRIPING",,,"(985) 662-2680","1110 W 25th Ave",covington,LA,70433,"1110 W 25th Ave,covington,LA 70433","Parking Lot Maintenance & Marking, Painting Contractors, Parking Lots & Garages, Pressure Washing Equipment & Services, Water Pressure Cleaning",,,,30.48446,-90.10771,,,,,,,,,,,,,,,,,,,
720824,247980,"2020-09-27 02:54:22","Blown Away",http://blownaway-potholes.com,info@blownawayusa.com,"(407) 864-1702","2730 Shute St",Orlando,FL,32805,"2730 Shute St,Orlando,FL 32805","Parking Lot Maintenance & Marking, Asphalt, Asphalt & Asphalt Products-Wholesale & Manufacturers, Asphalt Paving & Sealcoating, Building Contractors, Building Contractors-Commercial & Industrial, Concrete Breaking, Cutting & Sawing, Concrete Contractors, Construction Site-Clean-Up, Painting Contractors-Commercial & Industrial, Parking Lots & Garages, Parking Stations & Garages-Construction, Pavement & Floor Marking Services, Paving Contractors, Power Washing, Pressure Washing Equipment & Services, Property Maintenance, Sealers Asphalt, Concrete, Etc., Sweeping Service-Power, Tree Service, Water Pressure Cleaning",,,A+,28.54347,-81.41327,https://i3.ypcdn.com/blob/29a9674d1bf910edfdf9a1cb51f2f97c8b5af73f_100x100_crop.jpg?63f80dd,"1 Year Warranty, Satisfaction Guaranteed!","You will benefit from our approach because you will receive local, personalized service that has the resources of a national powerhouse behind it to get the job done right. Our franchise owners are motivated by their drive to succeed and our regional offices provide routine inspections of their work to ensure excellence.","Mon - Fri: 9:00 am - 5:00 pm","Phone: (407) 299-7884 TollFree: (866) 432-2890",,check,,,"Pothole Repairs http://blownawaycfl.com",,,,,,,,,
721803,248295,"2020-09-27 02:54:28","HERO Pressure Washing, LLC",http://app.fixxbook.com/Public/PublicProfile?eid=51226,support@fixxbook.com,"(361) 945-4963","Po Box 270462","Corpus Christi",TX,78427,"Po Box 270462,Corpus Christi,TX 78427","Pressure Washing Equipment & Services, Oil Field Service, Parking Lot Maintenance & Marking, Truck Washing & Cleaning, Water Pressure Cleaning",5,"1 Review",,27.7961,-97.4002,https://i3.ypcdn.com/blob/bce8d26a8a96f0362b6a035fadbaab4a6e94b176_100x100_crop.jpg?63f80dd,,,"Mon - Sun: Open 24 Hours",,,"check, mastercard, visa",,,http://app.fixxbook.com/Public/PublicProfile?eid=51226,,"Lupe M.",01/27/2018,five,"Luis and his crew really know how to get a truck clean. They werr abel to make sure our trucks look presentable all the time",,,,
722231,248422,"2020-09-27 02:54:28","Under Pressure Power Washing Services",,,"(337) 396-7890","P O Box 203",Rosepine,LA,70659,"P O Box 203,Rosepine,LA 70659","Parking Lot Maintenance & Marking, Deck Cleaning & Treatment, House Washing, Power Washing, Water Pressure Cleaning",1,"1 Review",,30.919914,-93.28239,,,,,,,,,,,,"Lena W.",08/27/2016,one,"Don't ever use this business they're argumentative they promise things they can't deliver and they ask for money up front before the job is even done the lady Tony is rude and thinks that her lies don't catch up to her",,,,
722344,248466,"2020-09-27 02:54:28","Pop's Pressure Washing, LLC",,,"(769) 798-4414",,,,,,"Parking Lot Maintenance & Marking, Building Maintenance, Power Washing, Water Pressure Cleaning",,,,,,,"Let us take the pressure out of your power washing!","Residential, Commercial and Fleet mobile washing services",,,,,,,,,,,,,,,,
722617,248558,"2020-09-27 02:54:28","Quality Pressure Washing and property Maintanance",,,"(760) 686-1623","12423 San Ysidro St",Victorville,CA,92392,"12423 San Ysidro St,Victorville,CA 92392","Water Pressure Cleaning, Cleaning Contractors, Parking Stations & Garages-Construction",,,,34.47635,-117.38009,,,"В• Sweeping, Pressure Washing Steam Cleaning, Sidewalk Cleaning Porter Services Construction Clean Up, Illegal Dump Removal, Graffiti removal, Vacant Unit Clean Up, commercial sweeping, street sweeping, house cleaning, property maintenance, commercial cleaning,","Mon - Fri: 8:00 am - 5:00 pm Sat - Sun Closed",,,"all major credit cards, mastercard, discover, amex, visa",,,,,,,,,,,,
722658,248574,"2020-09-27 02:54:28","Straightline Painting",,,"(831) 521-5793",,,,,,"Parking Lot Maintenance & Marking, Deck Cleaning & Treatment, Painting Contractors, Wall Coatings, Water Pressure Cleaning",,,,,,,,,,,,,,,,,,,,,,,,
723185,248726,"2020-09-27 02:54:28","Valley Power Sweep",http://www.phoenixpowersweep.com,toddw@phoenixpowersweep.com,"(602) 278-3359","2102 S 5th Ave",Phoenix,AZ,85003,"2102 S 5th Ave,Phoenix,AZ 85003","Parking Lot Maintenance & Marking, Parking Lots & Garages, Street Cleaning, Water Pressure Cleaning",5,"1 Review",A+,33.42822,-112.08078,,,,"Mon - Sun: Open 24 Hours",,,"check, all major credit cards",,"Valley Power Sweep, LLC. Phoenix AZ Power Sweep, Inc. Phoenix Power Sweep",http://www.phoenixpowersweep.com,,"Joanna E.",04/08/2016,five,"Phoenix Power Sweep provides great services at amazing prices. I will continue to highly recommend them to everyone.",,,,
725986,249618,"2020-09-27 02:54:32","IQ Painters",,hello@iqpainters.com,"(407) 575-8432",,Orlando,FL,32810,"Orlando,FL 32810","Parking Lot Maintenance & Marking, Concrete Staining Services, Painting Contractors, Water Pressure Cleaning, Waterproofing Contractors",,,,,,https://i3.ypcdn.com/blob/da1cb36efaa0c473485aef63f76102b5d6a13b6d_100x100_crop.jpg?63f80dd,"Your above average painting contractor.","IQ Painters provides a wide range of painting and home maintenance services to the greater Orlando area, including: Residential Painting: Exterior Painting, Interior Painting, Wood Decking, Concrete Flooring, Vinyl Painting, Window Washing, Light Carpentry Commercial Painting: Exterior Painting, Interior Painting, Vinyl Painting, Concrete Cleaning, Industrial Coating, Parking Lot Markings & Striping, Light Carpentry Pressure Washing, House Washing & Siding Cleaning, Concrete/ Masonry Cleaning & Sealing, Driveway, Fence & Sidewalk Cleaning, Gutter & Eaves Troughs Whitening, Deck Restoration, Waterproofing, Epoxy Coating. Serving many industries including apartment complexes, condominiums, hospitals, medical facilities, hotels, office buildings, churches, shopping centers, schools, universities.","Mon - Fri: 8:30 am - 6:30 pm Sat: 9:00 am - 2:00 pm Sun Closed",,,"debit, check, cash, all major credit cards",,,,,,,,,,,,
726636,249820,"2020-09-27 02:54:32","Clean Rite Pressure Washing",http://www.cleanritepressurewashing.com,Art@CleanRitePressureWashing.com,"(316) 655-5665","4656 S Greenwich Rd",Derby,KS,67037,"4656 S Greenwich Rd,Derby,KS 67037","Parking Lot Maintenance & Marking, Cleaning Contractors, Construction Site-Clean-Up, Parking Stations & Garages-Construction, Power Washing, Pressure Washing Equipment & Services, Sweeping Service-Power, Water Pressure Cleaning, Window Cleaning",,,A+,37.60933,-97.20553,https://i3.ypcdn.com/blob/e2916b15cac6d80a35e21614d100d9d7e72550b4_100x100_crop.jpg?63f80dd,"Specializing in Commercial Pressure Washing Services","Hot Water Pressure Cleaning and Power Washing Grafiti, Paint, Parking Stripe and Gum Removal Parking Garage, Street, and Parking Lot Sweeping Bird and Pigeon Cleanup and Bird Control Day Porting Parking Garage and Parking Lot Striping and Marking Parking Lot and Parking Garage Scrubbing Pure Water, Chemical Free Window Washing Painting of Fuel Island and Pipe Bollards Concrete Parking Block Installation Custom Landscaping (Custom Mowing, Trimming, and Mulching)","Mon - Sun: Open 24 Hours",,,,,,"Pressure washing services and cleaning services",,,,,,,,,
726925,249913,"2020-09-27 02:54:32","Nelco Commercial Maintenance",http://www.nelcomaintenance.com,dnelson@nelcomaintenance.com,"(251) 649-0061","7690 Tara Dr N",Mobile,AL,36619,"7690 Tara Dr N,Mobile,AL 36619","Landscape Designers & Consultants, Asphalt Paving & Sealcoating, Building Cleaning-Exterior, Building Contractors, Cleaning Contractors, Landscaping & Lawn Services, Lawn Maintenance, Parking Lot Maintenance & Marking, Parking Stations & Garages-Construction, Paving Contractors, Power Washing, Pressure Washing Equipment & Services, Water Pressure Cleaning",,,,30.60263,-88.2224,,"Full Service Exterior Maintenance","24 Hour Service - Over 13 Years Experience - Guaranteed Work","Mon - Sun: 7:30 am - 5:00 pm","Extra Phones: (251) 634-3132",,"check, cash, all major credit cards",,,http://www.nelcomaintenance.com,,,,,,,,,
727850,250215,"2020-09-27 02:54:43","Clean Sweep",,,"(409) 866-1450","6650 Westwood Blvd Apt C",Beaumont,TX,77707,"6650 Westwood Blvd Apt C,Beaumont,TX 77707","Parking Lot Maintenance & Marking, Asphalt, Building Contractors-Commercial & Industrial, Painting Contractors-Commercial & Industrial, Water Pressure Cleaning",,,,30.06994,-94.17087,,"Best Cleaning Service in Beaumont, TX",,"Mon - Sun: Open 24 Hours","owners phone: (409) 749-0964",,"check, cash, all major credit cards",,,,,,,,,,,,
730437,251031,"2020-09-27 02:54:54","Primrose Landscape",,,"(210) 291-3875","12354 Capeswood St","San Antonio",TX,78249,"12354 Capeswood St,San Antonio,TX 78249","Landscaping & Lawn Services, Irrigation Systems & Equipment, Landscape Contractors, Lawn Maintenance, Parking Lot Maintenance & Marking, Power Washing, Pressure Washing Equipment & Services, Sprinklers-Garden & Lawn, Sprinklers-Garden & Lawn, Installation & Service, Water Pressure Cleaning",,,,29.56169,-98.60757,,"San Antonio's premier landscape service contractor. Providing high-quality, detailed lawn maintenance service to residential & commercial clients in San Antonio & surrounding areas. Also, providing pressure washing & parking lot striping. Call today at (210) 291-3875..",,"Mon - Sun: Open 24 Hours","Phone: (210) 877-5678",,,,,,,,,,,,,,
730496,251060,"2020-09-27 02:54:54","J&J Cleaning Service",,,"(843) 633-2701","119 n cook st",bennettsville,SC,29512,"119 n cook st,bennettsville,SC 29512","Parking Lot Maintenance & Marking, Car Wash, Deck Cleaning-Commercial & Industrial, Gutters & Downspouts Cleaning, Water Pressure Cleaning",5,"1 Review",,34.62182,-79.67754,,,,,,,,,,,,"Mr M.",02/03/2016,five,"Hi my name is Maryland and J&J Cleaning Service really do a great job thanks J&J for your service we most definitely know who to call on",,,,
730776,251167,"2020-09-27 02:54:54","Rising Son's Maintenance Inc",,tony@risingsons.com,"(631) 619-2588","880 S 2nd St",Ronkonkoma,NY,11779,"880 S 2nd St,Ronkonkoma,NY 11779","Water Pressure Cleaning, Cleaners Supplies, Parking Stations & Garages-Construction",,,,40.79806,-73.11525,,"Click on the business name to learn more about this business.","We offer Complete Parking Lot Maintenance for your commercial parking lot. Rising Sons Maintenance has many Power Sweeping programs available to remove litter and debris from your parking lot. Our Service Area: We have existing routes servicing all of Nassau and Suffolk counties on Long Island, NY. We have a full fleet of Parking Lot Sweepers equipped to take care of your properties in a professional manner. Emergency service available.","Mon - Sun: Open 24 Hours",,,"visa, amex, master card",,,,"Specialties: Factories, Parking Lots, Indoors, Parking Bumpers, Bumper Blocks, Parking Curbs, Parking Blocks, Trash, Garbage, Stores, Car Stops, Yards, Interiors, Wheel Stops",,,,,,,,
731144,251295,"2020-09-27 02:54:54","Line It Up Services LLC",http://lineitupservices.com,lineitupservices@yahoo.com,"(504) 468-7971",,Kenner,LA,70065,"Kenner,LA 70065","Parking Lot Maintenance & Marking, Parking Stations & Garages-Construction, Water Pressure Cleaning",5,"2 Reviews",A+,,,https://i3.ypcdn.com/blob/de34b50ed734a5722a361372e77488f25eeff76e_100x100_crop.jpg?63f80dd,"LINE IT UP, WASH IT DOWN!","Because all of our customers are important to us, our professional staff is dedicated to making your experience a special one. That is why we always go the extra mile to give your business or home a perfect first impression. No matter what your parking lot maintenance or pressure cleaning needs are, Line It Up Services offers free estimates and competitive pricing to meet your budget. Please feel free to call us for a fast and always free estimate.","Mon - Sun: Open 24 Hours","Phone: (504) 460-2199",,check,,,http://lineitupservices.com,,"Sadat S.",01/21/2017,five,"Line it up service was awesome!! Professional and completed the job the same day quote was given.. I would recommend them anytime!!!","Glenn D.",07/23/2016,five,"Please put a note on your calendar to call me again next year around the same time.Thanks. Lee Stall"
731555,251442,"2020-09-27 02:54:54","Moonlight Sweeper Service",,,"(479) 641-0033","504 Atkins Bottom Rd",Atkins,AR,72823,"504 Atkins Bottom Rd,Atkins,AR 72823","Parking Lot Maintenance & Marking, Cleaning Contractors, Parking Stations & Garages-Construction, Power Washing, Pressure Cleaning Equipment & Supplies, Pressure Washing Equipment & Services, Water Pressure Cleaning",,,,35.20998,-92.92105,,,,Monday-Sunday,,,"cash, check",,,,"Services: Patio & Deck Cleaning & Restoration, Wet Blasting",,,,,,,,
732175,251644,"2020-09-27 02:54:54","Pinnacle Facility Services",http://pinfacility.com,,"(337) 412-7716","321 Travis St Ste 8b",Lafayette,LA,70503,"321 Travis St Ste 8b,Lafayette,LA 70503","Janitorial Service, Floor Waxing, Polishing & Cleaning, Parking Lot Maintenance & Marking, Upholstery Cleaners, Water Pressure Cleaning",,,A+,30.20614,-92.01643,,"""We Know Green Clean""",,"Mon - Fri: 9:00 am - 5:00 pm",,,"discover, visa, mastercard, all major credit cards, check",,,http://pinfacility.com,,,,,,,,,
732388,251735,"2020-09-27 02:54:54","J Joe Amigos Striping Service",http://www.jjoeamigo.com,joshuaunderwood61@yahoo.com,"(713) 459-6114","7514 Augusta Lane",Rosharon,TX,77583,"7514 Augusta Lane,Rosharon,TX 77583","Parking Lot Maintenance & Marking, Concrete Restoration, Sealing & Cleaning, Pavement & Floor Marking Services, Power Washing, Pressure Cleaning Equipment & Supplies, Water Pressure Cleaning",5,"1 Review",,29.35832,-95.33984,https://i3.ypcdn.com/blob/7c384eb5142e37eac5b3569aeca3defd766643b0_100x100_crop.jpg?63f80dd,,"Welcome to my page, I offer a variety of services from pressure washing parking lots to soft-washing using x jet for chemical washes for them super dirty jobs, to custom stencil work for parking lots.Surface cleaning,roof and exterior cleaning. I can also do paint removal and re-stripe parking lots, using water base, oil base, or stains, and replace your handicap signs.I would like the chance to service your next job. Quotes are free, and we will meet your expectations.","Hours Appointment Only Hours Mon - Sun Open 24 Mon - Sun: 7:00 am - 7:00 pm",,,"cash, check, all major credit cards",,"J Joe Amigos Striping, Pressure washing ,Soft washing J Joe Amigo's Striping Service",http://www.jjoeamigo.com,,"Aaron B.",05/21/2016,five,"Fast, friendly, and dependable service. Family owned and operated, local, small business. The owner came out on a short notice and did the job himself for a good price. He was very personable and professional. I would recommend this Buisness to anybody with no regrets!",,,,
733301,252037,"2020-09-27 02:55:01","Office Maintenance company in Miami",,jctechnologiesmark@gmail.com,"(305) 499-4212","1607 NW 79th Ave",Doral,FL,33126,"1607 NW 79th Ave,Doral,FL 33126","Janitorial Service, Parking Lot Maintenance & Marking, Property Maintenance, Water Pressure Cleaning",,,,25.7893,-80.32399,,,,"Mon - Sat: 9:00 am - 5:00 pm","MobilePhone: (303) 385-3144",,"all major credit cards",,"Property Maintenance Tech",,,,,,,,,,
733655,252155,"2020-09-27 02:55:01","Alpha Pressure Washing",,,"(469) 214-3808","11816 Inwood Rd #3058",Dallas,TX,75244,"11816 Inwood Rd #3058,Dallas,TX 75244","Cleaning Systems-Pressure, Chemical, Etc, Deck Cleaning & Treatment, Parking Lots & Garages, Rust Preventives & Removers, Water Pressure Cleaning",,,,32.91013,-96.81828,,,,,,,,,,,,,,,,,,,
733934,252229,"2020-09-27 02:55:01","E&L Environmental Pressure Washing LLC",,elpressurewashing@yahoo.com,"(985) 290-4759","2720 S Range Ave Suite 8","Denham Springs",LA,70726,"2720 S Range Ave Suite 8,Denham Springs,LA 70726","Parking Lot Maintenance & Marking, Concrete Restoration, Sealing & Cleaning, Power Washing, Steam Cleaning, Water Pressure Cleaning",,,,30.44997,-90.95577,,,"At E&L we use professional grade products and waste water recovery systems . Most pressure washing companies use cold water and high pressure machines to do the cleaning and this can cause extensive damages and inferior results. E&L uses self-contained mobile pressure washing equipment that can provide hot or cold water. Our custom designed commercial equipment enables us to provide a wide range of services to commercial industrial and residential clients . Let E&L Pressure Washing develop a specially designed program to maintain your property. Well complete the job safely and on time, while ensuring that your property makes the best possible first impression.","Mon - Sun: Open 24 Hours","Fax: (985) 288-0596",,"check, diners club, cash, jcb, visa, master card, amex, discover, debit, travelers checks, paypal",,,,,,,,,,,,
733957,252238,"2020-09-27 02:55:01","Nelco Commercial Maintenance",http://www.nelcomaintenance.com,dnelson@nelcomaintenance.com,"(251) 649-0061",,Mobile,AL,36695,"Mobile,AL 36695","Parking Lot Maintenance & Marking, Asphalt Paving & Sealcoating, Building Cleaning-Exterior, Landscape Designers & Consultants, Landscaping & Lawn Services, Lawn Maintenance, Power Washing, Pressure Washing Equipment & Services, Water Pressure Cleaning",,,,,,,"FULL SERVICE COMMERCIAL PROPERTY MAINTENANCE","24 Hour Service - Over 12 Years Experience - Guaranteed Work",,"Phone: (251) 634-3132",,"amex, discover, visa, mastercard",,,http://www.nelcomaintenance.com,,,,,,,,,
734680,252475,"2020-09-27 02:55:02","Tarheel Janitorial Service Inc",http://www.tarheelj.com,tarheelj@nc.rr.com,"(919) 636-3797","309 Rainbow Dr",Carrboro,NC,27510,"309 Rainbow Dr,Carrboro,NC 27510","Janitorial Service, Cleaners Supplies, Cleaning Contractors, Parking Lot Maintenance & Marking, Parking Lots & Garages, Parking Stations & Garages-Construction, Pressure Cleaning Equipment & Supplies, Sweepers-Power, Water Pressure Cleaning, Window Cleaning",,,,35.92337,-79.09583,,,,,,,,,,http://www.tarheelj.com,,,,,,,,,
735041,252609,"2020-09-27 02:55:02","B.O.S.S. OUTDOOR SERVICES",,bossoutdoorservices@yahoo.com,"(337) 344-2439","9409 Garrett Rd",Maurice,LA,70555,"9409 Garrett Rd,Maurice,LA 70555","Parking Lot Maintenance & Marking, Cleaning Contractors, Concrete Restoration, Sealing & Cleaning, Construction Site-Clean-Up, Graffiti Removal & Protection, Power Washing, Pressure Washing Equipment & Services, Rubbish Removal, Steam Cleaning, Water Pressure Cleaning",,,,30.07215,-92.10703,,,,,,,,,"BROUSSARD OUTDOOR SERVICES",,,,,,,,,,
735207,252669,"2020-09-27 02:55:02",Affordable,,,"(470) 210-4242","4612 Austell Rd",Austell,GA,30106,"4612 Austell Rd,Austell,GA 30106","Parking Lot Maintenance & Marking, Asphalt Paving & Sealcoating, Concrete Restoration, Sealing & Cleaning, Roofing Contractors, Water Pressure Cleaning",,,,33.84156,-84.61167,,,,,,,,,,,,,,,,,,,
735690,252834,"2020-09-27 02:55:02",EcoSplash,,,"(281) 216-2146","14049 Eastex Fwy",Houston,TX,77032,"14049 Eastex Fwy,Houston,TX 77032","Parking Lot Maintenance & Marking, Concrete Contractors, General Contractors, Painting Contractors, Water Pressure Cleaning",5,"2 Reviews",,29.92227,-95.30518,,,,,"Operations Manager: (281) 948-8425",,"check, cash, all major credit cards",,,,,"Fred P.",10/17/2013,five,"Excellent Paint Job. Affordable & Reliable - Timely Finished",imran.bandeali.1,05/23/2013,five,"Awesome service, pricing and professional work."
736038,252969,"2020-09-27 02:55:02","Alex's All American",,alexsallamerican@yahoo.com,"(757) 650-9343",,"Virginia Beach",VA,23453,"Virginia Beach,VA 23453","Parking Lot Maintenance & Marking, Carpet & Rug Cleaners, Carpet & Rug Cleaners-Water Extraction, Painting Contractors, Water Pressure Cleaning",,,,,,,"We dont meet expectations... We exceed them!!!","Alex's All-American provides professional services that can revitalize your properties. From interior to exterior painting we are the company that is dedicated to restoring your home back to new again. We provide custom interior painting services that include custom wall color painting for new homes and revitalization painting for older homes through out the South Hampton Roads area.","Mon - Sun: Open 24 Hours",,,,,,,,,,,,,,,
736564,253153,"2020-09-27 02:55:23","Just Parking LLC Striping & Sealcoating",http://www.justparkingflorida.com,justparkingflorida@gmail.com,"(850) 573-4459","Parking Lot Striping - Aspha.t Sealcoating Fort Walton Beach - Miramar Beach - Santa Rosa Beach - Defuniak Springs FL",Destin,FL,32540,"Parking Lot Striping - Aspha.t Sealcoating Fort Walton Beach - Miramar Beach - Santa Rosa Beach - Defuniak Springs FL,Destin,FL 32540","Parking Lot Maintenance & Marking, Asphalt Paving & Sealcoating, Driveway Contractors, Painting Contractors, Painting Contractors-Commercial & Industrial, Parking Facilities-Equipment & Supplies, Pavement & Floor Marking Services, Pressure Washing Equipment & Services, Property Maintenance, Sealers Asphalt, Concrete, Etc., Street Cleaning, Sweeping Service-Power, Traffic & Parking Consultants, Traffic Signs & Signals, Water Pressure Cleaning",,,,30.393534,-86.49578,https://i3.ypcdn.com/blob/ddaa8b21c330ec96098ce561aed39f53e45424de_100x100_crop.jpg?63f80dd,"Paved Parking Lots & Driveways are not ""Just Parking"" spaces for cars.. These valuable surfaces are a customer or visitors first impression of your business or home.","Parking Lots & Driveways. Asphalt slabs cost a pretty penny but a good maintenance plan can extend the life of your asphalt by 20 or 40 extra years. Properly filling all cracks and potholes as they form and having a layer of asphalt sealant applied over the entire asphalt surface every 3 to 5 years will save you alot of money in the long run. We specailize in Asphalt Sealcoating, Parking Lot Line Striping, Crack &amp.amp. Pothole Repair, Signage &amp.amp. Stenciling, Power Sweeping &amp.amp. Pressure Washing. Citys in our area include Tallahassee FL, Panama City FL, Marianna FL, Dothan AL, Quincy FL, Destin FL, Milton FL, Pensacola FL, Defuniak Springs FL, Ponce De Leon FL, Fort Walton Beach FL, Mexico Beach FL, Crestview FL, Laguna Beach FL, Freeport FL, Miramar Beach FL, Niceville FL, Bonifay FL, Chipley FL, Cottondale FL. Parking Lots &amp.amp. Driveways&amp.#10.We specailize in Asphalt Sealcoating, Parking Lot Line Striping, Crack &amp.amp.amp. Pothole Repair, Signage &amp.amp.amp. Stenciling, Power Sweeping &amp.amp.amp. Pressure Washing.","Mon - Sun: 9:00 am - 6:00 pm",,,check,,,http://www.justparkingflorida.com,,,,,,,,,