category_1_x_shoubiao.id,category_1.id,category_1.ts,category_1.title,shoubiao.id,shoubiao.ts,shoubiao.title,shoubiao.jiage,shoubiao.yuanjia,shoubiao.xiaoliang,shoubiao.renqi,shoubiao.baoyang,shoubiao.pinpai,shoubiao.chandi,shoubiao.chicun,shoubiao.daxiao,shoubiao.kuanshi,shoubiao.jixin,shoubiao.biaomian,shoubiao.cailiao,shoubiao.biaoshi,shoubiao.gongneng,shoubiao.fujian,shoubiao.youshi,shoubiao.xilie,shoubiao.zhonglei,shoubiao.biaodai,shoubiao.bisoxing,shoubiao.jingmian
537,1,"2018-06-21 03:16:00",顶级品牌,537,"2018-06-22 21:59:01","GS一比一复刻江诗丹顿历史名作系列86300 方形机械男表",￥2880,￥8641,3436,203,,"GS一比一精仿江诗丹顿历史名作系列86300 方形机械男表【产地】香港组装 【款式】汇集计时功能【尺寸】直径：36.47*43.06毫米,厚度：10毫米;适合不同粗细手腕的人佩带.【颜色】如图显示【机芯】搭载9015机械机芯,可长时间精确走时,储存高度能量.【功能】防水、防震、防磁;指针独特设计,带日历,尽显示你的高贵气质,,优雅首选;【表壳】316精钢纯钢表壳，实物拍摄,实物还比图片更有质感的.【表带】进口设计专用意大利真皮小牛皮表带,搭配原装表扣【表面】100%高精度蓝宝石表面,历久如新的.抗磨抗划.","香港组装 【款式】汇集计时功能【尺寸】直径：36.47*43.06毫米,厚度：10毫米;适合不同粗细手腕的人佩带.【颜色】如图显示【机芯】搭载9015机械机芯,可长时间精确走时,储存高度能量.【功能】防水、防震、防磁;指针独特设计,带日历,尽显示你的高贵气质,,优雅首选;【表壳】316精钢纯钢表壳，实物拍摄,实物还比图片更有质感的.【表带】进口设计专用意大利真皮小牛皮表带,搭配原装表扣【表面】100%高精度蓝宝石表面,历久如新的.抗磨抗划.正常佩带都是不会有划痕的.【保修】非认为损坏自购买起三年免费保修,","直径：36.47*43.06毫米,厚度：10毫米;适合不同粗细手腕的人佩带.【颜色】如图显示【机芯】搭载9015机械机芯,可长时间精确走时,储存高度能量.【功能】防水、防震、防磁;指针独特设计,带日历,尽显示你的高贵气质,,优雅首选;【表壳】316精钢纯钢表壳，实物拍摄,实物还比图片更有质感的.【表带】进口设计专用意大利真皮小牛皮表带,搭配原装表扣【表面】100%高精度蓝宝石表面,历久如新的.抗磨抗划.正常佩带都是不会有划痕的.【保修】非认为损坏自购买起三年免费保修,终身成本保修;【附件】吊牌说明书;配送",,"汇集计时功能【尺寸】直径：36.47*43.06毫米,厚度：10毫米;适合不同粗细手腕的人佩带.【颜色】如图显示【机芯】搭载9015机械机芯,可长时间精确走时,储存高度能量.【功能】防水、防震、防磁;指针独特设计,带日历,尽显示你的高贵气质,,优雅首选;【表壳】316精钢纯钢表壳，实物拍摄,实物还比图片更有质感的.【表带】进口设计专用意大利真皮小牛皮表带,搭配原装表扣【表面】100%高精度蓝宝石表面,历久如新的.抗磨抗划.正常佩带都是不会有划痕的.【保修】非认为损坏自购买起三年免费保修,终身成本保修;【附","采用纤薄而又稳定的9015机芯，性能稳定，走时优秀。 ●本公司商品在交付邮递前都经过了48小时测试，测试通过才交付邮递，请放心购买。●本照片为实物拍摄，提供和图片一摸一样、质量可靠的实物手表。 【品牌】GS一比一精仿江诗丹顿历史名作系列86300 方形机械男表【产地】香港组装 【款式】汇集计时功能【尺寸】直径：36.47*43.06毫米,厚度：10毫米;适合不同粗细手腕的人佩带.【颜色】如图显示【机芯】搭载9015机械机芯,可长时间精确走时,储存高度能量.【功能】防水、防震、防磁;指针独特设计,带日历,尽","100%高精度蓝宝石表面,历久如新的.抗磨抗划.正常佩带都是不会有划痕的.【保修】非认为损坏自购买起三年免费保修,终身成本保修;【附件】吊牌说明书;配送""万国手表""专用盒送礼、自带彰显品质.【标识】表盘,表背面,表面,表带，表扣等均有万国出产标识【优势】这款豪华一比一高仿万国手表可以使你在日常佩带之时长久保持美观夺目，常带常新；计时准确、造型美观、贴腕设计，质地轻巧、高贵典雅，是现代社会成功人士身份的象征；贴心设计,完全附合你的手腕，振频：28800每小时振荡次数。 本商品关键词:江诗丹顿86300 购物",,"表盘,表背面,表面,表带，表扣等均有万国出产标识【优势】这款豪华一比一高仿万国手表可以使你在日常佩带之时长久保持美观夺目，常带常新；计时准确、造型美观、贴腕设计，质地轻巧、高贵典雅，是现代社会成功人士身份的象征；贴心设计,完全附合你的手腕，振频：28800每小时振荡次数。 本商品关键词:江诗丹顿86300 购物温馨提示 01 快递运输：当您选择了快递运输，货物是从发货地送到您所在城市的您提供具体地址，如地址不详需要您到指定的快递点自提，不会送到具体的行政区。提货时请注意携带收货人本人身份证原件，如需他人代","防水、防震、防磁;指针独特设计,带日历,尽显示你的高贵气质,,优雅首选;【表壳】316精钢纯钢表壳，实物拍摄,实物还比图片更有质感的.【表带】进口设计专用意大利真皮小牛皮表带,搭配原装表扣【表面】100%高精度蓝宝石表面,历久如新的.抗磨抗划.正常佩带都是不会有划痕的.【保修】非认为损坏自购买起三年免费保修,终身成本保修;【附件】吊牌说明书;配送""万国手表""专用盒送礼、自带彰显品质.【标识】表盘,表背面,表面,表带，表扣等均有万国出产标识【优势】这款豪华一比一高仿万国手表可以使你在日常佩带之时长久保持美观","吊牌说明书;配送""万国手表""专用盒送礼、自带彰显品质.【标识】表盘,表背面,表面,表带，表扣等均有万国出产标识【优势】这款豪华一比一高仿万国手表可以使你在日常佩带之时长久保持美观夺目，常带常新；计时准确、造型美观、贴腕设计，质地轻巧、高贵典雅，是现代社会成功人士身份的象征；贴心设计,完全附合你的手腕，振频：28800每小时振荡次数。 本商品关键词:江诗丹顿86300 购物温馨提示 01 快递运输：当您选择了快递运输，货物是从发货地送到您所在城市的您提供具体地址，如地址不详需要您到指定的快递点自提，不会送到","这款豪华一比一高仿万国手表可以使你在日常佩带之时长久保持美观夺目，常带常新；计时准确、造型美观、贴腕设计，质地轻巧、高贵典雅，是现代社会成功人士身份的象征；贴心设计,完全附合你的手腕，振频：28800每小时振荡次数。 本商品关键词:江诗丹顿86300",历史名作系列,男士手表,真皮表带,圆形表盘,蓝宝石镜面
538,1,"2018-06-21 03:16:00",顶级品牌,538,"2018-06-22 21:59:03","GS高仿江诗丹顿历史名作系列86300 方形机械男表",￥2980,￥8940,2489,143,,"江诗丹顿86300 GS高仿复刻江诗丹顿历史名作系列86300 方形机械男表【产地】香港组装 【款式】汇集计时功能【尺寸】直径：36.47*43.06毫米,厚度：10毫米;适合不同粗细手腕的人佩带.【颜色】如图显示【机芯】搭载9015机械机芯,可长时间精确走时,储存高度能量.【功能】防水、防震、防磁;指针独特设计,带日历,尽显示你的高贵气质,,优雅首选;【表壳】316精钢纯钢表壳，实物拍摄,实物还比图片更有质感的.【表带】进口设计专用意大利真皮小牛皮表带,搭配原装表扣【表面】100%高精度蓝宝石表面,历久","香港组装 【款式】汇集计时功能【尺寸】直径：36.47*43.06毫米,厚度：10毫米;适合不同粗细手腕的人佩带.【颜色】如图显示【机芯】搭载9015机械机芯,可长时间精确走时,储存高度能量.【功能】防水、防震、防磁;指针独特设计,带日历,尽显示你的高贵气质,,优雅首选;【表壳】316精钢纯钢表壳，实物拍摄,实物还比图片更有质感的.【表带】进口设计专用意大利真皮小牛皮表带,搭配原装表扣【表面】100%高精度蓝宝石表面,历久如新的.抗磨抗划.正常佩带都是不会有划痕的.【保修】非认为损坏自购买起三年免费保修,","直径：36.47*43.06毫米,厚度：10毫米;适合不同粗细手腕的人佩带.【颜色】如图显示【机芯】搭载9015机械机芯,可长时间精确走时,储存高度能量.【功能】防水、防震、防磁;指针独特设计,带日历,尽显示你的高贵气质,,优雅首选;【表壳】316精钢纯钢表壳，实物拍摄,实物还比图片更有质感的.【表带】进口设计专用意大利真皮小牛皮表带,搭配原装表扣【表面】100%高精度蓝宝石表面,历久如新的.抗磨抗划.正常佩带都是不会有划痕的.【保修】非认为损坏自购买起三年免费保修,终身成本保修;【附件】吊牌说明书;配送",,"汇集计时功能【尺寸】直径：36.47*43.06毫米,厚度：10毫米;适合不同粗细手腕的人佩带.【颜色】如图显示【机芯】搭载9015机械机芯,可长时间精确走时,储存高度能量.【功能】防水、防震、防磁;指针独特设计,带日历,尽显示你的高贵气质,,优雅首选;【表壳】316精钢纯钢表壳，实物拍摄,实物还比图片更有质感的.【表带】进口设计专用意大利真皮小牛皮表带,搭配原装表扣【表面】100%高精度蓝宝石表面,历久如新的.抗磨抗划.正常佩带都是不会有划痕的.【保修】非认为损坏自购买起三年免费保修,终身成本保修;【附","采用纤薄而又稳定的9015机芯，性能稳定，走时优秀。 ●本公司商品在交付邮递前都经过了48小时测试，测试通过才交付邮递，请放心购买。●本照片为实物拍摄，提供和图片一摸一样、质量可靠的实物手表。 【品牌】江诗丹顿86300 GS高仿复刻江诗丹顿历史名作系列86300 方形机械男表【产地】香港组装 【款式】汇集计时功能【尺寸】直径：36.47*43.06毫米,厚度：10毫米;适合不同粗细手腕的人佩带.【颜色】如图显示【机芯】搭载9015机械机芯,可长时间精确走时,储存高度能量.【功能】防水、防震、防磁;指针独","100%高精度蓝宝石表面,历久如新的.抗磨抗划.正常佩带都是不会有划痕的.【保修】非认为损坏自购买起三年免费保修,终身成本保修;【附件】吊牌说明书;配送""万国手表""专用盒送礼、自带彰显品质.【标识】表盘,表背面,表面,表带，表扣等均有万国出产标识【优势】这款豪华一比一高仿万国手表可以使你在日常佩带之时长久保持美观夺目，常带常新；计时准确、造型美观、贴腕设计，质地轻巧、高贵典雅，是现代社会成功人士身份的象征；贴心设计,完全附合你的手腕，振频：28800每小时振荡次数。 本商品关键词:江诗丹顿86300 购物",,"表盘,表背面,表面,表带，表扣等均有万国出产标识【优势】这款豪华一比一高仿万国手表可以使你在日常佩带之时长久保持美观夺目，常带常新；计时准确、造型美观、贴腕设计，质地轻巧、高贵典雅，是现代社会成功人士身份的象征；贴心设计,完全附合你的手腕，振频：28800每小时振荡次数。 本商品关键词:江诗丹顿86300 购物温馨提示 01 快递运输：当您选择了快递运输，货物是从发货地送到您所在城市的您提供具体地址，如地址不详需要您到指定的快递点自提，不会送到具体的行政区。提货时请注意携带收货人本人身份证原件，如需他人代","防水、防震、防磁;指针独特设计,带日历,尽显示你的高贵气质,,优雅首选;【表壳】316精钢纯钢表壳，实物拍摄,实物还比图片更有质感的.【表带】进口设计专用意大利真皮小牛皮表带,搭配原装表扣【表面】100%高精度蓝宝石表面,历久如新的.抗磨抗划.正常佩带都是不会有划痕的.【保修】非认为损坏自购买起三年免费保修,终身成本保修;【附件】吊牌说明书;配送""万国手表""专用盒送礼、自带彰显品质.【标识】表盘,表背面,表面,表带，表扣等均有万国出产标识【优势】这款豪华一比一高仿万国手表可以使你在日常佩带之时长久保持美观","吊牌说明书;配送""万国手表""专用盒送礼、自带彰显品质.【标识】表盘,表背面,表面,表带，表扣等均有万国出产标识【优势】这款豪华一比一高仿万国手表可以使你在日常佩带之时长久保持美观夺目，常带常新；计时准确、造型美观、贴腕设计，质地轻巧、高贵典雅，是现代社会成功人士身份的象征；贴心设计,完全附合你的手腕，振频：28800每小时振荡次数。 本商品关键词:江诗丹顿86300 购物温馨提示 01 快递运输：当您选择了快递运输，货物是从发货地送到您所在城市的您提供具体地址，如地址不详需要您到指定的快递点自提，不会送到","这款豪华一比一高仿万国手表可以使你在日常佩带之时长久保持美观夺目，常带常新；计时准确、造型美观、贴腕设计，质地轻巧、高贵典雅，是现代社会成功人士身份的象征；贴心设计,完全附合你的手腕，振频：28800每小时振荡次数。 本商品关键词:江诗丹顿86300",历史名作系列,男士手表,真皮表带,圆形表盘,蓝宝石镜面
539,1,"2018-06-21 03:16:00",顶级品牌,539,"2018-06-22 21:59:04","SY复刻雅典Diver潜水表系列Le Locle 勒洛克潜水腕表3203-950",￥2980,￥8940,2618,131,,"雅典3203-950 SY高仿复刻雅典Diver潜水表系列Le Locle 勒洛克潜水腕表3203-950 【产地】SY组装【尺寸】直径42.2毫米、厚度：14毫米;适合不同粗细手腕的人佩带.【颜色】如图显示【机芯】搭载进口2824全自动机械机芯.可长时间精确走时,存储高度能量.【功能】防水、防震、防磁;精致的经典刻度,指针独特设计,带日历,尽显示你的高贵气质,优雅首选;【表壳】精钢纯钢表壳,陶瓷表圈,实物拍摄,实物还比图片更有质感的.【表带】进口设计专用意大利真皮小牛皮表带,搭配原装雅典手表表扣【表面】","SY组装【尺寸】直径42.2毫米、厚度：14毫米;适合不同粗细手腕的人佩带.【颜色】如图显示【机芯】搭载进口2824全自动机械机芯.可长时间精确走时,存储高度能量.【功能】防水、防震、防磁;精致的经典刻度,指针独特设计,带日历,尽显示你的高贵气质,优雅首选;【表壳】精钢纯钢表壳,陶瓷表圈,实物拍摄,实物还比图片更有质感的.【表带】进口设计专用意大利真皮小牛皮表带,搭配原装雅典手表表扣【表面】100%高精度蓝宝石表面,历久如新的.抗磨抗划.正常佩带都是不会有划痕的.【保修】非认为损坏自购买起三年免费保修,终","直径42.2毫米、厚度：14毫米;适合不同粗细手腕的人佩带.【颜色】如图显示【机芯】搭载进口2824全自动机械机芯.可长时间精确走时,存储高度能量.【功能】防水、防震、防磁;精致的经典刻度,指针独特设计,带日历,尽显示你的高贵气质,优雅首选;【表壳】精钢纯钢表壳,陶瓷表圈,实物拍摄,实物还比图片更有质感的.【表带】进口设计专用意大利真皮小牛皮表带,搭配原装雅典手表表扣【表面】100%高精度蓝宝石表面,历久如新的.抗磨抗划.正常佩带都是不会有划痕的.【保修】非认为损坏自购买起三年免费保修,终身成本保修;【附",,,"搭载进口2824全自动机械机芯.可长时间精确走时,存储高度能量.【功能】防水、防震、防磁;精致的经典刻度,指针独特设计,带日历,尽显示你的高贵气质,优雅首选;【表壳】精钢纯钢表壳,陶瓷表圈,实物拍摄,实物还比图片更有质感的.【表带】进口设计专用意大利真皮小牛皮表带,搭配原装雅典手表表扣【表面】100%高精度蓝宝石表面,历久如新的.抗磨抗划.正常佩带都是不会有划痕的.【保修】非认为损坏自购买起三年免费保修,终身成本保修;【附件】吊牌说明书;配送""雅典手表""专用盒送礼、自带彰显品质.【标识】表盘,表背面,表面","100%高精度蓝宝石表面,历久如新的.抗磨抗划.正常佩带都是不会有划痕的.【保修】非认为损坏自购买起三年免费保修,终身成本保修;【附件】吊牌说明书;配送""雅典手表""专用盒送礼、自带彰显品质.【标识】表盘,表背面,表面,表带，表扣等均有Ulysse Nardin出产标识【优势】这款豪华复刻雅典手表可以使你在日常佩带之时长久保持美观夺目，常带常新；计时准确、造型美观、贴腕设计，质地轻巧、高贵典雅，是现代社会成功人士身份的象征；贴心设计,完全附合你的手腕 本商品关键词:雅典3203-950 购物温馨提示 01 ",,"表盘,表背面,表面,表带，表扣等均有Ulysse Nardin出产标识【优势】这款豪华复刻雅典手表可以使你在日常佩带之时长久保持美观夺目，常带常新；计时准确、造型美观、贴腕设计，质地轻巧、高贵典雅，是现代社会成功人士身份的象征；贴心设计,完全附合你的手腕 本商品关键词:雅典3203-950 购物温馨提示 01 快递运输：当您选择了快递运输，货物是从发货地送到您所在城市的您提供具体地址，如地址不详需要您到指定的快递点自提，不会送到具体的行政区。提货时请注意携带收货人本人身份证原件，如需他人代收请告知具体签收","防水、防震、防磁;精致的经典刻度,指针独特设计,带日历,尽显示你的高贵气质,优雅首选;【表壳】精钢纯钢表壳,陶瓷表圈,实物拍摄,实物还比图片更有质感的.【表带】进口设计专用意大利真皮小牛皮表带,搭配原装雅典手表表扣【表面】100%高精度蓝宝石表面,历久如新的.抗磨抗划.正常佩带都是不会有划痕的.【保修】非认为损坏自购买起三年免费保修,终身成本保修;【附件】吊牌说明书;配送""雅典手表""专用盒送礼、自带彰显品质.【标识】表盘,表背面,表面,表带，表扣等均有Ulysse Nardin出产标识【优势】这款豪华复刻","吊牌说明书;配送""雅典手表""专用盒送礼、自带彰显品质.【标识】表盘,表背面,表面,表带，表扣等均有Ulysse Nardin出产标识【优势】这款豪华复刻雅典手表可以使你在日常佩带之时长久保持美观夺目，常带常新；计时准确、造型美观、贴腕设计，质地轻巧、高贵典雅，是现代社会成功人士身份的象征；贴心设计,完全附合你的手腕 本商品关键词:雅典3203-950 购物温馨提示 01 快递运输：当您选择了快递运输，货物是从发货地送到您所在城市的您提供具体地址，如地址不详需要您到指定的快递点自提，不会送到具体的行政区。提","这款豪华复刻雅典手表可以使你在日常佩带之时长久保持美观夺目，常带常新；计时准确、造型美观、贴腕设计，质地轻巧、高贵典雅，是现代社会成功人士身份的象征；贴心设计,完全附合你的手腕 本商品关键词:雅典3203-950",航海系列,男表,皮带表带,,蓝宝石镜面
540,1,"2018-06-21 03:16:00",顶级品牌,540,"2018-06-22 21:59:05","宝玑5817ST/92/5V8 HG高仿复刻宝玑Marine系列5817ST/92/5V8 男机械表",￥3180,￥9540,870,244,,"宝玑5817ST/92/5V8 高仿复刻宝玑Marine系列5817ST/92/5V8 男机械表 【产地】：香港组装 【尺寸】：直径39毫米，厚度11.82毫米。适合不同粗细手腕佩戴。【款式】：宝玑机械手表【机芯】：搭载瑞士进口Cal.517GG机芯,经久耐用，走时精准稳定【表面】：法国玻璃蓝宝石镜面，不磨损。莫氏9级蓝宝石表面（钻石为10级）【材料】：进口瑞士代工316L精钢表壳或包18K玫瑰金 真牛皮表带，不掉色、不生锈，高精度蓝宝石玻璃不划损【标识】：表面、表背、表扣均有“宝玑”原厂标识【功能】：1","香港组装 【尺寸】：直径39毫米，厚度11.82毫米。适合不同粗细手腕佩戴。【款式】：宝玑机械手表【机芯】：搭载瑞士进口Cal.517GG机芯,经久耐用，走时精准稳定【表面】：法国玻璃蓝宝石镜面，不磨损。莫氏9级蓝宝石表面（钻石为10级）【材料】：进口瑞士代工316L精钢表壳或包18K玫瑰金 真牛皮表带，不掉色、不生锈，高精度蓝宝石玻璃不划损【标识】：表面、表背、表扣均有“宝玑”原厂标识【功能】：100米防水（可游泳）、防震、防磁、计时、带日历。【附件】：此款一比一高仿宝玑手表包含：包装盒、吊牌、说明书、","直径39毫米，厚度11.82毫米。适合不同粗细手腕佩戴。【款式】：宝玑机械手表【机芯】：搭载瑞士进口Cal.517GG机芯,经久耐用，走时精准稳定【表面】：法国玻璃蓝宝石镜面，不磨损。莫氏9级蓝宝石表面（钻石为10级）【材料】：进口瑞士代工316L精钢表壳或包18K玫瑰金 真牛皮表带，不掉色、不生锈，高精度蓝宝石玻璃不划损【标识】：表面、表背、表扣均有“宝玑”原厂标识【功能】：100米防水（可游泳）、防震、防磁、计时、带日历。【附件】：此款一比一高仿宝玑手表包含：包装盒、吊牌、说明书、发票等。 本商品关键",,"宝玑机械手表【机芯】：搭载瑞士进口Cal.517GG机芯,经久耐用，走时精准稳定【表面】：法国玻璃蓝宝石镜面，不磨损。莫氏9级蓝宝石表面（钻石为10级）【材料】：进口瑞士代工316L精钢表壳或包18K玫瑰金 真牛皮表带，不掉色、不生锈，高精度蓝宝石玻璃不划损【标识】：表面、表背、表扣均有“宝玑”原厂标识【功能】：100米防水（可游泳）、防震、防磁、计时、带日历。【附件】：此款一比一高仿宝玑手表包含：包装盒、吊牌、说明书、发票等。 本商品关键词:宝玑5817ST/92/5V8 购物温馨提示 01 快递运输：","搭载瑞士进口Cal.517GG机芯,经久耐用，走时精准稳定【表面】：法国玻璃蓝宝石镜面，不磨损。莫氏9级蓝宝石表面（钻石为10级）【材料】：进口瑞士代工316L精钢表壳或包18K玫瑰金 真牛皮表带，不掉色、不生锈，高精度蓝宝石玻璃不划损【标识】：表面、表背、表扣均有“宝玑”原厂标识【功能】：100米防水（可游泳）、防震、防磁、计时、带日历。【附件】：此款一比一高仿宝玑手表包含：包装盒、吊牌、说明书、发票等。 本商品关键词:宝玑5817ST/92/5V8","法国玻璃蓝宝石镜面，不磨损。莫氏9级蓝宝石表面（钻石为10级）【材料】：进口瑞士代工316L精钢表壳或包18K玫瑰金 真牛皮表带，不掉色、不生锈，高精度蓝宝石玻璃不划损【标识】：表面、表背、表扣均有“宝玑”原厂标识【功能】：100米防水（可游泳）、防震、防磁、计时、带日历。【附件】：此款一比一高仿宝玑手表包含：包装盒、吊牌、说明书、发票等。 本商品关键词:宝玑5817ST/92/5V8 购物温馨提示 01 快递运输：当您选择了快递运输，货物是从发货地送到您所在城市的您提供具体地址，如地址不详需要您到指定的","进口瑞士代工316L精钢表壳或包18K玫瑰金 真牛皮表带，不掉色、不生锈，高精度蓝宝石玻璃不划损【标识】：表面、表背、表扣均有“宝玑”原厂标识【功能】：100米防水（可游泳）、防震、防磁、计时、带日历。【附件】：此款一比一高仿宝玑手表包含：包装盒、吊牌、说明书、发票等。 本商品关键词:宝玑5817ST/92/5V8 购物温馨提示 01 快递运输：当您选择了快递运输，货物是从发货地送到您所在城市的您提供具体地址，如地址不详需要您到指定的快递点自提，不会送到具体的行政区。提货时请注意携带收货人本人身份证原件，","表面、表背、表扣均有“宝玑”原厂标识【功能】：100米防水（可游泳）、防震、防磁、计时、带日历。【附件】：此款一比一高仿宝玑手表包含：包装盒、吊牌、说明书、发票等。 本商品关键词:宝玑5817ST/92/5V8 购物温馨提示 01 快递运输：当您选择了快递运输，货物是从发货地送到您所在城市的您提供具体地址，如地址不详需要您到指定的快递点自提，不会送到具体的行政区。提货时请注意携带收货人本人身份证原件，如需他人代收请告知具体签收注意事项。 02 实体店配送安装：当您选择了实体店配送安装，实体店安排物流运输、","100米防水（可游泳）、防震、防磁、计时、带日历。【附件】：此款一比一高仿宝玑手表包含：包装盒、吊牌、说明书、发票等。 本商品关键词:宝玑5817ST/92/5V8 购物温馨提示 01 快递运输：当您选择了快递运输，货物是从发货地送到您所在城市的您提供具体地址，如地址不详需要您到指定的快递点自提，不会送到具体的行政区。提货时请注意携带收货人本人身份证原件，如需他人代收请告知具体签收注意事项。 02 实体店配送安装：当您选择了实体店配送安装，实体店安排物流运输、送货、专业安装整个流程，需事先与客服沟通说明，","此款一比一高仿宝玑手表包含：包装盒、吊牌、说明书、发票等。 本商品关键词:宝玑5817ST/92/5V8 购物温馨提示 01 快递运输：当您选择了快递运输，货物是从发货地送到您所在城市的您提供具体地址，如地址不详需要您到指定的快递点自提，不会送到具体的行政区。提货时请注意携带收货人本人身份证原件，如需他人代收请告知具体签收注意事项。 02 实体店配送安装：当您选择了实体店配送安装，实体店安排物流运输、送货、专业安装整个流程，需事先与客服沟通说明，以便后期送货服务的顺利进行。 03 快递运输：由快递公司送货",,航海系列,男士手表,真皮表带,圆形表盘,蓝宝石镜面
541,1,"2018-06-21 03:16:00",顶级品牌,541,"2018-06-22 21:59:07","江诗丹顿85180/000R-9166 mk精仿复刻江诗丹顿传承系列85180/000R-9166 机械男表",￥2780,￥8340,1608,294,,"江诗丹顿85180/000R-9166 高仿复刻MK江诗丹顿传承系列85180/000R-9166 机械男表【产地】MK厂手表【尺寸】直径：40毫米；厚度：9毫米.适合不同粗细的手腕佩戴。【颜色】如图显示【机芯】搭载进口Cal.2450超薄自动上弦.可长时间精确走时,存储高度能量.【功能】防水、防震、防磁;精致的阿拉伯经典刻度,指针独特设计,尽显示你的高贵气质,,优雅首选;背透,全新多功能机芯清晰可见.  【表壳】MK厂专属定制精钢纯钢表壳,实物拍摄,实物还比图片更有质感的.【表带】MK厂专属定制进口设计","MK厂手表【尺寸】直径：40毫米；厚度：9毫米.适合不同粗细的手腕佩戴。【颜色】如图显示【机芯】搭载进口Cal.2450超薄自动上弦.可长时间精确走时,存储高度能量.【功能】防水、防震、防磁;精致的阿拉伯经典刻度,指针独特设计,尽显示你的高贵气质,,优雅首选;背透,全新多功能机芯清晰可见.  【表壳】MK厂专属定制精钢纯钢表壳,实物拍摄,实物还比图片更有质感的.【表带】MK厂专属定制进口设计专用真皮表带【表面】100%高精度蓝宝石表面,历久如新的.抗磨抗划.正常佩带都是不会有划痕的.【保修】非认为损坏自购","直径：40毫米；厚度：9毫米.适合不同粗细的手腕佩戴。【颜色】如图显示【机芯】搭载进口Cal.2450超薄自动上弦.可长时间精确走时,存储高度能量.【功能】防水、防震、防磁;精致的阿拉伯经典刻度,指针独特设计,尽显示你的高贵气质,,优雅首选;背透,全新多功能机芯清晰可见.  【表壳】MK厂专属定制精钢纯钢表壳,实物拍摄,实物还比图片更有质感的.【表带】MK厂专属定制进口设计专用真皮表带【表面】100%高精度蓝宝石表面,历久如新的.抗磨抗划.正常佩带都是不会有划痕的.【保修】非认为损坏自购买起三年免费保修,",,,"9015改江诗丹顿自产2450机芯。从夹板到钢轮等部件均由MK制表师精工装饰，自动摆坨更是镀有18k铂金，最大限度呈现原装精湛的工艺水平。【表镜】前后两片蓝宝石玻璃镜面，均有防眩晕镀膜处理。【表带】双层意大利小牛皮，搭配马耳他十字针扣。   本店商品在交付邮递前都经过了48小时测试，测试通过才交付邮递，请放心购买。【品牌】江诗丹顿85180/000R-9166 高仿复刻MK江诗丹顿传承系列85180/000R-9166 机械男表【产地】MK厂手表【尺寸】直径：40毫米；厚度：9毫米.适合不同粗细的手腕佩戴","100%高精度蓝宝石表面,历久如新的.抗磨抗划.正常佩带都是不会有划痕的.【保修】非认为损坏自购买起三年免费保修,终身成本保修;【附件】吊牌说明书;配送""江诗""专用盒送礼、自带彰显品质.【标识】表盘,表背面,表面,表带，表扣等均有VC出产标识【优势】这款豪华一比一高仿江诗丹顿手表VACHERON CONSTANTIN手表可以使你在日常佩带之时长久保持美观夺目，常带常新；计时准确、造型美观、贴腕设计，质地轻巧、高贵典雅，是现代社会成功人士身份的象征；贴心设计,完全附合你的手腕   本商品关键词:江诗丹顿85",,"表盘,表背面,表面,表带，表扣等均有VC出产标识【优势】这款豪华一比一高仿江诗丹顿手表VACHERON CONSTANTIN手表可以使你在日常佩带之时长久保持美观夺目，常带常新；计时准确、造型美观、贴腕设计，质地轻巧、高贵典雅，是现代社会成功人士身份的象征；贴心设计,完全附合你的手腕   本商品关键词:江诗丹顿85180/000R-9166,高仿江诗丹顿85180/000R-9166,精仿江诗丹顿85180/000R-9166,复刻江诗丹顿85180/000R-9166 购物温馨提示 01 快递运输：当您","防水、防震、防磁;精致的阿拉伯经典刻度,指针独特设计,尽显示你的高贵气质,,优雅首选;背透,全新多功能机芯清晰可见.  【表壳】MK厂专属定制精钢纯钢表壳,实物拍摄,实物还比图片更有质感的.【表带】MK厂专属定制进口设计专用真皮表带【表面】100%高精度蓝宝石表面,历久如新的.抗磨抗划.正常佩带都是不会有划痕的.【保修】非认为损坏自购买起三年免费保修,终身成本保修;【附件】吊牌说明书;配送""江诗""专用盒送礼、自带彰显品质.【标识】表盘,表背面,表面,表带，表扣等均有VC出产标识【优势】这款豪华一比一高仿江","吊牌说明书;配送""江诗""专用盒送礼、自带彰显品质.【标识】表盘,表背面,表面,表带，表扣等均有VC出产标识【优势】这款豪华一比一高仿江诗丹顿手表VACHERON CONSTANTIN手表可以使你在日常佩带之时长久保持美观夺目，常带常新；计时准确、造型美观、贴腕设计，质地轻巧、高贵典雅，是现代社会成功人士身份的象征；贴心设计,完全附合你的手腕   本商品关键词:江诗丹顿85180/000R-9166,高仿江诗丹顿85180/000R-9166,精仿江诗丹顿85180/000R-9166,复刻江诗丹顿8518","这款豪华一比一高仿江诗丹顿手表VACHERON CONSTANTIN手表可以使你在日常佩带之时长久保持美观夺目，常带常新；计时准确、造型美观、贴腕设计，质地轻巧、高贵典雅，是现代社会成功人士身份的象征；贴心设计,完全附合你的手腕   本商品关键词:江诗丹顿85180/000R-9166,高仿江诗丹顿85180/000R-9166,精仿江诗丹顿85180/000R-9166,复刻江诗丹顿85180/000R-9166",传承系列,男士手表,真皮表带,圆形表盘,蓝宝石镜面
542,1,"2018-06-21 03:16:00",顶级品牌,542,"2018-06-22 21:59:07","江诗丹顿85180/000R-9248 mk精仿复刻江诗丹顿传承系列85180/000R-9248 机械男表",￥2780,￥8340,3028,232,,"江诗丹顿85180/000R-9248 高仿复刻MK江诗丹顿传承系列85180/000R-9248 机械男表","MK厂手表 【尺寸】直径：40毫米；厚度：9毫米.适合不同粗细的手腕佩戴。 【颜色】如图显示 【机芯】搭载进口Cal.2450超薄自动上弦.可长时间精确走时,存储高度能量. 【功能】防水、防震、防磁;精致的阿拉伯经典刻度,指针独特设计,尽显示你的高贵气质,,优雅首选;背透,全新多功能机芯清晰可见. 【表壳】MK厂专属定制精钢纯钢表壳,实物拍摄,实物还比图片更有质感的. 【表带】MK厂专属定制进口设计专用真皮表带 【表面】100%高精度蓝宝石表面,历久如新的.抗磨抗划.正常佩带都是不会有划痕的. 【保修】非",直径：40毫米；厚度：9毫米.适合不同粗细的手腕佩戴。,,,9015改江诗丹顿自产2450机芯。从夹板到钢轮等部件均由MK制表师精工装饰，自动摆坨更是镀有18k铂金，最大限度呈现原装精湛的工艺水平。,"100%高精度蓝宝石表面,历久如新的.抗磨抗划.正常佩带都是不会有划痕的.",,"表盘,表背面,表面,表带，表扣等均有VC出产标识","防水、防震、防磁;精致的阿拉伯经典刻度,指针独特设计,尽显示你的高贵气质,,优雅首选;背透,全新多功能机芯清晰可见.","吊牌说明书;配送""江诗""专用盒送礼、自带彰显品质.","这款豪华一比一高仿江诗丹顿手表VACHERON CONSTANTIN手表可以使你在日常佩带之时长久保持美观夺目，常带常新；计时准确、造型美观、贴腕设计，质地轻巧、高贵典雅，是现代社会成功人士身份的象征；贴心设计,完全附合你的手腕",传承系列,男士手表,真皮表带,圆形表盘,蓝宝石镜面
543,1,"2018-06-21 03:16:00",顶级品牌,543,"2018-06-22 21:59:09","江诗丹顿85180/000J-9231 mk精仿复刻江诗丹顿传承系列85180/000J-9231 机械男表",￥2780,￥8340,2278,238,,"江诗丹顿85180/000J-9231 高仿复刻MK江诗丹顿传承系列85180/000J-9231 机械男表","MK厂手表 【尺寸】直径：40毫米；厚度：9毫米.适合不同粗细的手腕佩戴。 【颜色】如图显示 【机芯】搭载进口Cal.2450超薄自动上弦.可长时间精确走时,存储高度能量. 【功能】防水、防震、防磁;精致的阿拉伯经典刻度,指针独特设计,尽显示你的高贵气质,,优雅首选;背透,全新多功能机芯清晰可见.   【表壳】MK厂专属定制精钢纯钢表壳,实物拍摄,实物还比图片更有质感的. 【表带】MK厂专属定制进口设计专用真皮表带 【表面】100%高精度蓝宝石表面,历久如新的.抗磨抗划.正常佩带都是不会有划痕的. 【保修",直径：40毫米；厚度：9毫米.适合不同粗细的手腕佩戴。,,,9015改江诗丹顿自产2450机芯。从夹板到钢轮等部件均由MK制表师精工装饰，自动摆坨更是镀有18k铂金，最大限度呈现原装精湛的工艺水平。,"100%高精度蓝宝石表面,历久如新的.抗磨抗划.正常佩带都是不会有划痕的.",,"表盘,表背面,表面,表带，表扣等均有VC出产标识","防水、防震、防磁;精致的阿拉伯经典刻度,指针独特设计,尽显示你的高贵气质,,优雅首选;背透,全新多功能机芯清晰可见.  ","吊牌说明书;配送""江诗""专用盒送礼、自带彰显品质.","这款豪华一比一高仿江诗丹顿手表VACHERON CONSTANTIN手表可以使你在日常佩带之时长久保持美观夺目，常带常新；计时准确、造型美观、贴腕设计，质地轻巧、高贵典雅，是现代社会成功人士身份的象征；贴心设计,完全附合你的手腕",传承系列,男士手表,真皮表带,圆形表盘,蓝宝石镜面
544,1,"2018-06-21 03:16:00",顶级品牌,544,"2018-06-22 21:59:13","江诗丹顿85180/000G-9230 mk精仿复刻江诗丹顿传承系列85180/000G-9230 机械男表",￥2680,￥8040,2622,289,,"江诗丹顿85180/000G-9230 高仿复刻MK江诗丹顿传承系列85180/000G-9230 机械男表","MK厂手表 【尺寸】直径：40毫米；厚度：9毫米.适合不同粗细的手腕佩戴。 【颜色】如图显示 【机芯】搭载进口Cal.2450超薄自动上弦.可长时间精确走时,存储高度能量. 【功能】防水、防震、防磁;精致的阿拉伯经典刻度,指针独特设计,尽显示你的高贵气质,,优雅首选;背透,全新多功能机芯清晰可见.   【表壳】MK厂专属定制精钢纯钢表壳,实物拍摄,实物还比图片更有质感的. 【表带】MK厂专属定制进口设计专用真皮表带 【表面】100%高精度蓝宝石表面,历久如新的.抗磨抗划.正常佩带都是不会有划痕的. 【保修",直径：40毫米；厚度：9毫米.适合不同粗细的手腕佩戴。,,,9015改江诗丹顿自产2450机芯。从夹板到钢轮等部件均由MK制表师精工装饰，自动摆坨更是镀有18k铂金，最大限度呈现原装精湛的工艺水平。,"100%高精度蓝宝石表面,历久如新的.抗磨抗划.正常佩带都是不会有划痕的.",,"表盘,表背面,表面,表带，表扣等均有VC出产标识","防水、防震、防磁;精致的阿拉伯经典刻度,指针独特设计,尽显示你的高贵气质,,优雅首选;背透,全新多功能机芯清晰可见.  ","吊牌说明书;配送""江诗""专用盒送礼、自带彰显品质.","这款豪华一比一高仿江诗丹顿手表VACHERON CONSTANTIN手表可以使你在日常佩带之时长久保持美观夺目，常带常新；计时准确、造型美观、贴腕设计，质地轻巧、高贵典雅，是现代社会成功人士身份的象征；贴心设计,完全附合你的手腕",传承系列,男士手表,真皮表带,圆形表盘,蓝宝石镜面
545,1,"2018-06-21 03:16:00",顶级品牌,545,"2018-06-22 21:59:15","爱彼67653 精仿OM复刻爱彼皇家橡树系列67653“霜金”腕表 石英女表",￥2580,￥7740,1157,193,,"爱彼67653 高仿复刻OM爱彼皇家橡树系列67653“霜金”腕表 石英女表","OM组装 【表面】100%的抗磨蓝宝石水晶表面（拱形蓝宝石）与同步;历久如新,抗磨抗划.正常佩带可以保持长久不花.的镜面.品质信誉保证. 【机芯】搭载瑞士进口石英机芯.可长时间精确走时,存储高度能量. 【大小】直径如图所示：33毫米、厚度7毫米；（适合不同粗细手腕佩戴） 【功能】内部储能很强，长时间不戴依然走时准确，实物拍摄,实物还比其更有质感. 【表带】采用一比一复刻爱彼手表专用原装扣。 【表壳】316L精钢耐磨表壳,永不生锈。 【保修】非人为损坏自购买起三年免费保修,终身成本保修; 【附件】配送""爱彼",,直径如图所示：33毫米、厚度7毫米；（适合不同粗细手腕佩戴）,,"搭载瑞士进口石英机芯.可长时间精确走时,存储高度能量.","100%的抗磨蓝宝石水晶表面（拱形蓝宝石）与同步;历久如新,抗磨抗划.正常佩带可以保持长久不花.的镜面.品质信誉保证.",,"表带，表扣,机芯,表面,表按钮等全部有原厂爱彼标识（更多的细节可通过我们下面附带的图片参考）","内部储能很强，长时间不戴依然走时准确，实物拍摄,实物还比其更有质感.","配送""爱彼手表""专用盒,说明书保修卡识别卡等所有附件齐全，让你无论送礼或者自用都尽显非凡.","这款豪华一比一高仿爱彼手表颠峰设计表,可以使你在日常佩带之时长久保持美观夺目，常带常新；计时准确、造型美观、贴腕设计，质地轻巧、高贵典雅，是现代社会成功人士身份的象征；贴心设计,完全附合你的手腕.",皇家橡树系列,女士手表,钢带表带,圆形表盘,蓝宝石镜面
546,1,"2018-06-21 03:16:00",顶级品牌,546,"2018-06-22 21:59:17","爱彼67653BC.GG.1263BC.01 精仿OM复刻爱彼皇家橡树系列67653BC.GG.1263BC.01 石英女表",￥2580,￥7740,1931,164,,"爱彼67653BC.GG.1263BC.01 高仿复刻OM爱彼皇家橡树系列67653BC.GG.1263BC.01 石英女表","OM组装 【表面】100%的抗磨蓝宝石水晶表面（拱形蓝宝石）与同步;历久如新,抗磨抗划.正常佩带可以保持长久不花.的镜面.品质信誉保证. 【机芯】搭载瑞士进口石英机芯.可长时间精确走时,存储高度能量. 【大小】直径如图所示：33毫米、厚度7毫米；（适合不同粗细手腕佩戴） 【功能】内部储能很强，长时间不戴依然走时准确，实物拍摄,实物还比其更有质感. 【表带】采用一比一复刻爱彼手表专用原装扣。 【表壳】316L精钢耐磨表壳,永不生锈。 【保修】非人为损坏自购买起三年免费保修,终身成本保修; 【附件】配送""爱彼",,直径如图所示：33毫米、厚度7毫米；（适合不同粗细手腕佩戴）,,"搭载瑞士进口石英机芯.可长时间精确走时,存储高度能量.","100%的抗磨蓝宝石水晶表面（拱形蓝宝石）与同步;历久如新,抗磨抗划.正常佩带可以保持长久不花.的镜面.品质信誉保证.",,"表带，表扣,机芯,表面,表按钮等全部有原厂爱彼标识（更多的细节可通过我们下面附带的图片参考）","内部储能很强，长时间不戴依然走时准确，实物拍摄,实物还比其更有质感.","配送""爱彼手表""专用盒,说明书保修卡识别卡等所有附件齐全，让你无论送礼或者自用都尽显非凡.","这款豪华一比一高仿爱彼手表颠峰设计表,可以使你在日常佩带之时长久保持美观夺目，常带常新；计时准确、造型美观、贴腕设计，质地轻巧、高贵典雅，是现代社会成功人士身份的象征；贴心设计,完全附合你的手腕.",皇家橡树系列,女士手表,钢带表带,圆形表盘,蓝宝石镜面
547,1,"2018-06-21 03:16:00",顶级品牌,547,"2018-06-22 21:59:22","爱彼67650ST.OO.1261ST.01 精仿OM复刻爱彼皇家橡树系列67650ST.OO.1261ST.01 石英女表",￥2580,￥7740,599,190,,"爱彼67650ST.OO.1261ST.01 高仿复刻OM爱彼皇家橡树系列67650ST.OO.1261ST.01 石英女表","OM组装 【表面】100%的抗磨蓝宝石水晶表面（拱形蓝宝石）与同步;历久如新,抗磨抗划.正常佩带可以保持长久不花.的镜面.品质信誉保证. 【机芯】搭载瑞士进口石英机芯.可长时间精确走时,存储高度能量. 【大小】直径如图所示：33毫米、厚度7毫米；（适合不同粗细手腕佩戴） 【功能】内部储能很强，长时间不戴依然走时准确，实物拍摄,实物还比其更有质感. 【表带】采用一比一复刻爱彼手表专用原装扣。  【表壳】316L精钢耐磨表壳,永不生锈。 【保修】非人为损坏自购买起三年免费保修,终身成本保修; 【附件】配送""爱",,直径如图所示：33毫米、厚度7毫米；（适合不同粗细手腕佩戴）,,"搭载瑞士进口石英机芯.可长时间精确走时,存储高度能量.","100%的抗磨蓝宝石水晶表面（拱形蓝宝石）与同步;历久如新,抗磨抗划.正常佩带可以保持长久不花.的镜面.品质信誉保证.",,"表带，表扣,机芯,表面,表按钮等全部有原厂爱彼标识（更多的细节可通过我们下面附带的图片参考）","内部储能很强，长时间不戴依然走时准确，实物拍摄,实物还比其更有质感.","配送""爱彼手表""专用盒,说明书保修卡识别卡等所有附件齐全，让你无论送礼或者自用都尽显非凡.","这款豪华一比一高仿爱彼手表颠峰设计表,可以使你在日常佩带之时长久保持美观夺目，常带常新；计时准确、造型美观、贴腕设计，质地轻巧、高贵典雅，是现代社会成功人士身份的象征；贴心设计,完全附合你的手腕.   ",皇家橡树系列,女士手表,钢带表带,圆形表盘,蓝宝石镜面
548,1,"2018-06-21 03:16:00",顶级品牌,548,"2018-06-22 21:59:23","芝柏49525-52-232-BKCA 精仿FK复刻芝柏1996系列49525-52-232-BKCA 玫瑰金 机械男表",￥2680,￥8040,3293,108,,"芝柏49525-52-432-BB4A 高仿复刻FK芝柏1996系列49525-52-432-BB4A 玫瑰金 机械男表","香港组装 【尺寸】直径38毫米、厚度：8.62毫米;适合不同粗细手腕的人佩带. 【颜色】如图显示 【机芯】进口复刻GP3300自动机械机芯.可长时间精确走时,存储高度能量. 【功能】防水、防震、防磁;精致的条丁经典刻度,指针独特设计,带日历,尽显示你的高贵气质,优雅首选; 【表壳】精钢纯钢表壳,实物拍摄,实物还比图片更有质感的. 【表带】意大利牛皮小牛皮表带. 【表面】100%高精度蓝宝石表面,历久如新的.抗磨抗划.正常佩带都是不会有划痕的. 【保修】非认为损坏自购买起三年免费保修,终身成本保修; 【附件",直径38毫米、厚度：8.62毫米;适合不同粗细手腕的人佩带.,,,"进口复刻GP3300自动机械机芯.可长时间精确走时,存储高度能量.","100%高精度蓝宝石表面,历久如新的.抗磨抗划.正常佩带都是不会有划痕的.",,"表盘,表背面,表面,表带,表扣等均有芝柏出产标识","防水、防震、防磁;精致的条丁经典刻度,指针独特设计,带日历,尽显示你的高贵气质,优雅首选;","吊牌说明书;配送""芝柏""专用盒送礼、自带彰显品质.","这款豪华一比一高仿芝柏手表(Girard-Perregaux)可以使你在日常佩带之时长久保持美观夺目，常带常新；计时准确、造型美观、贴腕设计，质地轻巧、高贵典雅，是现代社会成功人士身份的象征；贴心设计,完全附合你的手腕","GP 1966系列",男士手表,真皮表带,圆形表盘,蓝宝石镜面
549,1,"2018-06-21 03:16:00",顶级品牌,549,"2018-06-22 21:59:24","芝柏49525-52-432-BB4A 精仿FK复刻芝柏1996系列49525-52-432-BB4A 玫瑰金 机械男表",￥2680,￥8040,2021,144,,"芝柏49525-52-432-BB4A 高仿复刻FK芝柏1996系列49525-52-432-BB4A 玫瑰金 机械男表","香港组装 【尺寸】直径38毫米、厚度：8.62毫米;适合不同粗细手腕的人佩带. 【颜色】如图显示 【机芯】进口复刻GP3300自动机械机芯.可长时间精确走时,存储高度能量. 【功能】防水、防震、防磁;精致的条丁经典刻度,指针独特设计,带日历,尽显示你的高贵气质,优雅首选; 【表壳】精钢纯钢表壳,实物拍摄,实物还比图片更有质感的. 【表带】意大利牛皮小牛皮表带. 【表面】100%高精度蓝宝石表面,历久如新的.抗磨抗划.正常佩带都是不会有划痕的. 【保修】非认为损坏自购买起三年免费保修,终身成本保修; 【附件",直径38毫米、厚度：8.62毫米;适合不同粗细手腕的人佩带.,,,"进口复刻GP3300自动机械机芯.可长时间精确走时,存储高度能量.","100%高精度蓝宝石表面,历久如新的.抗磨抗划.正常佩带都是不会有划痕的.",,"表盘,表背面,表面,表带,表扣等均有芝柏出产标识","防水、防震、防磁;精致的条丁经典刻度,指针独特设计,带日历,尽显示你的高贵气质,优雅首选;","吊牌说明书;配送""芝柏""专用盒送礼、自带彰显品质.","这款豪华一比一高仿芝柏手表(Girard-Perregaux)可以使你在日常佩带之时长久保持美观夺目，常带常新；计时准确、造型美观、贴腕设计，质地轻巧、高贵典雅，是现代社会成功人士身份的象征；贴心设计,完全附合你的手腕","GP 1966系列",男士手表,真皮表带,圆形表盘,蓝宝石镜面
550,1,"2018-06-21 03:16:00",顶级品牌,550,"2018-06-22 21:59:27","芝柏49525D52A1A1-BK6A 精仿FK复刻芝柏1996系列49525D52A1A1-BK6A 玫瑰金 镶钻 机械男表",￥2780,￥8340,3140,165,,"芝柏49525D52A1A1-BK6A 高仿复刻FK芝柏1996系列49525D52A1A1-BK6A 玫瑰金 机械男表","香港组装 【尺寸】直径38毫米、厚度：8.62毫米;适合不同粗细手腕的人佩带. 【颜色】如图显示 【机芯】进口复刻GP3300自动机械机芯.可长时间精确走时,存储高度能量. 【功能】防水、防震、防磁;精致的条丁经典刻度,指针独特设计,带日历,尽显示你的高贵气质,优雅首选; 【表壳】精钢纯钢表壳,实物拍摄,实物还比图片更有质感的. 【表带】意大利牛皮小牛皮表带. 【表面】100%高精度蓝宝石表面,历久如新的.抗磨抗划.正常佩带都是不会有划痕的. 【保修】非认为损坏自购买起三年免费保修,终身成本保修; 【附件",直径38毫米、厚度：8.62毫米;适合不同粗细手腕的人佩带.,,,"进口复刻GP3300自动机械机芯.可长时间精确走时,存储高度能量.","100%高精度蓝宝石表面,历久如新的.抗磨抗划.正常佩带都是不会有划痕的.",,"表盘,表背面,表面,表带,表扣等均有芝柏出产标识","防水、防震、防磁;精致的条丁经典刻度,指针独特设计,带日历,尽显示你的高贵气质,优雅首选;","吊牌说明书;配送""芝柏""专用盒送礼、自带彰显品质.","这款豪华一比一高仿芝柏手表(Girard-Perregaux)可以使你在日常佩带之时长久保持美观夺目，常带常新；计时准确、造型美观、贴腕设计，质地轻巧、高贵典雅，是现代社会成功人士身份的象征；贴心设计,完全附合你的手腕","GP 1966系列",男士手表,真皮表带,圆形表盘,蓝宝石镜面
551,1,"2018-06-21 03:16:00",顶级品牌,551,"2018-06-22 21:59:28","芝柏49525-52-131-BK6A 精仿FK复刻芝柏1996系列49525-52-131-BK6A 玫瑰金 机械男表",￥2680,￥8040,2326,127,,"芝柏49525-52-131-BK6A 高仿复刻FK芝柏1996系列49525-52-131-BK6A 玫瑰金 机械男表","香港组装 【尺寸】直径38毫米、厚度：8.62毫米;适合不同粗细手腕的人佩带. 【颜色】如图显示 【机芯】进口复刻GP3300自动机械机芯.可长时间精确走时,存储高度能量. 【功能】防水、防震、防磁;精致的条丁经典刻度,指针独特设计,带日历,尽显示你的高贵气质,优雅首选; 【表壳】精钢纯钢表壳,实物拍摄,实物还比图片更有质感的. 【表带】意大利牛皮小牛皮表带. 【表面】100%高精度蓝宝石表面,历久如新的.抗磨抗划.正常佩带都是不会有划痕的. 【保修】非认为损坏自购买起三年免费保修,终身成本保修; 【附件",直径38毫米、厚度：8.62毫米;适合不同粗细手腕的人佩带.,,,"进口复刻GP3300自动机械机芯.可长时间精确走时,存储高度能量.","100%高精度蓝宝石表面,历久如新的.抗磨抗划.正常佩带都是不会有划痕的.",,"表盘,表背面,表面,表带,表扣等均有芝柏出产标识","防水、防震、防磁;精致的条丁经典刻度,指针独特设计,带日历,尽显示你的高贵气质,优雅首选;","吊牌说明书;配送""芝柏""专用盒送礼、自带彰显品质.","这款豪华一比一高仿芝柏手表(Girard-Perregaux)可以使你在日常佩带之时长久保持美观夺目，常带常新；计时准确、造型美观、贴腕设计，质地轻巧、高贵典雅，是现代社会成功人士身份的象征；贴心设计,完全附合你的手腕","GP 1966系列",男士手表,真皮表带,圆形表盘,蓝宝石镜面
552,1,"2018-06-21 03:16:00",顶级品牌,552,"2018-06-22 21:59:31","芝柏49525-52-1A1-BK6A 精仿FK复刻芝柏1996系列49525-52-1A1-BK6A 玫瑰金 机械男表",￥2680,￥8040,596,106,,"芝柏49525-52-1A1-BK6A 高仿复刻FK芝柏1996系列49525-52-1A1-BK6A 玫瑰金 机械男表","香港组装 【尺寸】直径38毫米、厚度：8.62毫米;适合不同粗细手腕的人佩带. 【颜色】如图显示 【机芯】进口复刻GP3300自动机械机芯.可长时间精确走时,存储高度能量. 【功能】防水、防震、防磁;精致的条丁经典刻度,指针独特设计,带日历,尽显示你的高贵气质,优雅首选; 【表壳】精钢纯钢表壳包玫瑰金,实物拍摄,实物还比图片更有质感的. 【表带】意大利牛皮小牛皮表带. 【表面】100%高精度蓝宝石表面,历久如新的.抗磨抗划.正常佩带都是不会有划痕的. 【保修】非认为损坏自购买起三年免费保修,终身成本保修;",直径38毫米、厚度：8.62毫米;适合不同粗细手腕的人佩带.,,,"进口复刻GP3300自动机械机芯.可长时间精确走时,存储高度能量.","100%高精度蓝宝石表面,历久如新的.抗磨抗划.正常佩带都是不会有划痕的.",,"表盘,表背面,表面,表带,表扣等均有芝柏出产标识","防水、防震、防磁;精致的条丁经典刻度,指针独特设计,带日历,尽显示你的高贵气质,优雅首选;","吊牌说明书;配送""芝柏""专用盒送礼、自带彰显品质.","这款豪华一比一高仿芝柏手表(Girard-Perregaux)可以使你在日常佩带之时长久保持美观夺目，常带常新；计时准确、造型美观、贴腕设计，质地轻巧、高贵典雅，是现代社会成功人士身份的象征；贴心设计,完全附合你的手腕","GP 1966系列",男士手表,真皮表带,圆形表盘,蓝宝石镜面
553,1,"2018-06-21 03:16:00",顶级品牌,553,"2018-06-22 21:59:35","芝柏49525-53-631-BK6A 精仿FK复刻芝柏1996系列49525-53-631-BK6A 机械男表",￥2580,￥7740,3157,123,,"芝柏49525-53-631-BK6A 高仿复刻FK芝柏1996系列49525-53-631-BK6A 机械男表","香港组装 【尺寸】直径38毫米、厚度：8.62毫米;适合不同粗细手腕的人佩带. 【颜色】如图显示 【机芯】进口复刻GP3300自动机械机芯.可长时间精确走时,存储高度能量. 【功能】防水、防震、防磁;精致的条丁经典刻度,指针独特设计,带日历,尽显示你的高贵气质,优雅首选; 【表壳】精钢纯钢表壳,实物拍摄,实物还比图片更有质感的. 【表带】意大利牛皮小牛皮表带. 【表面】100%高精度蓝宝石表面,历久如新的.抗磨抗划.正常佩带都是不会有划痕的. 【保修】非认为损坏自购买起三年免费保修,终身成本保修; 【附件",直径38毫米、厚度：8.62毫米;适合不同粗细手腕的人佩带.,,,"进口复刻GP3300自动机械机芯.可长时间精确走时,存储高度能量.","100%高精度蓝宝石表面,历久如新的.抗磨抗划.正常佩带都是不会有划痕的.",,"表盘,表背面,表面,表带,表扣等均有芝柏出产标识","防水、防震、防磁;精致的条丁经典刻度,指针独特设计,带日历,尽显示你的高贵气质,优雅首选;","吊牌说明书;配送""芝柏""专用盒送礼、自带彰显品质.","这款豪华一比一高仿芝柏手表(Girard-Perregaux)可以使你在日常佩带之时长久保持美观夺目，常带常新；计时准确、造型美观、贴腕设计，质地轻巧、高贵典雅，是现代社会成功人士身份的象征；贴心设计,完全附合你的手腕","GP 1966系列",男士手表,真皮表带,圆形表盘,蓝宝石镜面