category_2_x_jiamengdian.id,category_2.id,category_2.ts,category_2.title,category_2.category_1,category_1.id,category_1.ts,category_1.title,jiamengdian.id,jiamengdian.ts,jiamengdian.title,jiamengdian.gongsi,jiamengdian.touzie,jiamengdian.hangye,jiamengdian.mendian,jiamengdian.biaoqian,jiamengdian.gongsi_beijing,jiamengdian.jiameng_youshi,jiamengdian.jiameng_tiaojian,jiamengdian.jiameng_zhichi,jiamengdian.jiameng_liucheng,jiamengdian.jingying_moshi,jiamengdian.pinpai_yuandi,jiamengdian.hetong_qixian,jiamengdian.jingying_chanpin,jiamengdian.shihe_renqun,jiamengdian.zhaoshang_wangzhi
6456,1,"2018-06-13 02:20:33",烘焙店,餐饮,1,"2018-06-12 23:37:56",餐饮,6456,"2018-06-13 08:42:42",麦栈养生烘焙蛋糕,麦栈养生烘焙蛋糕店,"30-50 万",餐饮,90家,餐饮烘焙店,"麦栈养生烘焙蛋糕加盟简介 麦栈养生烘焙的发展一直保持着非常正确的发展策略，没阻力的快速发展，为人们带来优势的创业项目。自上市以来，始终秉承“时尚健康、营养美味”的经营理念，向市场提供各种烘焙甜点美食，用特色和美味牢牢抓住市场，占领行业制高点。品牌的发展是非常有责任心的，在保证为消费者带来好的服务同时，促进品牌更好的发展。产品风味独特，美味无比，备受消费者的喜爱。提供健康，营养、时尚、美味的产品，配以精美的包装，最大限度满足消费者的购买需求。我们对于加盟商也是本着非常负责任的态度，保证加盟事业的更好发展，保证加盟商更好的盈利。优质产品，从法式面包、西点蛋糕到甜点饮品一百多个系列上千个品种，适合各个阶层和各种年龄层次的人群。麦栈养生烘焙蛋糕加盟优势1、品牌护航，品牌格局时代，有人气才有财气有统一的店面形象以及装修设计风格，有效推动终端视觉风格统一化建设，给消费者带来规范的认知，使其产生消费信心。奉行品牌制胜法则，致力于品牌文化建设与完善，成功推出品牌文化系统、品牌战略规划等系统性品牌建设。2、国际规格产品检测与审核，有品质才有保障对于物料，本店对店内所售卖产品物料有着严格管控与要求，物料均与业内知名厂商，企业对店内技术人员的操作要求也有严格的规范标准标，保证了售卖到客人口中每一种产品的安全，确保每一道产品都是100%健康。3、五大传播渠道，强力品牌传播本坊利用各种媒体渠道，全面提升品牌知名度、品牌影响力！网络、电视、报刊、杂志、行业展会五大传播渠道，强力品牌传播，助力合作商4、灵活合作机制及项目选择，净化合作风险严格的商圈保护政策、安全的退出机制，让每一位加盟者无后顾之忧，安心奔钱程.5、最系统培训方案，无保留培训合作商总部打造专业的培训中心，将复杂的营销理论分解到日常细节上。让店员用最短的时间成为经营高手。麦栈养生烘焙蛋糕加盟流程1：合作咨询：只要有投资意向者可通过电话、传真、网上留言等方式进行咨询，或者您可以亲临总部进行考察。2：加盟店选址：有投资意向者总部会派人与您接洽，对申请者所申请的区域进行详细的调查分析，为经营的位置提出参考依据。3：对申请者进行审核回复：总部会派工作人员对申请者所在市区的市场环境、消费情况和申请者自身条件作为参考，并对投资预算、营业费用预算、营业额、投资回报和经营潜力做一个评估审核后给予回复寻求进一步合作。4：交纳费用：为了便于日后更良性合作，总部以押金形式收取拿货保证金。待合同解除后立即返还。5：签约：具备合作条件者，可与总部签定品牌经营合同书，若您不方便过来本部，我司亦可派专人亲自与您办理签约及相关手续。6：店铺装潢：待合同签定完毕后，总部派专人专项免费为加盟商提供装潢设计方案，并及时落实执行。7：人员培训：加盟商需派人到总部进行上岗培训，所需费用由加盟商自行承担。8：开业准备：做好开业策划与宣传，公司也会指派相应人员进行现场指导，加盟商必须按总部培训要求进行店面布置和货品陈列，择日开业。9：后续跟踪服务：开业后，总部会适时的提供新的营销指导方案，不定期对店铺进行经营指导。注：本项目投资金额、加盟店数量、招商加盟地区和经营模式，请以最新咨询为准！我们建议您在下方【留言板留言】 或致电咨询 ，您即可与企业免费通话并及时获得加盟项目最新动态（企业要求各不一，建议了解多个项目做对比）。招商加盟网，更多加盟项目请登陆加盟网了解。",,,,,"合作,混合",广东,5年,蛋糕,自由创业者、在岗投资、毕业生创业、其他,https://www.qj.com.cn/brand/mzyshbdgd/index/
6457,1,"2018-06-13 02:20:33",烘焙店,餐饮,1,"2018-06-12 23:37:56",餐饮,6457,"2018-06-13 08:42:45",七点自造DIY烘焙,七点自造食品有限公司,"5-10 万",餐饮,100家,餐饮烘焙店,"七点自造品牌的由来七点自造投资人是台湾人，讲的是闽南话，闽南口音里7和西点的西是同音，我们的服务模式也创造了烘焙行业的新起点，也是开创顾客在我们的店里喜欢、开心的喜点，7又是国际公认的幸运数字。于是我们的七点品牌就诞生了：七点=西点=起点=喜点。七点自造与台湾的渊源我们的投资人是台湾人，是他将台湾良好的烘焙技术团队带到厦门。将细节管理和服务完美融合在七点自造的每家加盟店中。我们是纯正的中国品牌，公司核心的管理团队都是经过多年培养出来的。因为我们了解中国市场和中国创业者，才能在经营的过程中扶持和帮助每家加盟店。通过7年不懈的努力才有了今天踏实稳健的七点自造，为加盟店创造品牌价值，分享品牌价值。品牌介绍七点自造食品有限公司成立于2007年，是一家专业从事烘焙行业8年的企业，是集品牌运营、烘焙器具销售、DIY烘焙的全国连锁机构。公司成立初期主要以台湾烘焙行业中的烘焙原料、器具的加工以及代理销售为主。因大陆烘焙市场有广阔的发展前景，在公司成立一年后，开始着手拓展家庭及个人烘焙原料及模具的销售以及传播国外流行的家庭DIY烘焙新模式，在国内首创DIY烘焙的先河。现已拥有500多家加盟店，覆盖全国所有省份。作为全国首家推出专业DIY烘焙馆的企业，七点自造以“自己动手做蛋糕，人人都是西点师”为理念，引领健康、时尚的消费新体验。七点自造DIY烘焙馆注重烘焙爱好者的经验交流与分享，为您设计了设备齐全的DIY烘焙交流学习区，烘焙教学师将悉心指导您完成每一步操作，可以让你轻松发挥创意，创造出健康、美味、独一无二的西点与身边的人一起分享，感受您的喜悦和满满的成就。亲子烘焙活动、手工现场烘焙西点提供、互动烘焙DIY团队课程。精选60余款针对家庭蛋糕西点课程及烘焙DIY项目，让社会大众不分男女老少都可以简单学会，真正感受自己动手做蛋糕，人人都是西点师的生活乐趣，充分体现自己创造美味、卫生、精致的健康家居生活。七点自造招商加盟详情注：本项目投资金额、加盟店数量、招商加盟地区和经营模式，请以最新咨询为准！我们建议您在下方【留言板留言】 或致电咨询 ，您即可与企业免费通话并及时获得加盟项目最新动态（企业要求各不一，建议了解多个项目做对比）。招商加盟网，更多加盟项目请登陆加盟网了解。",,,,,"特许,自由连锁",福建,3年,面包,毕业生创业,https://www.qj.com.cn/brand/700diy12/index/
6458,1,"2018-06-13 02:20:33",烘焙店,餐饮,1,"2018-06-12 23:37:56",餐饮,6458,"2018-06-13 08:42:48",美味轩,惠州市美味轩食品有限公司,"1-5 万",餐饮,95家,餐饮烘焙店,"美味轩加盟惠州市美味轩食品有限公司成立于2002年，拥有11家门店，是惠州门店数量最多的专业烘焙食品制造商之一，2014年6月，公司成功开设了爱与爱蛋糕会所（即美味轩梦工坊），会所以蛋糕DIY现场自做和体验为核心项目，以“共享欢乐、传递爱心”为核心经营主题，为顾客开辟了一个全新的互动平台。美味轩专注烘焙行业十余年，主营面包、西饼、蛋糕、应节食品（粽子、月饼）；同时为顾客提供更好的蛋糕会所自做互动体验（美味轩梦工坊）。专注一个行业、关注客户体验、倾注一份爱心是美味轩人的不懈努力的方向；不求大、不务虚、只求真是我们行为的准则。自公司成立以来，从原辅材料采购、仓储、生产、配送、门店销售全过程均严格遵循QS的标准进行。任何上市销售的产品都必须符合敢吃、好吃的基本原则。美味轩加盟优势安全：食品是个良心产业，第一准则就是食品安全，对每个环节的安全控制就是对顾客负责，对企业负责。美味：食品行业也是个个性行业，每个顾客的口味都有区别，我们的目标就是尽可能的满足顾客的需求，为顾客提供美味的产品是每个做食品的人都应该孜孜以求的目标。真心：作为一个食品行业的人，做一天美食容易，做一世美食难、做一世安全的美食更难，只有用自己的真心投入，才能换得顾客的长期认可，知易行难，做好食品不仅要会做、还要用“心”做。快乐：食品行业也是快乐的行业，每个人每天都要进行的不可或缺活动。美食是自人类诞生之日起就在不断的同人类一起进步，它不仅是生存的需求，也是在人们不断享受快乐的过程。注：本项目投资金额、加盟店数量、招商加盟地区和经营模式，请以最新咨询为准！我们建议您在下方【留言板留言】 或致电咨询 ，您即可与企业免费通话并及时获得加盟项目最新动态（企业要求各不一，建议了解多个项目做对比）。招商加盟网，更多加盟项目请登陆加盟网了解。",,,,,"特许,合作",广东,2年,主营面包、西饼、蛋糕、应节食品,自由创业者、在岗投资、毕业生创业、其他,https://www.qj.com.cn/brand/meiweixuan/index/
6459,1,"2018-06-13 02:20:33",烘焙店,餐饮,1,"2018-06-12 23:37:56",餐饮,6459,"2018-06-13 08:42:49",烘焙教室,烘焙教室有限责任公司,"10-20 万",餐饮,128家,餐饮烘焙店,"烘焙教室加盟《烘焙宝典·面包教室》详细介绍了面包制作的基本知识和112种涵盖各式风味口感的面包的制作方法。每种面包均配有详细的步骤分解图片、制作说明和制作指导，针对学习者制作时容易出现的问题和需要注意的地方给出适当的建议，可帮助您更好地进行操作。您不妨现在就试试看，享受自己动手做出来的面包，看看与大师傅做出来的有何不同。只要熟记《烘焙宝典·面包教室》的指导要领，实际操作几次，很快您也可以成为烘焙高手。不论是初学者还是有一定基础的熟练者，都可以轻松上手，让您度过一个美好时光，享受快乐的生活！烘焙教室加盟条件1、备独立民事责任行为的企业组织或个体公民。2、热衷于烘培事业的拓展与烘培文化的传播。3、拥有一定的资金实力和良好的商业信誉。4、具有品牌意识和良好的从业道德及持久经营意识。5、了解本地区同行业市场，具备适宜的经营场所。6、认可总部的经营理念和一致的经营管理方式，服从连锁总部的统一管理。烘焙教室加盟流程第一步：签订《烘焙教室加盟意向书》；第二步：总部给予《烘焙教室店铺选址标准》及《市场调研手册》第三步：加盟商将《市场调研手册》、店铺门头及店内布局照片、发回招商专员，待 总部评审是否开放该店加盟。第四步：确定开店到总部签署正式《烘焙教室加盟协议》第五步：加盟商提供身份证复印件，向财务缴纳相应费用；第六步：加盟商开始招聘店员、办理门店营运相关证件（办证参考附件1）；第七步：申报4兆及以上电信宽带和固定电话；第八步：对已招募店员进行相应岗位操作培训（定岗定位）；第九步：设计师10个工作日内设计图纸，双方确认图纸；第十步：签订装修协议，并支付装修预付款；注：本项目投资金额、加盟店数量、招商加盟地区和经营模式，请以最新咨询为准！我们建议您在下方【留言板留言】 或致电咨询 ，您即可与企业免费通话并及时获得加盟项目最新动态（企业要求各不一，建议了解多个项目做对比）。招商加盟网，更多加盟项目请登陆加盟网了解。",,,,,"特许,合作",山东,2年,面包房,自由创业者、在岗投资、毕业生创业、其他,https://www.qj.com.cn/brand/hpjs/index/
6460,1,"2018-06-13 02:20:33",烘焙店,餐饮,1,"2018-06-12 23:37:56",餐饮,6460,"2018-06-13 08:42:54",佳麦烘焙,佳麦烘焙有限责任公司,"1-5 万",餐饮,115家,餐饮烘焙店,"佳麦烘焙加盟南通市佳麦食品有限公司，成立于2007年4月12日，公司以先进的工艺技术为依托，始终坚持不断推陈出新，造就口感与质感的完美结合。经过全体员工十多年的不懈的努力，取得了迅速的发展，现已成为龙湾区食品烘焙行业的龙头企业之一。公司拥有一所现代化的生产工厂，至2010年，有优秀员工150多人和二几家直营专卖连锁店。 公司秉持“发扬优良的团队精神，倡导美味的健康食品”为宗旨，集专业烘焙之精华，演绎自然美味之真醇。传播“时尚、健康、美味”的新饮食概念，以其独特的产品、优异的品质、周到的服务、便捷的配送渠道，深受广大消费者的青睐和赞誉。佳麦烘焙加盟优势佳麦烘焙坊产品口味优秀，广受消费者欢迎，顾客依赖性强，重复购买率高。总部派专人调研，结合市场需求与变化，了解大众的消费口味。专业团队负责产品研发、生产，不断推出新品，让消费者永远保持新鲜感。佳麦烘焙坊物料支持：公司提供店长、服务员、烘焙师的全套服装，并提供VIP光盘、贵宾卡、优惠券、开业宣传单、宣传海报、宣传展架等物品。佳麦烘焙坊带店支持：开店期间派专业人员上门带店指导。佳麦烘焙坊选址支持：专业人员帮助选址，并进行商圈调查与评估。佳麦烘焙坊装修支持：总部帮助确定装修设计方案，并可承接店面装修业务。佳麦烘焙坊硬件支持：根据不同店型所需配送模具等专业烘焙器械、模具等辅助用品。佳麦烘焙加盟流程1、首先在前景加盟网品牌主页下方留言板留言获取加盟资料；2、双向考察，加盟商与品牌商互相了解考察是否合适成为加盟合作伙伴；3、签订加盟合同；4、开业筹备，包括店面设计装修、员工招聘、人员培训、产品物流配送等等；5、开业支持；6、后续运营服务。注：本项目投资金额、加盟店数量、招商加盟地区和经营模式，请以最新咨询为准！我们建议您在下方【留言板留言】 或致电咨询 ，您即可与企业免费通话并及时获得加盟项目最新动态（企业要求各不一，建议了解多个项目做对比）。，更多加盟项目请登陆加盟网了解。",,,,,"特许,合作",江苏,2年,蛋糕,自由创业者、在岗投资、毕业生创业、其他,https://www.qj.com.cn/brand/jiamai/index/
6461,1,"2018-06-13 02:20:33",烘焙店,餐饮,1,"2018-06-12 23:37:56",餐饮,6461,"2018-06-13 08:42:55",美晨烘焙,美晨烘焙有限责任公司,"5-10 万",餐饮,89家,餐饮烘焙店,"美晨烘焙加盟西方的蛋糕甜品是很有特色的，它的口味独特，配方多多，可以给大家带来不同的美食体验。美晨烘焙蛋糕店引进西方甜品的制作方法，工艺，在市场上备受关注，是大家都很喜欢的蛋糕品牌。美晨烘焙蛋糕店打造优雅的环境，为大家提供精致的场所，让大家品尝美食，体验精彩！实力的品牌，会继续发展，会成为专业的品牌，为大家提供更多的服务。美晨经过多年力量的积蓄，厚积薄发，以连锁店面的形式，10家直营店，200多家加盟店，以直营带动加盟，生产各类生日蛋糕、面包、中式糕点、西式糕点、传统节日产品月饼、粽子等食品，成为老少皆知、口碑优良的甜品品牌，立志打造国内霸主级甜品品牌！品牌要有自己的经营方式，多样化的经营方式，为品牌带来更大的发展空间！美晨除传统烘焙甜品店型外，又增加以下午茶为主打的时尚休闲吧；和以鲜牛奶、手工酸奶供应的营养时光吧；以及以DIY手工制作为主题的亲子、情侣、家庭、团体美食party教室。甜品蛋糕市场未来的发展是很良好的，选择好的品牌，它给你带来更多的扶持，让你经营稳定，前景更好。美晨烘焙蛋糕店加盟有优势，品牌隶属公司实力雄厚，为大家创造好服务，让你盈利更全面！美晨烘焙加盟优势款式新颖：蛋糕甜品之所以受到大家的喜欢，是因为它们有多种类型的款式可以供大家选择！美晨烘焙蛋糕店在市场上备受关注，它的产品在外形上，像孩子非常喜欢的卡通人物海绵宝宝，芭比娃娃，以及年轻人喜欢的罗马假日，草莓庄园等应有尽有。色泽亮丽，绝对吸引客户眼球。食材优质：选择什么样的食材，它就会给你带来什么样的口感。好的食材，产品品质好，味道更好！美晨烘焙蛋糕店选用优质原料，与法国或英国天然稀奶油、澳大利亚或新西兰干酪、美国蔓越莓、美国扁桃仁粉、菲律宾椰蓉、南非黄桃、加拿大枫树糖浆等众多全球优质原料供应商签订了战略合作伙伴协议，建立了原料全球采购系统。制作简单：简单的工艺，会提高你的生产效率，也会让你的服务更有品质，更受欢迎！美晨烘焙直链可快速处理的原材料、半成品或成品，不但色香味俱佳，而且易于储存，方便食用。在高峰期也能够轻松应对批量食客需求，同时还可增加DIY项目，让消费者享受自制乐趣。设备专业：制作蛋糕甜品，大家是要使用设备的，简单有效的设备，让你制作更有品质！美晨烘焙蛋糕店采用恒温加热设备，保证仅高于巧克力熔点温度，更大限度保证食材本真风味，极冷速冻技术，使慕斯制作过程中不产生冰晶颗粒，获得信你顺滑口感。好品牌，好工艺，好产品，美晨烘焙蛋糕店是一个专业的蛋糕品牌，它的产品多种多样，口感正宗，为你带来更多的好享受。加盟美晨烘焙蛋糕店，诸多的品牌优势带你进入市场，让你快速赢得商机，获得更多财富。美晨烘焙加盟流程1、加盟商初步了解,并阅读相关资料，确定加盟意向；2、填写加盟申请表,将个要相关信息递交公司总部；3、公司对加盟商进行初步审核,预约面谈时间；4、双方进行初次面谈；公司将加盟相关信息告知；5、递交申请店面的相关资料,公司进行二次审核；6、二次审核通过,对加盟商及申请地区进行确认；7、双方签订正式的加盟代理合同；8、提供装修方案及图纸,指导装修；9、运营机制完善后，进行新店开业。注：本项目投资金额、加盟店数量、招商加盟地区和经营模式，请以最新咨询为准！我们建议您在下方【留言板留言】 或致电咨询 ，您即可与企业免费通话并及时获得加盟项目最新动态（企业要求各不一，建议了解多个项目做对比）。招商加盟网，更多加盟项目请登陆加盟网了解。",,,,,"特许,合作",上海,1年,蛋糕,自由创业者、在岗投资、毕业生创业、其他,https://www.qj.com.cn/brand/meichen/index/
6462,1,"2018-06-13 02:20:33",烘焙店,餐饮,1,"2018-06-12 23:37:56",餐饮,6462,"2018-06-13 08:42:57",品华居法式烘焙,广州食笑园餐饮管理有限公司,"10-20 万",餐饮,124家,餐饮烘焙店,"华林品华居，是广州食笑园餐饮管理有限公司旗下主打品牌，是致力于高端烘焙餐饮品牌管理运营的专业公司，是一家以""传承幸福、分享快乐""为企业核心价值的烘焙企业。历经30年的稳健发展，广州食笑园餐饮管理有限公司不断抢占烘焙行业制高点，建设了与世界同步先进水平的硬件基础，并拥有国际一流的技术团队，实现多元化店面销售整合，超越单店盈利模式，建立了微商,团购等战略联盟的合作模式，销售网络已经覆盖中国31个省市、十几个国家。广州食笑园餐饮管理有限公司自创建以来，始终坚持传承幸福、分享快乐、顾客至上的经营理念。下设产品研发部、营销事业部、运营培训部、网络技术部、人力资源部、行政事务部、品牌策划部、物流配送部、仓储管理部以及财务部等多个职务部门，以多元化的发展为方向，不断扩大品牌影响力，以优雅的环境、超五星的服务、低价位的消费标准满足全面广泛的市场需求。一股风靡亚洲的法式浪漫自由主义裹挟而来，公司聘请国际顶级法国蓝带厨艺学院绶带的西点烘焙大师作为技术主厨，打造“型材艺韵俱全，高贵奢华兼备”的烘焙精品，致力于将经典法式烘焙原汁原味地完美呈现到每一位消费者口中！华林品华居所倾力打造的美食文化，不仅在于产品上的精益求精、环境上的恢宏雅致以及服务上的至臻完善，更在于将三者结合而成的美食精髓，包罗无限的自由气度，传递给每一位美食爱好者无可替代的浪漫神奇味蕾体验！今天的华林品华居，积蓄着更大的能量，向更广阔的空间、更广泛的领域拓展。华林品华居不仅仅是烘焙，它还是一种具备现代化艺术气质的平台，散发着浓郁人文气息的同时，让爱好美食的人生更加愉快惬意！","品华居法式烘焙加盟优势 1. 经营优势：华林品华居源于法国古典工艺，以精湛的设备，专业的烘焙技术独树一帜。推行一站式整合合服务，采用多元化发展战略，给客户至尊的享受和雄厚的财富。2. 服务优势：华林品华居开发出独特成熟的“整店输出”运作模式，从前期商圈评估、店面选址到中期店面开业、人才招聘，再到后期的店面督导、促销、优惠活动，全程为你贴心服务，为加盟商奠定了低风险，高回报的先天优势。3. 特色优势：行业首推DIY自主烘焙服务，运用先进的烘焙设备制作烘焙食品，做中国最专业的烘焙品牌，采用集团化、企业化运作，打造区域品牌店。4. 人才优势：华林品华居汇聚行业顶尖烘焙人才，产品推陈出新，为加盟商提供专业的技术培训教学。开业期间安排资深烘焙师傅下店协助开业，让店面生意快速进入良性发展轨道。5. 模式优势：华林品华居先有直营，再有连锁，以成功的管理模式、产品项目及经营方式完美复制到市场，让加盟店能够简单顺利经营。6. 售后优势：华林品华居先打造分区域针对性市场服务，强大的市场团队分片区因地制宜，给到加盟商最好最专业的服务。7. 广告优势：华林品华居每年都花巨资投入网络、杂志等媒体的宣传上，利用网络等新兴媒体渠道，使华林品华居迅速走进消费者心中。",,品华居法式烘焙加盟支持,"品华居法式烘焙加盟流程 1、投资咨询：投资者以电话、网上留言等方式向总部专业的创业顾问， 咨询相关合作事项，索取相关资料；2、填写申请：提交意向咨询申请合作，总部收到申请后，进行合作资质评估；3、考察签约：总部出具可行性实施方案，签订特许合同，授予特许经营证书、授权牌照；4、开业统筹：开业经理制定开业计划，全程指导开业工作，并确保开业物料的筹备发送；5、开业运营：运营人员指导进行设备安装及调试，确保无误，盛大开业。正式营业后总部全程跟进指导经营运作，提供产品升级、技术培训等长期经营支持。",合作,广东,2年,法式烘焙,自由创业者、在岗投资、毕业生创业、其他,https://www.qj.com.cn/brand/hualinpinhuaju/index/
6463,1,"2018-06-13 02:20:33",烘焙店,餐饮,1,"2018-06-12 23:37:56",餐饮,6463,"2018-06-13 08:43:00",莉蒂婭城堡烘焙店,上海味馨餐饮管理有限公司,"10-20 万",餐饮,55家,餐饮烘焙店,这是一个美食的集合体，无论是特色小吃，还是特色饮品，都能够满足人们的需求，而对于整个投资市场而言，这同样也是一个让投资者可以有着诸多选择的好项目，加盟莉蒂婭城堡烘焙店，四大金牌项目任您选择，让您轻松成就自己最喜爱的好事业!莉蒂婭城堡烘焙店之一：芝心排。台湾爆浆鸡排!有内陷的超大鸡排!芝心排独特的台式风格，成就了小吃经典美食，不管流传到哪里，定能席卷整个小吃业!莉蒂婭城堡烘焙店之二：嘟嘟烧美味小丸子。爆香松脆，味道鲜美!极品嘟嘟烧，引爆味蕾!主打花枝牛肉烧、脆皮芝果烧、虾兵虾将烧、大版章鱼丸等。不同系列，同样美味，冲击食客味蕾，引爆多种盈利!莉蒂婭城堡烘焙店之三：鲜纤果。新鲜果饮，引爆全年沸点!四季热销，独享果饮冠军!鲜纤果饮，一个源自台湾的新鲜茶饮品牌，登陆之后火速走红，所到之处万人空巷;席卷了整个餐饮王朝!莉蒂婭城堡烘焙店之四：拼百味。披萨也能“DIY”!四合一项目中的“拼百味”披萨打破了消费者对西餐的刻板印象，让西餐不再昂贵，7寸的披萨只卖9元钱，这才是真正的亲民，绝无仅有，绝对火爆。人人买得起，处处卖的欢。这四个特色美食的种类，哪一个是您最看好的?同时也是您最愿意进军的呢?纵观中国的餐饮市场，只要真正美味，必定会迅速火卖，因此选择莉蒂婭城堡烘焙店这个品牌，任选一个金牌项目，都能够帮您成就出一份财富好未来!,"莉蒂婭城堡烘焙店加盟优势 通过全面内容的介绍，我们知道莉蒂婭城堡烘焙店这是一个优秀的好项目，能够让投资者自由选择，而且也有着自己的特色优势，但对于一个毫无经验的人来说，这些并不足以让他们放心来投资，毕竟他们是根本就不知道事业应该如何来开展，而支持则让他们更为放心的来投资!","莉蒂婭城堡烘焙店加盟条件 1、强烈的事业心，对发展有更高和更严格要求，热衷于该行业;2、能够百分百认同莉蒂婭城堡烘焙店的经营模式及经营思路;3、能够百分百执行加盟莉蒂婭城堡烘焙店的各项规范及标准;4、莉蒂婭城堡烘焙店已经在当地的市场中有了一定的市场份额，而更想全面提升企业的市场竞争力，占领更大的市场;5、莉蒂婭城堡烘焙店经营地市级的区域市场;6、加盟商必须在区域市场内拥有独立店面或经营场所;7、有一定的资金投入能力及一定的风险承载能力;8、独立的投资人、有一定经营经验的人均可以申请加盟。注：本项目投资金额、加盟店数量、招商加盟地区和经营模式，请以最新咨询为准！我们建议您在下方【留言板留言】 或致电咨询 ，您即可与企业免费通话并及时获得加盟项目最新动态（企业要求各不一，建议了解多个项目做对比）。招商加盟网，更多加盟项目请登陆加盟网了解。","莉蒂婭城堡烘焙店加盟支持 1、品牌输出：统一品牌形象、全套设备、广告宣传、物流配送、一站式输出，迅速占领市场!2、选址协助：莉蒂婭城堡烘焙店总部帮助投资者选址，落实装修，导入企业VI，帮您把控开店的关键第一关!3、迅速立店：从选址装修到员工配备，莉蒂婭城堡烘焙店总部支持一应俱全，帮助您迅速打开市场，顺利运营!4、店面装修：资深设计人士根据情况，提供装修设计图，回家直接施工!5、统一培训：专业培训师进行指导，化繁为简，无须经验和大厨，照样轻松开店!6、开业指导：莉蒂婭城堡烘焙店总部专业指导开店事宜，不走弯路，早开店，早赚钱!7、技术支持：免费传授新品操作技巧，超值服务助您生意持续火爆，区域成王!8、售后服务：完善售后，服务全国，莉蒂婭城堡烘焙店总部将不定期电话跟踪服务，确保运营畅通无阻!",,"特许,合作",上海,3年,面包房,自由创业者、在岗投资、毕业生创业、其他,https://www.qj.com.cn/brand/shwxc/index/
6464,1,"2018-06-13 02:20:33",烘焙店,餐饮,1,"2018-06-12 23:37:56",餐饮,6464,"2018-06-13 08:43:04",欧麦烘焙,欧麦烘培有限责任公司,"1-5 万",餐饮,137家,餐饮烘焙店,"欧麦烘培加盟欧麦食品有限公司是一家生产各种鲜奶油生日蛋糕、喜庆蛋糕、冰淇淋蛋糕、幕司蛋糕、新鲜面包、精品西点、汉饼、 端午节粽子、团圆中秋月饼，专代职工福利享用，最新推出披萨、牛扒、意大利面、中西式套餐休闲茶座。每一道工序，每一个细节，我们都力求尽善尽美，以专业的精神和态度提供专业的服务。为新老朋友推出各种新鲜、天然、精致、营养、美味的食品，力争成为温州食品行业中的姣姣者，把国际大都市的精华及世界饮食文化引入温州千家万户。欧麦烘培加盟优势欧麦烘培采用加盟店和品牌连锁店两种经营模式，都是适合中小投资者合作连锁的欧式烘焙项目，专业化的管理体系和全方位的售后支持系统将使每个合作者都能够实现轻松创业。 以“打造中国第一烘焙品牌”为宗旨，公司将不断推动""欧麦品牌在中国的发展，大力推行连锁经营模式，并为直营或加盟门店提供关于运营、培训、开发、企划、财务、人事、法律及公共事务等多方面的细致周到服务。 相比其他烘焙品牌，欧麦将以多维的文化空间、新颖独特的运营模式，并结合中国本土烘焙文化特色，打造出健康、时尚、经典、简约、新颖、独特的产品，突破传统烘焙固有概念，全新打造出一种独有的温馨、愉悦、幸福的复合型烘焙文化空间。欧麦烘培加盟流程1、首先在前景加盟网品牌主页下方留言板留言获取加盟资料；2、双向考察，加盟商与品牌商互相了解考察是否合适成为加盟合作伙伴；3、签订加盟合同；4、开业筹备，包括店面设计装修、员工招聘、人员培训、产品物流配送等等；5、开业支持；6、后续运营服务。注：本项目投资金额、加盟店数量、招商加盟地区和经营模式，请以最新咨询为准！我们建议您在下方【留言板留言】 或致电咨询 ，您即可与企业免费通话并及时获得加盟项目最新动态（企业要求各不一，建议了解多个项目做对比）。，更多加盟项目请登陆加盟网了解。",,,,,"特许,合作",浙江,2年,蛋糕,自由创业者、在岗投资、毕业生创业、其他,https://www.qj.com.cn/brand/oumai/index/
6465,1,"2018-06-13 02:20:33",烘焙店,餐饮,1,"2018-06-12 23:37:56",餐饮,6465,"2018-06-13 08:43:06",枫焙烘焙,广州万旭餐饮管理有限公司,"5-10 万",餐饮,89家,餐饮烘焙店,"枫焙烘焙加盟枫焙烘焙凭着独到的品牌特色，获得中国消费者的追捧。枫焙烘焙自从挺近中国的烘焙业市场以来，都有着非常不错的发展。枫焙便是欧洲烘焙和咖啡的使者，携带者中世纪的传统手工艺，将原本只属于欧洲皇室贵族的风情美味带到全世界，让更多热爱美食的人们享受到专属的味觉饕餮。枫焙烘焙采用良好的制作技术，打造出了特色产品，得到大家的好评。在选料精细讲究，制作出精良美味的产品，产品定位于中高端，价格实惠。枫焙烘焙更有专业团队不断的研发新品，满足顾客口腹之欲，紧跟市场潮流，多方位的品牌宣传，打响知名度，走在市场前端，加盟有保障!枫焙烘焙总部具备专业化的制作流程，在行业标准基础上制定了更严格的原料、加工、生产等一系列标准，才能保使产品的高品质得以保证。枫焙烘焙在新产品研发时，尤为注重工艺技术的运用，希望能在产品的创新、产品质量产量的提高、工艺改良等方面提供有力的支持，使得烘焙加盟行业的生产逐渐走上专业化、标准化道路，让面包连锁店的经营能够更加一体化，规模化。枫焙烘焙为了能使广大消费者不出国门就能够品尝到高品质的、真正的欧式西点而不断努力。枫焙烘焙让广大消费者能接触到一种新的饮食文化，对食品的享受有更多一种选择。故枫焙需要有志于食品烘焙业的人才加入，共着企业文化，扩大公司规模。枫焙烘焙加盟支持 1、选址支持：前期枫焙烘焙总部有专业市场部人员根据您所在的商圈划分及店面周边环境上门评估考察，选择可靠的开店位置； 2、店面支持：由枫焙烘焙总部提供的设计方案，资深专业设计师全力打造店面装修风格，总部提供店面形象物品，例如灯箱，形象画册； 3、技术支持：总部采用独家研发秘制配方，专业导师一对一指导制作工序； 4、市场支持：枫焙烘焙总部根据客户当地市场环境及时进行有效分析，为客户提供多方面扶持； 5、广告支持：提供枫焙烘焙总部统一品牌形象，配送整套设备及上门扩大广告及开业宣传； 6、物流支持：总部确定地址及时准确进行生产设备和原材料配送，确保店面顺利开业； 7、策划支持：从开业到后期经营期间节假日促销，会员促销到产品的宣传活动，枫焙烘焙总部全程提供全套支持； 8、营销支持：保证客户开业前达到最高的知名度； 9、运营支持：枫焙烘焙总部提供专业人员上门指导带店及培训优秀人员经营技巧。枫焙烘焙加盟条件 1、枫焙烘焙代理商具备一定资金投入实力。 2、具有丰富的经营管理经验和协调能力及区域拓展思路。 3、服从总部统一管理，具有较强的品牌意识，能全面维护枫焙烘焙招商品牌形象。 4、具备较强的执行力，独家区域拓展，维护区域枫焙烘焙加盟店的合法权益。 注：本项目投资金额、加盟店数量、招商加盟地区和经营模式，请以最新咨询为准！我们建议您在下方【留言板留言】 或致电咨询 ，您即可与企业免费通话并及时获得加盟项目最新动态（企业要求各不一，建议了解多个项目做对比）。招商加盟网，更多加盟项目请登陆加盟网了解。",,,,,"特许,合作",广东,2年,面包房,自由创业者、在岗投资、毕业生创业、其他,https://www.qj.com.cn/brand/fengpei/index/
6466,1,"2018-06-13 02:20:33",烘焙店,餐饮,1,"2018-06-12 23:37:56",餐饮,6466,"2018-06-13 08:43:10",香榭丽舍烘焙,香榭丽舍有限责任公司,"5-10 万",餐饮,79家,餐饮烘焙店,"香榭丽舍烘焙加盟无锡香榭食品始创于2006年，是一家专业生产烘焙类产品的现代化大型食品企业。公司地处历史悠久的文化名城无锡，城市基础设施完善，水陆空交通都极为便利。现中心工厂占地面积达六千平方米，建筑面积三千多平米，员工四百多人，订单日产量高达五万份。公司拥有完善的现代化厂房和先进的生产设备，月饼生产车间严格按照GMP设计建造，空气净化值达到十万级标准，生产过程实现自动化流水线操作。公司现下设分店五十二家，秉承着“给你一个快乐的理由！”希望顾客能够以实惠的价格享受高品质的烘焙产品而感到快乐！香榭丽舍烘焙加盟优势1、省内品牌知名度高，2001年进入江苏市场，取得了多想荣誉。60余家门店分布在江苏省各大城市，可以提供加盟者强有力的销售支持。2、市场定位精准，以社区型商业为主，高品质的产品，亲民的价格来满足大众的消费需求。3、品项丰富，有100多种日常产品及节令产品，包含西点、糕点、面包、饮料、生日蛋糕、各式礼盒等，自用送礼两相宜。4、产品的研发及生产能力，由台湾知名烘焙师长期担任开发顾问，中央工厂占地面积达六签每平方米，建筑面积三千多平米，员工五百多人，订单日产量高达十万份。香榭丽舍烘焙加盟条件自愿加盟香榭丽舍品牌，认同香榭丽舍公司的企业文化和经营理念独立的法人资格，有良好的信誉，充足的资金，承担市场风险的能力具有一定的经济实力，前期投资依加盟区域不同，单店需要30-50万元（含加盟费、保证金、设备费、装修费、门店租金、工器具、员工薪资等）香榭丽舍烘焙加盟流程(1)一般的面包店都会雇一个师傅专门做面包，而且一般面包店不知买面包一种食品，而香榭丽舍面包由厂家统一生产面团，统一配送，有固定的面包种类，有专业的烘焙师教您如何烘焙面包。(2)在开业前应该准备办理一些证件：营业执照(工商管理局)、税务登记证(当地税务局)、卫生许可证(当地卫生局)(3)设备准备：一般新开张的面包店，用一些最基本的设备就可以了，随着发展再更新设备。比如，和面机(搅拌机)，打蛋机，分层烤箱(配齐烤箱托盘)等。香榭丽舍面包店会向您提供产品的型号、规格、品牌，以供您挑选。(4)招几个营业员，做好开业前的准备，您就可以开张了。注：本项目投资金额、加盟店数量、招商加盟地区和经营模式，请以最新咨询为准！我们建议您在下方【留言板留言】 或致电咨询 ，您即可与企业免费通话并及时获得加盟项目最新动态（企业要求各不一，建议了解多个项目做对比）。招商加盟网，更多加盟项目请登陆加盟网了解。",,,,,"特许,合作",江苏,2年,蛋糕,自由创业者、在岗投资、毕业生创业、其他,https://www.qj.com.cn/brand/xxlshp/index/
6467,1,"2018-06-13 02:20:33",烘焙店,餐饮,1,"2018-06-12 23:37:56",餐饮,6467,"2018-06-13 08:43:13",森普瑞斯,广州森普瑞斯食品有限公司,"5-10 万",餐饮,220家,餐饮烘焙店,"森普瑞斯有优良的品质、精美的包装 ,深受广大消费者的喜爱。 经过多位大师的精心研究 , 创出了风味独特、誉满全城的鸡仔饼 ,又引进台湾风味的各类麻薯和各种日式点心。拥有数十位资深裱花师，为顾客设计造型新颖独特的各式蛋糕及小蛋糕。有老人祝寿的立体寿桃蛋糕；儿童的卡通动物蛋糕；甜蜜的情侣心形蛋糕；公司开盘、周年誌庆及新婚贺喜的庆典蛋糕；不同口味的欧式蛋糕、水果蛋糕、慕斯蛋糕等。特别是森普瑞斯的三明治，它健康、营养、方便，是南宁人早餐最好选择。这些让消费者在品尝美食同时，也在享受美食文化，是一家以生产生日蛋糕、现烤面包、冷柜切块、中西点、饮品等西式糕点以及月饼等季节性产品为主的知名美食企业。公司始终坚持不渝地以“五星级品质、平价化消费”为宗旨，打造消费者满意品牌，凭借着绝对的品质、称心的服务，以及不断扩大的规模、追求完美的经营管理模式，在绍兴地区已收获较好的口碑。森普瑞斯在全国等地设有几十家连锁店，在未来的发展道路上，公司将以店铺设点为首要任务，并立志走在烘焙行业的最前端。","森普瑞斯加盟优势 实时高效的数据传输，前台每完成一笔业务交易，便可实时扣减库存、即时统计销售数量和毛利。因能及时上传销售，采购等信息，管理层便能随时了解各门店采购、销售等重要信息，可自动接收总部价格、促销策略，并向总公司发送要货信息完成补货，极大的提高了工作效率与工作质量。系统提供直观的触摸界面和双屏显示，易学易用易操作，降低了新语烘焙员工门槛，提高了其积极性。采用前店后厂的模式，支持门店现烤裱花，系统跟据BOM配方自动核减原料库存。每个流程都得到有效监控，原料成本得到很好的控制。支持生日蛋糕预订和会员生日自动提醒功能，结合短信营销，既能提前做好门店原料计划，也能提高会员好感度、忠诚度。系统为会员提供完善的卡券管理。积分、折扣、储值三卡合一，一卡在手，全部连锁门店通用。各种月饼券、现金券、优惠券的管理，系统都会提供严格的券号管理，从“制作－入库－销售－消费－注销”全程跟踪管理，严谨有序。",,"森普瑞斯加盟支持 1.区域保护：加盟代理严格受区域保护限制，同一个区域决不发展第二家。2.运营支持：公司高度重视品牌建设，品牌推广以及品牌保护，各环节层层把关，步步跟进。3.售后支持：以优质的产品，优惠的价格.一流的服务，为各代理商提供长期持续的优质服务。4.推广支持：总部全国网络推广品牌，在打造树立品牌形象的同时，节省加盟商本地的推广费用。5.培训支持：总部提供免费的理论培训加实操培训。","森普瑞斯加盟流程 1、投资咨询投资者以电话、传真、网上留言等方式向总部专业的投资顾问咨询相关合作事项，索取有关资料。2、实地考察投资者到公司所在地进行实地项目考察，并与公司工作人员进行业务交流。3、资格审核总部对投资者资料审核，确认投资者的合作资格。4、签订合同双方确认考察结果无争议，正式签订合同。5、缴纳费用投资者按所选择的投资类型向总部缴纳相应的费用。6、总部培训总部安排投资者进行技术培训，培训合格后颁发授权铜牌。7、选址装修、装修设计方案。8、开业准备总部配送开业赠品及制作设备，所有产品、人员到位，准备开业促销方案。9、进店指导公司督导人员进店指导。10、新店试业。11、后续管理后续经营管理指导和新产品研发支持。注：本项目投资金额、加盟店数量、招商加盟地区和经营模式，请以最新咨询为准！我们建议您在下方【留言板留言】 或致电咨询 ，您即可与企业免费通话并及时获得加盟项目最新动态（企业要求各不一，建议了解多个项目做对比）。更多加盟项目请登陆前景加盟网了解。",特许,广州,0年,烘焙,自由创业者、在岗投资、毕业生创业、其他,https://www.qj.com.cn/brand/sprs/index/
6468,1,"2018-06-13 02:20:33",烘焙店,餐饮,1,"2018-06-12 23:37:56",餐饮,6468,"2018-06-13 08:43:14",贝家烘焙,贝家烘焙有限责任公司,"1-5 万",餐饮,137家,餐饮烘焙店,"贝家烘焙加盟贝家烘焙这里集聚集了经验丰富的烘焙师，用料纯正健康，蛋糕设计上花样百变，不怕做不到，就怕客户想不到。调皮的名字配上了甜蜜的蛋糕，心情沮丧，一口蛋糕就能让你觉得畅快。贝家烘焙提供了温馨的坏境，是聚会交友的好去处。贝家烘焙在外形上，像孩子非常喜欢的卡通人物海绵宝宝，芭比娃娃，以及年轻人喜欢的罗马假日，草莓庄园等应有尽有。色泽亮丽，很吸引客户眼球。贝家烘焙项目创业具有低门槛，好操作，易管理的特点，多种店型和经营模式供您选择，只要万元就可以轻松当老板。相信“贝家烘焙”的品牌效应和时尚清新的产品品类定能牢牢地抓住顾客的胃口，实现短时间内的口碑传递，创业并不是难事。贝家烘焙加盟优势贝家烘焙在招商加盟过程中从前期的店铺选址到后期的产品更新，全程为加盟商提供服务和指总部全程提供技术和运营支持，为您解决后顾之忧，要选择了“贝家烘焙”，接下来的事我们帮您做，您就放心做个甩手老板。1、市场调研支持：公司人员对商业环境、人流动线、人口密度、消费指数等市场层面的专业研究，为长远发展提供科学依据。2、视觉形象设计支持：由设计公司规划VI品牌视觉形象、SI空间视觉形象等，构建极具时尚感的视觉形象系统。3、教育训练支持：由培训师对事业伙伴从营养学、心理学、健康美学等方面进行训练指导，全面提高员工的知识和综合能力。4、店铺选址支持：对店铺选址、租金评估、风险控制等相关因素进行科学分析，并与相关商业运营商进行战略合作。5、运营管理支持：公司从服务、质量、品牌、市场、财务、培训等方面，组织高效的管理团队，增强公司核心竞争能力。6、营销推广优势：涵盖广告宣传、渠道建设、活动执行、企业策划、新媒体营销、促销策略等方面，全方位提升公司品牌影响力。贝家烘焙加盟流程1、加盟商初步了解,并阅读相关资料，确定加盟意向；2、填写加盟申请表,将个要相关信息递交公司总部；3、公司对加盟商进行初步审核,预约面谈时间；4、双方进行初次面谈；公司将加盟相关信息告知；5、递交申请店面的相关资料,公司进行二次审核；6、二次审核通过,对加盟商及申请地区进行确认；7、双方签订正式的加盟代理合同；8、提供装修方案及图纸,指导装修；9、运营机制完善后，进行新店开业。注：本项目投资金额、加盟店数量、招商加盟地区和经营模式，请以最新咨询为准！我们建议您在下方【留言板留言】 或致电咨询 ，您即可与企业免费通话并及时获得加盟项目最新动态（企业要求各不一，建议了解多个项目做对比）。招商加盟网，更多加盟项目请登陆加盟网了解。",,,,,"特许,合作",上海,2年,蛋糕,自由创业者、在岗投资、毕业生创业、其他,https://www.qj.com.cn/brand/baijia/index/
6469,1,"2018-06-13 02:20:33",烘焙店,餐饮,1,"2018-06-12 23:37:56",餐饮,6469,"2018-06-13 08:43:18",麦喀隆私家烘焙,济宁麦喀隆食品技术推广有限公司,"1-5 万",餐饮,125家,餐饮烘焙店,"麦喀隆私家烘焙加盟中国著名品牌---麦喀隆（中国），所属公司麦喀隆食品技术推广有限公司是一家以食品技术研发、技术推广为主打的特许经营连锁机构，一直秉承“诚信、务实、创新、服务”的经营理念，公司至力于打造全新的形态，将传统炸鸡汉堡奶茶糕点蛋糕面包等技术与健康饮食文化溶合一体，为客户提供更健康、更具活力的特色餐饮及小吃技术推广培训！公司坚持把“以客为尊、认同鼓励、追求卓越、有责任心”的服务理念传达给每一个加盟商，正如所承诺的：客户才是我们的老板，细心周到的维护客户的利益，才能促成品牌在市场上不断强大的地位！公司主要开设:糕点烘焙培训班、韩式裱花培训班、翻糖蛋糕培训班、汉堡炸鸡西餐培训班等特殊教学项目。并推出公司旗下特色加盟项目；麦喀隆汉堡奶茶店、麦喀隆私家烘焙。均由国内知名艺术烘焙大师袁涛老师亲自授教。麦喀隆私家烘焙加盟优势1、全套烘焙技术培训2、私家烘焙装修布置3、私家蛋糕原料采购4、专业营销宣传策划5、微信网络营销培训麦喀隆私家烘焙加盟流程1、首先在前景加盟网品牌主页下方留言板留言获取加盟资料；2、双向考察，加盟商与品牌商互相了解考察是否合适成为加盟合作伙伴；3、签订加盟合同；4、开业筹备，包括店面设计装修、员工招聘、人员培训、产品物流配送等等；5、开业支持；6、后续运营服务。注：本项目投资金额、加盟店数量、招商加盟地区和经营模式，请以最新咨询为准！我们建议您在下方【留言板留言】 或致电咨询 ，您即可与企业免费通话并及时获得加盟项目最新动态（企业要求各不一，建议了解多个项目做对比）。，更多加盟项目请登陆加盟网了解。",,,,,"特许,合作",山东,2年,蛋糕,自由创业者、在岗投资、毕业生创业、其他,https://www.qj.com.cn/brand/mklsj/index/
6470,1,"2018-06-13 02:20:33",烘焙店,餐饮,1,"2018-06-12 23:37:56",餐饮,6470,"2018-06-13 08:43:23",吉味雅法式烘焙,广州鑫谷维餐饮咨询管理有限公司,"5-10 万",餐饮,124家,餐饮烘焙店,广州鑫谷维餐饮咨询管理有限公司成立于2013年，是全国最具知名度的广东驰名商标，有园林式的大型中央工厂以及多个大型培训基地，是行业中首批获得QS质量安全认证（全国工业产品生产许可证）的企业，专业致力于中西法式饮食文化研究、推广及产品开发、生产、培训、营销、加盟、传播于一体的多元化现代企业。公司旗下现有“吉味雅”烘焙品牌、“九加一”鸡排品牌、“维Q果密码”果饮品牌。,"吉味雅法式烘焙加盟优势 1、品牌优势全国烘焙业十佳连锁品牌全国600多家连锁专营店门店营业销量全国领先全国“质量、诚信、服务AAA企业”行业中首批获得QS质量安全认证企业烘焙加盟行业唯一具备独立陪训基地的品牌“吉味雅”商标被评定为全国消费者满意品牌2、资源优势十余年直营老牌经久不衰的经营法则用心做和不用心做，制作出来的吉味雅蛋糕造型、感官、口感都是不一样的，请在什么时候都不要把消费者当傻子，“用心做”和“不用心”。只有用良心选好料再加上用心加工制作，再做好宣传，健康的理念，自然而然就等到认可深入人心被消费者所接受。3、培训优势独立产研培训基地免费提供专业技术培训与经营管理培训，多对一培训，易学上手快，加盟者将享受品牌的技术升级，确保加盟店经营成功，开业期间上门带店经营、指导。",,吉味雅法式烘焙加盟支持,吉味雅法式烘焙加盟流程,合作,广东,2年,法式烘焙,自由创业者、在岗投资、毕业生创业、其他,https://www.qj.com.cn/brand/jeyfshb/index/
6471,1,"2018-06-13 02:20:33",烘焙店,餐饮,1,"2018-06-12 23:37:56",餐饮,6471,"2018-06-13 08:43:27",美滋每客烘焙,美滋每客有限责任公司,"10-20 万",餐饮,106家,餐饮烘焙店,美滋每客成立于2009年3月18日，是一批80后烘焙专业青年怀着对时尚烘焙的憧憬与美食无国界的先进理念集研制，生产，销售为一体的专业食品连锁机构。美滋每客的精致出品一直以“来自欧洲的味道”为产品导引，引进国外先进的产品设计理念和制作技术。荣誉出品了超过十个国家的经典甜品。产品覆盖“生日蛋糕”法式月饼，咖啡，手工巧克力，法式马卡龙，欧式面包，法式甜品，三明治，进口冰激凌，手工酸奶，野生蓝莓制品等。“美滋每客”(meizimeiker)[把美妙的滋味分享给每一位客人]，我们极尽挑剔选择全球各地原料，运用各个国家最地道工艺，悉心，用心，制做每一款最适合您品味与个性的甜品。从新西兰乳酪到澳洲淡奶油，从委内瑞拉巧克力到伊朗开心果，土耳其榛子仁，不一甚表，只是为了更好，我将继续努力，我会用我所有的精力制作甜品，奉献精良，也只是为了奉献给极致个性与极致品味的您一道精美的生活享受。,"美滋每客烘焙加盟优势 甜品一一美滋每客人共同追求的甜蜜事业对产品精益求精，创新口感，注重新品研发，满足大众需求全程托管，后续无忧，一对一上门培训持续有力的品牌推广，让加盟商“坐收渔利”前沿营销模式，确保消费空前旺盛，食客如云先进的设备，独特的制作工艺，保证效益优秀的专业团队，全心全意为加盟商服务","美滋每客烘焙加盟条件 有经商经验有品牌经营意识有吃苦耐劳精彩遵守总部的规范化管理，统一使用美滋每客标识 和统一的视觉形象关系开业后向总部提供其经常场所彩照和经营状况","美滋每客烘焙加盟支持 品牌授权享有美滋每客品牌、商标使用、品牌资源共享权，包括品牌形象、经营方案、营销方案、管理方案、装修方案、店面布局方案、设备器具、产品技术等，确保投资者顺利开店运营。店面设计由公司专业的设计师，按“美滋每客店铺”自住风格门店免费设计，并由公司监工指导装修；陈列方面，由公司专业的陈列师到店面亲自指导陈列摆放，并教授相关陈列知识，保证加盟商能够独立完成此后店面陈列。专业培训公司向店面提供全套免费销售培训，定期对店面进行产品知识、销售技巧以及店面维护等专业培训以及提供三级培训（加盟店、店长、导购员）；新店开业时的培训指导；培训资料手册的自学；区域集中营销经验交流等。宣传推广公司将视业务的具体需要，不定期在全国性或者地区性的媒介进行各种宣传活动，塑造“美滋每客”良好的品牌形象；统一制作宣传资料及宣传手册，有针对性的发给目标客户。营销店里天天优惠不断，常年活动不断。针对竞争对手的阻击营销活动，针对西季节令的新品促销活动，使连锁店始终保持竞争活动，成为火爆的商圈明星。","美滋每客烘焙加盟流程 签订加盟合同 总部签订合同开业准备 开业前工作准备正式营业 专人到现场协助开业营运辅导 每天数据反馈及时帮助提高店铺业绩我们真诚希望与您一起走进成功！我们诚挚邀请您的加入","直营,特许",山西,2年,蛋糕,自由创业者、在岗投资、毕业生创业、其他,https://www.qj.com.cn/brand/mzmk/index/
6472,1,"2018-06-13 02:20:33",烘焙店,餐饮,1,"2018-06-12 23:37:56",餐饮,6472,"2018-06-13 08:43:28",汤姆男孩烘焙坊,长沙廷记投资管理有限公司,"10-20 万",餐饮,52家,餐饮烘焙店,汤姆男孩烘焙坊在制作的配方、成型、制熟恒温等方面皆是十分讲究，汤姆男孩烘焙坊用实际的加工技艺，来获得消费者口味的认同，成功的汤姆男孩储备着一批高级技师团队，有着高级的技艺，力求以时效确保质量新鲜、服务贴心。汤姆男孩烘焙坊，追求高质量的产品，对于全新蛋糕产品的研发，一直都比较注重，一直倡导并致力于低糖、低脂、多纤、新鲜的健康食品路线，汤姆男孩烘焙坊将健康的饮食路线呈现在广大消费者的面前。汤姆男孩烘焙坊最完善的投资，最具有优势的休闲食品品牌，汤姆男孩烘焙坊加盟，只要你有经营休闲食品的决心，汤姆男孩烘焙坊就可以为你提供最完善的服务。汤姆男孩烘焙坊加盟，创造新鲜，始终领先，更多的食品，更多的财富选择。目前汤姆男孩烘焙坊在国内休闲食品行业处于优势地位，产品拥有5大类近千个单品。汤姆男孩烘焙坊加盟总部拥有强大的研发团队，具有卓越的产品创新能力，能够快速适应市场变化。,"汤姆男孩烘焙坊加盟优势 汤姆男孩烘焙坊项目独具特色、合作空间大是一方面，很多人选择投资休闲食品项目，还是因为整个市场一片火爆!休闲食品连锁店，遍布全国，服务模式领先的企业，总会迅速抢占市场财富，为投资者带来财富!汤姆男孩烘焙坊，独具特色的大品牌!","汤姆男孩烘焙坊加盟条件 1、申请人通过营销中心咨询加盟程序，了解总公司对加盟商的要求、标准和条件。 2、申请人身份证复印件 申请人提供资金实力证明； 3、营销中心审查并签署意见，同意后按公司统一规定在七个工作日内答复是否同意加盟。 4、公司颁发各种认证执照，委托授权品牌经营。注：本项目投资金额、加盟店数量、招商加盟地区和经营模式，请以最新咨询为准！我们建议您在下方【留言板留言】 或致电咨询 ，您即可与企业免费通话并及时获得加盟项目最新动态（企业要求各不一，建议了解多个项目做对比）。招商加盟网，更多加盟项目请登陆加盟网了解。",,"汤姆男孩烘焙坊加盟流程 1、首先在前景加盟网品牌主页下方留言板留言获取加盟资料；2、双向考察，加盟商与品牌商互相了解考察是否合适成为加盟合作伙伴；3、签订加盟合同；4、开业筹备，包括店面设计装修、员工招聘、人员培训、物料物流配送等等；5、开业支持；6、后续运营服务。","特许,合作",湖南,3年,面包房,自由创业者、在岗投资、毕业生创业、其他,https://www.qj.com.cn/brand/cstj/index/
6473,1,"2018-06-13 02:20:33",烘焙店,餐饮,1,"2018-06-12 23:37:56",餐饮,6473,"2018-06-13 08:43:31",王老太私家烘焙,王老太私家烘焙有限责任公司,"1-5 万",餐饮,129家,餐饮烘焙店,"王老太私家烘焙加盟王老太私家烘焙是一家集食品研发、生产、销售和人员培训为一体的全国连锁餐饮企业。拥有极其丰富的产品线，经营简餐、咖啡、茶饮、比萨、西品、面包、蛋糕等系列产品，一切美味源于好料，健康才是硬道理，采用新鲜水果，进口动物奶油，纯手工制作。王老太私家烘焙加盟优势公司扶持采用整店输出模式，全程协助加盟商事业启动。专业人员提供店铺选 址、首席店面形象设计、金牌师傅驻店、专属VIP团队进驻、专业的人 员培训及督导、一流美食研发团队等扶持政策帮助加盟商轻松开业、 实现简单赢利，持续扩张。店面特色简约时尚的现代风格，多层次的空间设置，优质的视觉效果，精细的 布局勾勒出精美的欧式风范，为加盟商打造集美食、休闲于一体的时 尚店面，营造时尚独特的第三生活空间，编织新鲜、品质、幸福的都 市优质生活。项目设定进行全面的市场调研，针对市场的发展趋势，量身打造新式的烘焙产 品。利用先进的生产设备配置，汇聚专业优质人才，打造极具商业价 值和高回报率的投资项目。后续运营成功的店面运营管理经验，极具操作性的产品配方、新产品培训教学 、店务管理系统、外场营销技巧、门店升级扩张、促销活动策划及推 广等多种专业配套升级，帮助加盟商维护后续稳定运营。顾客定位洞悉市场消费趋势，进行精确的市场定位和顾客设定，3—80岁都是消 费者，能满足不同年龄层次人群的消费需求，更是追求健康美味、热 爱生活的时尚人群的首选。注：本项目投资金额、加盟店数量、招商加盟地区和经营模式，请以最新咨询为准！我们建议您在下方【留言板留言】 或致电咨询 ，您即可与企业免费通话并及时获得加盟项目最新动态（企业要求各不一，建议了解多个项目做对比）。招商加盟网，更多加盟项目请登陆加盟网了解。",,,,,"特许,合作",江苏,2年,蛋糕,自由创业者、在岗投资、毕业生创业、其他,https://www.qj.com.cn/brand/wanglaotai/index/