category_2_x_jiamengdian.id,category_2.id,category_2.ts,category_2.title,category_2.category_1,category_1.id,category_1.ts,category_1.title,jiamengdian.id,jiamengdian.ts,jiamengdian.title,jiamengdian.gongsi,jiamengdian.touzie,jiamengdian.hangye,jiamengdian.mendian,jiamengdian.biaoqian,jiamengdian.gongsi_beijing,jiamengdian.jiameng_youshi,jiamengdian.jiameng_tiaojian,jiamengdian.jiameng_zhichi,jiamengdian.jiameng_liucheng,jiamengdian.jingying_moshi,jiamengdian.pinpai_yuandi,jiamengdian.hetong_qixian,jiamengdian.jingying_chanpin,jiamengdian.shihe_renqun,jiamengdian.zhaoshang_wangzhi
6556,2,"2018-06-13 02:20:47",餐饮培训,餐饮,1,"2018-06-12 23:37:56",餐饮,6556,"2018-06-13 08:46:30",瑞美滋熟食培训,青岛瑞美滋餐饮管理咨询有限公司,"1-5 万",餐饮,54家,餐饮餐饮培训,"瑞美滋熟食培训属于青岛瑞美滋餐饮管理咨询有限公司，公司是国内一流熟食培训企业，专业从事餐饮研发、培训、旗下拥有多个成熟运作的熟食品牌，是正宗的、乡巴佬熟食、骨里香熟食、八珍熟食、瑞美滋熟食培训基地。瑞美滋熟食培训秉承“民以食为天、食以味为鲜”的经营理念和“诚信第一、客户至上、精益求精、协作双赢” 的经营宗旨，一直被模仿，从未被超越，不断探索、不断创新、不断超越 ，辟蹊拓径，以味制胜。瑞美滋熟食培训经过多年的努力和开拓，已为近千家乡巴佬、骨里香、八珍熟食加盟商成功创造了财富。瑞美滋熟食培训是以餐饮技术研发推广、加盟、咨询、教学、招商与一体的熟食企业，是真正为您创造财富的最坚实的基础!我们自2005年创建以来致力于打造餐饮行业技术的知名品牌。本公司为了服务好全国各地的学员及代理商，特邀请数名专业美食技术顾问长期走访全国，考察各地特色名吃和风味，汇集研发了符合全国老百姓喜爱的瑞美滋熟食!瑞美滋熟食培训的制作技术是经过长时间不断反复的尝试和创新，在继承传统特色的基础上，增加了更多特色新品。瑞美滋熟食培训主营技术项目有：正宗温州骨里香、乡巴佬熟食、八珍熟食、排骨米饭、流亭猪蹄、美味鸡汤、五香系列、卤烤系列、麻辣系列、酱香味系列、香酥炸鸡系列、清蒸系列、熏味系列、盐焗系列、大盆卤菜、精美凉菜、北京烤鸭、特色大盘炒鸡、久久鸭脖、烧烤、麻辣烫、火锅等数十种系列几百种产品，深受加盟商和学员的一致好评与厚爱! 公司凭着精湛的制作技术，前卫的经营理念实现了创业致富的理想。瑞美滋熟食培训市场分析60年代，人们提倡“有啥吃啥”，而今时过境迁，今日当不致如斯也。经济的发展让人们对于饮食的要求越来越高，再也不是“有啥吃啥”的年代了。据了解，目前我国经济在长期持续增长、人民收入不断提高的大背景下，全国餐饮市场张迅猛，营业额连续16年保持两位数增长。餐饮业的增幅居社会消费品各行业之首。大有可为的餐饮业，引来了众多人的青睐。人们纷纷投入餐饮行业，《青岛瑞美滋餐饮》掀起了一股餐饮的热潮。瑞美滋熟食培训祖传技术配方.现代化工艺秘制而成，满街飘香、色鲜味美、知名品牌、彰显品位、堪称卤味一绝!流动资金仅需1000-2000元，5-100平方米等规模不同的门店，2人以上即可经营，利润十分可观。最新先进技术，将出品率提高20%以上，意味着比普通熟食的利润提高20%，也就是说我们《青岛瑞美滋》熟食毛利润在65%以上。瑞美滋熟食培训九大优势1.投资小：万元投资，5平米以上即可开店，大、中城市标准店5-8万足够;2.回报快：日营业额1000-10000元不等，60%以上日营业额超过2000元，3-5个月回本;3.用人少：1-2人便可开店，劳累程度小，在人力资源上大大减少工资开销;4.品种多：十七大系列，百余款特色产品，让食客众口不再难调;5.市场大：十三亿人每餐必吃特色卤味，庞大市场，有人的地方就是好市场;6.好选址：5平米以上即可开店，选址标准低，租金低，利润空间大;7.门槛低：无年龄、学历限制，数千元即可学习特色骨里香熟食技术，永久不收加盟费;8.大品牌：正规注册商标，知名品牌，统一店面，标准规范的服务;9.支持大：强大技术研发团队，提供全方位的支持，开店指导，开心赚钱。瑞美滋熟食培训加盟政策1、报销路费：为方便学员学习，凡签约2个大系列或以上者，凭相关有效证件，是直系亲属的可以允许2人一起来学习，并报销来回路费。2、3人学习：凡签约3个大系列或以上者，凭相关有效证件，直系亲属的可以允许3人一起来学习，并且报销往返路费。3、送技术：凡成功加盟学员免费赠送麻辣烫技术，烤羊肉串技术、凉拌菜小吃技术。4、送套装：免费赠送印有总部统一标志的围裙和上衣各两件;5、颁发证书：毕业后总部免费为学员颁发《开店资格证书》、《商标授权证书》、《品牌使用证书》荣誉证书;6、开店指导：免费提供店面设计、开业指导，终身售后服务。特别声明：非直系亲属的，而且2人有亲戚或朋友关系的一起学习，分别给予七折优惠。公司承诺：学不会学不好，五倍退款，与每位学员签订协议，保证配方无保留传授，配方所采用的材料都是天然无害的，保证所需材料后期开店时都是能买到的。都是市面上有的。来公司考察，可现场操作，先尝后决定学不学，从到市场去买材料开始。注：本项目投资金额、加盟店数量、招商加盟地区和经营模式，请以最新咨询为准！我们建议您在下方【留言板留言】 或致电咨询 ，您即可与企业免费通话并及时获得加盟项目最新动态（企业要求各不一，建议了解多个项目做对比）。招商加盟网，更多加盟项目请登陆加盟网了解。",,,,,"特许,合作",山东,3年,熟食,自由创业者、在岗投资、毕业生创业、其他,https://www.qj.com.cn/brand/qdrmz/index/
6557,2,"2018-06-13 02:20:47",餐饮培训,餐饮,1,"2018-06-12 23:37:56",餐饮,6557,"2018-06-13 08:46:33",迷小川,杭州迷小川餐饮管理有限公司,"5-10 万",餐饮,120家,餐饮餐饮培训,迷小川，新派迷你小川菜，专业团队独家打造，引领川菜新风尚，简约，时尚，快捷，集川菜之所长，打造出别具一格的小碗化川菜轻快餐，以鲜辣为特色，保留川菜之精华，改良创新精简化，精准的抓住年轻人的口味和刚性需求，是年度最新锐，最具投资价值的特色速食餐饮。迷小川，一款集广受大众欢迎的川菜和刚性需求的轻快餐组合，以一种横空出世绝非偶然，专业的市场调查，数百次的研究尝，不断的改良创新，以视觉、味觉、嗅觉、听觉多方位，立体式感观冲击主流消费人群对就餐体验，打造出一种全新的迷你川菜，美味川菜+刚性需求的快餐形式，这两者的完美结合，它必将掀起一股新热潮，成为辣味美食界中的后起之秀。主菜以鲜辣为特色，新鲜的食材，配以地道川味“秘制汤料”精心烹饪，使辣椒的“香辣”和麻椒的“鲜麻”达到口感的黄金比例，将年轻人喜欢的“鲜辣”做到极致，再搭配一份香糯可口的米饭，一人也能独享的快餐式川味美食。将川菜的经典代表味型进行标准化改良，实现快速化无差别烹饪，真正实现了无油烟，无厨师操作，更关键的在于任何负责的人都可以做出完全一样的味道，并且只需要1天就可以完全上手，让以后的迷小川的品牌店可以完全不依赖任何师傅。,"迷小川加盟优势 设计策划服务为加盟商度身打造终端、售后服务运作方案，为各地加盟店铺提供选址.装修方案。培训服务统一店员培训，管理培训，让您顺利开业，迅速走向正轨。定期委派专业人员为加盟商店铺服务人员、经营人员、管理人员各层培训。市场宣传，开业促销服务提供整套促销方案，培训师上门指导，开业当天为加盟商现场进行营销和促销指导。企业形象服务统一形象：统一门店，统一服装，统一促销宣传方式，实行连锁管理模式。管理支持服务公司总部人员不定期在各地加盟区域，协助各地投资者进行渠道扩充、店铺管理，提高经营水平，提升营业额。设备支持及技术的后续配送服务为加盟商提供专业机器设备.原材料，新产品更新及时地通知到个加盟商，以及完善的售后服务。开店原材料、配料、餐料、由总部统一配送，均按出厂价提供，无须四处奔波采购。",,"迷小川加盟支持 1.区域保护：加盟代理严格受区域保护限制，同一个区域决不发展第二家。2.运营支持：公司高度重视品牌建设，品牌推广以及品牌保护，各环节层层把关，步步跟进。3.售后支持：以优质的产品，优惠的价格.一流的服务，为各代理商提供长期持续的优质服务。4.推广支持：总部全国网络推广品牌，在打造树立品牌形象的同时，节省加盟商本地的推广费用。5.培训支持：总部提供理论培训加实操培训，学到会再走。","迷小川加盟流程 1.咨询与详情。2.填写加盟考察申请表。3.展厅及公司考察。4.洽谈签约。5.店铺选址。6.展厅设计与展厅装修。7.品牌及产品培训。8.营业开业。注：本项目投资金额、加盟店数量、招商加盟地区和经营模式，请以最新咨询为准！我们建议您在下方【留言板留言】 或致电咨询 ，您即可与企业免费通话并及时获得加盟项目最新动态（企业要求各不一，建议了解多个项目做对比）。更多加盟项目请登陆前景加盟网了解。",直营,杭州,6年,餐饮企业管理，厨房设备,自由创业者、在岗投资、毕业生创业、其他,https://www.qj.com.cn/brand/mixiaochuan/index/
6558,2,"2018-06-13 02:20:47",餐饮培训,餐饮,1,"2018-06-12 23:37:56",餐饮,6558,"2018-06-13 08:46:38",魔范食间,安徽魔范食间餐饮管理有限公司,"5-10 万",餐饮,10家,"餐饮快餐,餐饮培训","魔范食间创立于2015年，以东南亚铁板烧为基础， 融合国人餐饮习惯，提倡“个性化、多元化、营养化”的全新经营概念，以时尚、潮炫风格风靡于年轻消费者群体。悦食于味，味在其方，魔范食间强调菜品特有新鲜色彩，展现出每道食材的色香味形态；所有食材选自天然，不破坏食材营养成分，科学的荤素搭配，精美的制作手法，细致周到的服务，让每位食客吃得放心。作为魔范食间主打系列，魔范铁板饭翩翩起舞于铁板之间，汲取各家铁板烧之长，追求花式随性风格，以精湛的技巧、高品质的要求，彰显品牌的美誉。魔范食间，倡导“营养、健康、时尚”的产品理念，将成为年轻人热捧的焦点新食尚！魔范食间，融合了餐饮界、互联网、运营、金融法务、营销策划等领域精英团队，拥有强大的研发新产品实力，创新思维，革新产业，立志将魔范食间打造成新型未来餐厅。",,"魔范食间加盟条件 认同公司的企业文化，认同连锁经营理念和操作模式，具有品牌信誉至上的经营意识，具有市场应变能力和竞争能力，自觉维护“魔范食间”的品牌形象。有独立承担民事责任的能力。自愿申请合作魔范食问连锁体系，具有合适的经营场所。具备基本的投资能力、管理协调及社交能力。有良好的商业信誉，没有犯罪及破产的记录，具有做品牌的长远眼光和实际市场操作和投资能力及风险意识。服从总部的规范管理,积极配合总部的市场运作，遵纪守法，合法规苑经营。按照要求全面使用“魔范食间”统一的视觉形象及VI系统。不得借用“魔范食间”的品牌效应做损害消费者利益的事。","魔范食间加盟支持 1、选址：协助合作者选择、推荐开店地址。2、营建：为合作商提供针对性的店面装修设计与店内布局设计方案。3、培训：总部为各合作店提供技术、经营、管理、消费者沟通、服务、促销等培训。4、供货：严谨的采购流程，畅通的订货专线，规范的库存管理，高效的物流配货为您提供最稳定的原料供给。5、开业：总部将根据当地市场消费习惯为合作店开业量身提供一整套开业方案。确保一开业就火爆。6、营销：公司不定期统一策划新品上市促销、节假日促销、主题活动促销等大型的市场推广活动。7、运营：总部营运中心对合作店长期实行巡回指导，以最快的速度为合作店排忧解难。8、品牌：总部提供统一的商业品牌和全套企业VI视觉系统。知名品牌的无形资产为您赢得客户信赖。9、技术：全程为合作商提供技术培训、技术咨询、技术指导。10、研发：总部研发中心专业的美食专家团队，不断推出新品抢占市场，做永不过时的快餐。11、保护：严格的区域独家经营制度，每家店铺都有缜密的区域保护范围设定，维护正常经营秩序。12、 维权：通过编制授权码和店面地址对照查询系统，来预防假冒或侵权行为对您所造成的损失。","魔范食间加盟流程 1.投资咨询：创业顾问咨询，领取项目资料。2.填写申请：提交意向申请，接受资质评估。3.考察签约：亲自考察，签订特许合同，授予特许经营证书、授权牌照。4.店面选址：了解店面专业选址方案，沟通投资点装修意见。5.人员培训：派选人员到总部接受全程店面实务培训。6.开业运营：正式营业后配合总部全程跟进投资店经营运作。注：本项目投资金额、加盟店数量、招商加盟地区和经营模式，请以最新咨询为准！我们建议您在下方【留言板留言】 或致电咨询 ，您即可与企业免费通话并及时获得加盟项目最新动态（企业要求各不一，建议了解多个项目做对比）。更多加盟项目请登陆前景加盟网了解。","直营,合作",安微,0年,技术、经营、管理、消费者沟通、服务、促销等培训,自由创业者、在岗投资、毕业生创业、其他,https://www.qj.com.cn/brand/mofan/index/
6559,2,"2018-06-13 02:20:47",餐饮培训,餐饮,1,"2018-06-12 23:37:56",餐饮,6559,"2018-06-13 08:46:39",味赢天下小吃培训,贵州味赢天下企业管理有限公司,"1-5 万",餐饮,55家,餐饮餐饮培训,"味赢天下小吃培训是一家食品研究与技术开发、餐饮项目联盟、餐饮咨询与策划服务为一体的综合性小吃创业发展的企业。味赢天下小吃培训有着优秀的管理团队和高素质的培训师，为公司倡导以学习培训力为基石、以联营联盟力为龙头、以服务推广力为核心、以创新发展力为关键的四力文化。味赢天下小吃培训致力于打造创新和联营两大特色，矢志于新品引进、技术研发、转化推广、客户服务等各环节进行创新，全面确立了联营、连锁、联盟、代理四种打破常规。味赢天下小吃培训颠覆传统经营开展联合经营，共同发展合作共赢的服务模式。味赢天下小吃培训项目多样，总部一对一指导，学会为止。味赢天下小吃培训有烧烤培训、广东肠粉培训、花溪牛肉粉培训、山东杂粮饼培训、砂锅粉培训、开心花甲粉培训、贵州竹签烤肉培训、留一手烤鱼培训。味赢天下小吃培训无需技术，总部手把手教学，上手快速。味赢天下小吃培训通过小吃技术培训，真诚扶持创业，让每位创业者都发展成功。味赢天下小吃培训市场分析据百度百科等综合数据显示，2008年美食餐饮行业零售额达到15404亿人民币，截止2010年，短短两年间，餐饮业零售额已突破20000亿人民币!“人是铁、饭是钢，一顿不吃饿得慌”。所以餐饮业永远不会过时，是永远的朝阳行业。无论男女老少都要吃饭，面向的客户群体大，目标群体广泛。因此，从事餐饮行业，市场广阔。味赢天下小吃培训门槛低，产品齐全，有早餐系列、特色风味小吃、休闲夜宵系列、烫/炸系列、时尚饮品系列、各式特色饼类、烧烤/铁板系列、烧腊/卤菜/泡菜、火锅/快餐/小炒等。味赢天下小吃培训投资小，学期短。一、 学会为止：味赢天下小吃培训包吃包住，包教包会，学会为止。二、 快速上手：一般3--5天左右，视个人情况而定。三、 配方传授：味赢天下公司承诺百分百传授正宗配方;百分百现场实践学习。四、 终身升级：支持技术升级;包教包会!五、 秘籍赠送：培训学习资料，定制品牌工作服一套;招牌设计、价格表设计、店铺装修参考和宣传单设计等。味赢天下小吃培训合作条件1.喜欢餐饮行业，不怕吃苦2.接受味赢天下培训内容，遵守相应的规章制度3.遵守国家法律法规，无不良记录的自然人4.具有良好的商业诚信和工作责任心味赢天下小吃培训优势一、 专业的团队：味行天下餐饮有限公司龙头规模，拥有神厨名师无数;二、 稳健提升机构：多年经验结合实践培训，事实看得见;三、 快速提升方法：多年验证证实我们的方法快、准、稳;注：本项目投资金额、加盟店数量、招商加盟地区和经营模式，请以最新咨询为准！我们建议您在下方【留言板留言】 或致电咨询 ，您即可与企业免费通话并及时获得加盟项目最新动态（企业要求各不一，建议了解多个项目做对比）。招商加盟网，更多加盟项目请登陆加盟网了解。",,,,,"特许,合作",贵州,3年,小吃,自由创业者、在岗投资、毕业生创业、其他,https://www.qj.com.cn/brand/gzwytx/index/
6560,2,"2018-06-13 02:20:47",餐饮培训,餐饮,1,"2018-06-12 23:37:56",餐饮,6560,"2018-06-13 08:46:44",味正餐饮小吃培训,济南味正餐饮管理咨询有限公司,"1-5 万",餐饮,63家,餐饮餐饮培训,"餐饮小吃成投资热门，业绩收益直线飙升据百度百科等综合数据显示，2008年美食餐饮行业零售额达到15404亿人民币，截止2010年，短短两年间，餐饮业零售额已突破20000亿人民币!“济南味正小吃培训”餐饮界名师 美食家极高评价餐饮业的增幅居社会消费品各行业之首。大有可为的餐饮业，引来了众多人的青睐。人们纷纷投入餐饮行业，《济南味正餐饮》掀起了一股餐饮的热潮。祖传技术配方.现代化工艺秘制而成，满街飘香、色鲜味美、知名品牌、彰显品位、堪称卤味一绝!简单学习内门工艺，轻松惹来满堂食客小吃培训界代表 创业敛财必备技能我们是以餐饮技术研发推广、加盟、咨询、教学、招商与一体的熟食企业，是真正为您创造财富的最坚实的基础!我们自2008年创建以来致力于打造餐饮 行业技术的知名品牌。本公司为了服务好全国各地的学员及代理商，特邀请数名专业美食技术顾问长期走访全国，考察各地特色名吃和风味，汇集研发了符合 全国老百姓喜爱的美食!味正餐饮小吃培训市场优势八大程序层层把关，包教包会包出师明星团队 悉心指导 攻破难关 点亮财富之路一、 祖传技术配方 《济南味正》正统二、 现代先进工艺 出品迅速快捷三、 知名强势品牌 实力值得信赖四、 核心调味技术 口味始终如一五、 全程实践教学 干实事不讲虚六、 师傅考核制度 及格出师名厨七、 独立专属指导 厨神一对一八、 培训免费吃住 成本压制底线味正餐饮小吃培训加盟政策打破传统餐饮局限，一站培训制霸小吃界一、 扶君上马 多年经验累积 明星大厨传功济南正味餐饮小吃培训，随到随学，提供名厨名师，从零开始学，包教包会。二、 送君一程 共享成功模式 秒变成功人士济南正味餐饮小吃培训，提供完整的一套综合培训，让您轻松掌握餐饮界的航道!注：本项目投资金额、加盟店数量、招商加盟地区和经营模式，请以最新咨询为准！我们建议您在下方【留言板留言】 或致电咨询 ，您即可与企业免费通话并及时获得加盟项目最新动态（企业要求各不一，建议了解多个项目做对比）。招商加盟网，更多加盟项目请登陆加盟网了解。",,,,,"特许,合作",山东,3年,小吃,自由创业者、在岗投资、毕业生创业、其他,https://www.qj.com.cn/brand/jnwzcy/index/
6561,2,"2018-06-13 02:20:47",餐饮培训,餐饮,1,"2018-06-12 23:37:56",餐饮,6561,"2018-06-13 08:46:47",御品茶油鸭,永年县名关御品茶油鸭店,"5-10 万",餐饮,55家,餐饮餐饮培训,"无论您是90后、80后、或者70后，在您没有了解我们的时候我们只是陌路人，在您打开我们网站的那一霎那我们就是有缘人-朋友，现在我听到朋友说的最多的话就是，曾经我为什么没有做这个项目呢，如果我做了现在肯定不会给别人打工了，机会就是这样错过了就是错过了，人生总得拼搏一把，别给自己留遗憾。很多朋友有的人开店怕亏，有的人做生意怕被骗，就是不怕受穷，现在还有那个行业让你投资几万块就实实在在的赚钱，御品茶油鸭从产品的核心配方、技术培训、经营方式等多个方面给加盟商全方位支持，你所想到的，你所关心的，我们有一整套行之有效的解决方案，为你保驾护航，祝你事业成功！担心没本钱当今社会想想办法筹措几万元开店应该不是难事，关键是你开店的决心有多大不是差钱，是差决心！怕不会管理开御品茶油鸭平时一个人，忙的时候再加一个人就可以，如果人手多还可以搞外卖！怕亏本的确，做生意有风险，我们认为投资几万元做御品茶油鸭和几十万的收益，那不叫风险！怕生意不好做项目首先是信心，还没开始做就担心没生意，那店怎么开起来，生意是靠人做起来的，为什么同样的人，同样的位置有的人就能做好！怕没有经验御品茶油鸭不需要经验，店面装修，人员培训等全部由我们负责，还有全套的开店教学视频，手把手的教，你在三天内就可以成为老师傅！在选择一个项目时，每个人都会有所担心，对学员的后续支持怎样会不会学完就不管了到底利润多少会不会忽悠人项目是不是真的这些问题请你不用担心，因为已经开业的加盟商当初也有这样的担心。但时到今日，他们已经有了答案。一切都比预想的要好。当初选择御品茶油鸭是对的。如果说人的言语可以欺骗的话，那么你自己的嘴巴你的眼睛总不会欺骗你自己！永年县名关御品茶油鸭店坐落于河北邯郸临洺关镇，邯郸历史悠久，文化灿烂，是中华文明的重要发祥地之一。特别临洺关镇的《驴肉香肠》和《广府酥鱼》被誉为“中华传统名小吃”，凭借着这里的深厚名吃技术根底，我们制作的茶油鸭口味也别具一格。08年以前父亲是做卤肉的，自家大伯是做大料批发的，父亲跟大伯一起打理生意，跟各种中草药大料打交道已经十几年了，父亲经常对我说：大料的好坏直接取决于你肉食的口味，一个上品的大料跟一个下品的大料做出的东西根本是不能比的，用料的多那少直接影响鸭子的口感和香味，大料分为看、闻、品看起来就三步，把这三步练到家没个几年大料接触是根本做不到的，父亲用各种大料按照自己摸索的经验配比来制作各种肉食，特别是烤鸭在当地是一绝，那个时候还没有京式炸鸭炉，烤鸭全部用果木烤的，当时每天销量能达到80多只，每只卖25元，当年的25元是相当的值钱的，当时很多人慕名过来想加盟，都被父亲一一回绝，当时人的思想普遍都不开放，给钱也不交，总害怕别人会偷走自己什么东西。 08年父亲让我跟他一起做烤鸭生意，我不答应，年轻人年少轻狂我感觉卖鸭子太丢人，年轻人不喜欢占家总觉得外面的世界应当闯荡一下，当时我在武汉汽修做的是钣金喷漆，当时我是钣金维修工，每个月收入2000来元，当时2000元可不是现在的2000元能媲美的，我在汽修工作了四年，开始的我总以为，我好好上班，就能得到提拔，好好工作就能被领导看重，埋头苦干就能天天向上！就能让家人幸福，我们就能有出路。但是我错了....!!!!还是被现实所打败，你老实就被人欺负，你懦弱老板就会少你工资，只要跟着老板干，我永远都不能出人头地，内心里升起了自己创业的想法，加上家人的劝说，我决定把工作辞掉回家创业。回家后跟父亲一起做起了烤鸭生意，后来用京式炸鸭炉制作爆烤鸭，炸鸭过程中香味很浓烈，但是吃起来有点腻，父亲又把配方更改了好多次，最后做出的鸭子色、香、味俱全，特别炸鸭过程香味能飘200多米，我和父亲把品牌升级了一下，正式改名：“御品茶油鸭”。我们跟那些写字楼没有实体店的皮包公司不一样，我们是实体店内教学，学员只有在实体店内实战才能学到真正的本事，回家开店才会胸有成竹，市场那些打着幌子谎称百年品牌的写字楼根本都是挂羊头卖狗肉，什么张英茶油鸭、张英醉仙鸭殊不知国家明文规定人名是不可以注册商标的，做一些几十元就能做一堆铜牌和什么证书，很多加盟商还很高兴跟领了奖状一样，你的口味不好，你就是挂金子也行，我们的鸭子真真正正的做到，热而不腻凉而不腥，多年来我们培训的学员已经有一百多位了，他们回去开起了店面。","御品茶油鸭加盟优势 茶油鸭道是一汉族名菜，低温高压而成,香气扑鼻色鲜味美,外脆内嫩,香酥爽口,食后具有消化。以北京爆烤鸭为基础改革换代来的，它和爆烤鸭都是用一样的京式炸鸭炉，香味有浓郁与清淡之分，各具特色，依所选用的原料不同而略有差异。御品茶油鸭采用冷冻鲜鸭，带解冻后，从胸口开刀清理残留内脏，洗净沥干。将熬制好的料汤和糖、盐、味精配好搅拌均匀，再把葱姜蒜打碎搅拌，放如料汤内。鸭子依次在料汤（二十多种中草药熬制）中侵泡后放入方桶中（鸭头翻至鸭背肚子朝上）依次放好后将料汤均匀倒入，腌制24小时后涮出。锅置火上，放入油汤，将鸭放入锅内，待油温升（约160℃）时，压炸20分钟，时间到即出锅，色泽金黄，主要是糖起的作用。此时鸭子色泽金黄美味可口，切块即食。煲汤更美味：将做好的鸭子放入沸水中熬制，随时间的长短，时间越长口味越淳厚。御品茶油鸭，因香而出名，因香而火爆，因香而风靡市场。茶油鸭不但闻着香，吃着也香，并且由于配方含有二十多种中草药，具有一定的营养保健价值，实在是消费、茶油鸭加盟创业的好选择。茶油是一种国际营养学界推荐的健康食用油，简称“东方橄榄油”。茶油是大自然生长，是一种以单不饱和脂肪酸为主要成分的油类，含有丰富的多种维生素，能降低人体内的血压、血脂、血糖，防止高血压、高血脂、心脏病等“富贵病”的发生。茶油还含有一种生理活性成分角鲨稀，它具有香气。有很好的富氧能力，因而有着抗缺氧、抗疲劳；提高人体免疫力及增进胃肠道的功能。茶油鸭由几十种中药精心选料,科学配方,定时腌制,低温高压而成,香气扑鼻色鲜味美,外脆内嫩,香酥爽口,食后具有消化茶油鸭健脾开胃.强筋壮骨,美容养颜,抗衰老多种功效。除了这些，我们有精武久久鸭脖技术相送，让你在以后开业中不在单一，如果你能把茶油鸭跟精武久久鸭脖全部做起来你的盈利会翻好几倍，更重要的，它市场广，投资小，利润高，风险低，为您提供了一个全新可靠的创业机会!学习茶油鸭技术就来我们御品茶油鸭，御品茶油鸭由于口味独特，香气诱人，热而不腻，凉又不腥等特点，在当地深受人们喜爱，我们的学员有很多位了，他们回到当地也做起了茶油鸭，而且生意相当红火。我们和那些茶油鸭加盟技术培训中心不一样，我们是实体店形式的培训。我们会按照我们“御品”的成功创业方式指导学员学习。我们不做连锁，我们也不卖设备和料包，我们只传授技术。学员什么时候做出和“御品”一样的味道，什么时候就能毕业。",,,,特许,邯郸,3年,御品茶油鸭,自由创业者、在岗投资、毕业生创业、其他,https://www.qj.com.cn/brand/hdypcyy/index/
6562,2,"2018-06-13 02:20:47",餐饮培训,餐饮,1,"2018-06-12 23:37:56",餐饮,6562,"2018-06-13 08:46:51",聚八方餐饮培训,武汉聚八方餐饮管理有限公司,"1-5 万",餐饮,64家,餐饮餐饮培训,"聚八方餐饮培训是应武汉市劳动创业中心委托，扶持大众创业，促进就业及再就业的号召下，结合自身发展规划打造的专业餐饮培训研究机构。聚八方餐饮培训项目种类丰富，内容包括奶茶饮品、高级面点、中餐小炒、卤烤煎炸、火锅粉面等在内200余种中西特色饮食的制作工艺。聚八方餐饮培训师资力量雄厚，拥有国家级名厨7名，特级厨师15名，高级技师20名，专业培训老师40余名，台籍培训师1名，韩籍培训师1名，美籍培训师1名，意大利籍培训师1名，直营店员工600余人。聚八方餐饮培训讲师来自湖北、四川、山东、福建、湖南、广东等地，个个拥有精湛的技术与经验，精通地方菜系烹饪技巧与特色美食的制作工艺，其中面点师更是拥有美国驻华大使馆饮食方面工作经历，师资团队实力强大，保障了教学的质量与成效。聚八方餐饮培训市场优势1、全国一家拥有35家实体店的培训学校，技术好实力强公司设有专业的技术研发部、项目推广部、招商加盟部让所有学员可以依托公司旗下35家鑫王婆实体店进行实战演练，让学员在聚八方培训技术有保障创业无后顾之忧。2、公司35家实体店成功经营了8年，经历不同地区的市场洗礼和考验，无论学员在后续经营中遇到任何问题，聚八方都将有针对性地为学员提供对策和指导性意见，以强大的自身实力帮助学员渡过难关。3、是武汉市劳动创业中心，特别委托扶持大众创业的专业餐饮培训研发机构。4、产品标准化、精准量化，易学易用，无需餐饮从业经验。5、凡在聚八方学习的学员，开业时公司免费提供店面设计、灯箱设计、开业宣传单设计、门前展架设计、开业用具清单、开业促销策划。6、产品和口味不断更新，技术终身免费复学。7、全程跟踪指导开店，创业无后顾之忧。8、名师亲身授课，学员自选培训师，包吃包住，包教包会，包满意，培训有保障。9、学成后可以根据需求安排到公司实体店分租经营开店，零投资、零风险、创业成本低。聚八方餐饮培训加盟条件1.接受统一管理，可全身心投入到店面经营及管理中。2.具备一定的资金能力，能满足加盟店启动资金需求。3..具有良好的商业诚信和工作责任心。4.具有符合公司要求经营场所及合法经营手续。5.对餐饮市场有基本的概念，具有一定抗风险能力。6.遵守国家法律法规，无不良记录的自然人。7.无一夜暴富坐享其成的幻想。注：本项目投资金额、加盟店数量、招商加盟地区和经营模式，请以最新咨询为准！我们建议您在下方【留言板留言】 或致电咨询 ，您即可与企业免费通话并及时获得加盟项目最新动态（企业要求各不一，建议了解多个项目做对比）。招商加盟网，更多加盟项目请登陆加盟网了解。",,,,,"特许,合作",湖北,3年,中餐,自由创业者、在岗投资、毕业生创业、其他,https://www.qj.com.cn/brand/whjbf/index/
6563,2,"2018-06-13 02:20:47",餐饮培训,餐饮,1,"2018-06-12 23:37:56",餐饮,6563,"2018-06-13 08:46:52",君德餐饮小吃培训,广州市白云区石井王旗美食店,"1-5 万",餐饮,67家,餐饮餐饮培训,"君德餐饮小吃培训隶属于广州市白云区石井王旗美食店，公司经营小型餐饮、小吃培训、技术指导，上门带店为一体的综合服务机构。君德餐饮小吃培训提供各类餐饮小吃技术培训，学员全程实体店操作，毫无保留传授核心配方，君德餐饮小吃培训让每一位学员能够学到真实的技术，不走弯路。君德餐饮小吃培训传授各类粉面小吃技术，包括潮汕原味汤粉王，重庆酸辣粉，湖南筒子骨粉，武汉热干面，西关牛腩面，北京炸酱面，四川担担面，岭南风味萝卜牛杂，牛杂面，牛肉面，牛腩面，秘制炒粉炒面，飘香云吞，生滚粥十几个特色品种。君德餐饮小吃培训系列多样，是中小创业好选择。君德餐饮小吃培训一技在手，终身受益。君德餐饮小吃培训无需经验，无需专业技术，总部手把手教学，学位为止，做出产品和总店口味相同。君德餐饮小吃培训投资不高，技术免费升级。君德餐饮小吃培训优势体现1.餐饮小吃，市场大，人气旺。2.君德餐饮小吃培训六年经营经验，值得信赖。3.君德餐饮小吃培训不保留配方，倾囊相授，提供特色餐饮技术，品种丰富。4.君德餐饮小吃培训提供店铺选址、市场定位、运营管理，人才培训等帮助。5.君德餐饮小吃培训 有完备培训体系，让学员实操，学会为止。6.君德餐饮小吃培训提供经验人士对试营业及开幕驻店指导，一路帮扶政策，轻松创业。7.君德餐饮小吃培训提供后援技术支持，提供新品发布，更换菜单，文宣设计等支持。8.君德餐饮小吃培训总店会提供合同期内的全程技术服务，让您成为餐饮美食行家。君德餐饮小吃培训加盟条件1.要求有创业的精神以及能够承担投资创业经营风险的能力。2.愿意接受公司统一管理和投入加盟事业的时间和精力。3.管理人员要较喜欢此行业，更热衷与能以此事业而打拼的人!4.有一定的经济基础，不怕吃苦。注：本项目投资金额、加盟店数量、招商加盟地区和经营模式，请以最新咨询为准！我们建议您在下方【留言板留言】 或致电咨询 ，您即可与企业免费通话并及时获得加盟项目最新动态（企业要求各不一，建议了解多个项目做对比）。招商加盟网，更多加盟项目请登陆加盟网了解。",,,,,"特许,合作",广东,2年,小吃,自由创业者、在岗投资、毕业生创业、其他,https://www.qj.com.cn/brand/gzssjw/index/
6564,2,"2018-06-13 02:20:47",餐饮培训,餐饮,1,"2018-06-12 23:37:56",餐饮,6564,"2018-06-13 08:46:54",御品世家小吃培训技术,武汉御品世家饮食文化传播有限公司,"1-5 万",餐饮,52家,餐饮餐饮培训,"御品世家小吃培训技术项目介绍传承千年中华特色小吃经典，御品世家小吃培训中心将美食一如既往的传承下去，承载文化，造就品牌。御品世家小吃培训让你很快成为美食家，有了创业资本，做小吃生意自然就得心应手。御品世家小吃培训技术小吃传承中华5000年美食精髓，将蒸、炖、卤、烤厨艺发扬光大，并结合现代饮食习惯研究创新推出其独有的养生类原生态类、健康特色美食、味道别具一格，其天然、绿色、营养、美味，令人 食不停筷赞不绝口。御品世家小吃培训总部解决了传统小吃标准化的问题，建立了原料采购、制作加工、人员培训等一整套的标准化流程操作规范，通过对产品加工过程中的每个程序进行分解、研究、设定标准，同时御品世家公司不但的对小吃配方研究整合，最大限度地保证口味稳定和更新速度这一优势，将中华民族的饮食文化及其独有的神奇口味进一步推向世界，名扬四海。御品世家小吃培训技术中心，拥有多个小吃项目。香满堂小吃培训的培训主要针对精品砂锅、特色卤肉、特色冷饮、特色烧烤、特色油炸、精品早点、特色小吃这些方面，加盟香满堂，做小吃培训业务，随着小吃市场的不断壮大，御品世家小吃培训自然就有无限的市场空间。御品世家小吃培训加盟，最低投资几百元就可实现创业做老板的梦想，是小本创业投资者的首选项目，同时提供原料和设备，一站式保姆服务，确保您创业无忧。您只需要很小的投资(几百元到几千元)，即可得到御品世家专业的技术培训和完善的后续服务。从头解决创业的无技能问题，御品世家小吃培训提供多种特色小吃，让你成就自己的事业，御品世家成就你的人生。“御品世家”自招生开始，参加学习的学员势如破竹、捷报频传!御品世家将与所有的学员同心同德，共创双赢。御品世家小吃培训技术市场前景分析时光飞逝，日月如梭，各个王朝你下我上，成为历史，消失在历史的长河中，不断变更，而小吃文化却源远流长，不但的发扬光大，人们吃的经历也是发生翻天覆地的变化。餐饮的市场到底有多大?2004年，全年餐饮业零售额实现7486亿元，比上年净增1330亿元，同比增长21.6%，连续14年实现两位数高速增长;餐饮业增速比同期社会消 费品零售总额增长率快出8.3个百分点;全年营业税金实现411亿元，同比增长23.3%;与1978年的55亿元相比，2004年增长了136倍。1978年餐饮零售额只有55亿，1994年首次突破1千亿元，达到1175.1亿元;1996年跨第2个千亿元台阶，达到2024.9亿元;1999 年跨第3个千亿元台阶，达到3199.6亿元;从2001年起更是每年跨一个千亿元台阶，预计2005年餐饮业零售额将超过8800亿元，2006年将突 破10000亿元大关。经过20多年的发展，尤其加入WTO，中国进入全球经济一体化之后，产业结构发生重大改变。我国餐饮行业的集团化、规模化、多元化、享乐化凸现，以中高档为主的市场格局开始形成，满足了经济发展和人民生活的需求。而营销方式的多样化推动了餐饮产业的高档化、规模化，普及化，大众化。自助火锅、超级饼屋、连锁快餐、小吃总汇等新的经营方式波浪式地在大中城市推进，其发展速度超过了人们的想象，令人眼花缭乱。小吃植根于民间，具有极大的发展空间是什么?小吃的快速发展就有了其必然的缘由：居民可支配收入提高，剌激人均餐饮消费快速增长。2004年，我国人均GDP达到10502元，比上年增长16.3%。居民外出就餐的时间大大增加，小吃也同样受到强剌激而快速发展。人们的饮食结构发生了极大的变化。吃已经不再是填饱肚子而成为一种生活的品位和乐趣，人们的选择也越来越多样化。的一个部份。小吃从某种意义已经离开了恩格尔系数，而变成了一种休闲，一种娱乐，一种文化，一种享受。中华饮食文化出现了一个大众化、多元化、细分化、高档化的发展趋势。小吃也进入了一个前所未有的快速发展的通道。小吃的多样性，多元化迎合了人们生活的多样性，多元化。价格低廉是它能够迅速发展的重要原因。“三元吃饱、五元吃好，十元以上吃不了兜着走”。成为某些小吃快速崛起的法宝。健康食品。小吃基本上是低脂肪、低热量的清淡食品。最主要的原料是黄豆、麦面、糯米、五谷杂粮，其营养丰富，富含人体所需的各种营养成分而且均衡，有的可以以食为药，有去病保健的作用。百吃不厌，千种风情，万般造化的中国小吃尔系数，而变成了一种休闲。小吃种类繁多，各类小吃成千上万，按制作方法分类有蒸、煮、炸、烤、腌等多种多样，其品种又可分为时令小吃、地域小吃和常规普通小吃。米、面、芋、豆， 五谷杂粮均可取材，只要当地能吃的东西都能拿来制作，母亲、外婆、爷爷、奶奶的一个不起眼的吃食，甚至你自己发明的一道菜品，都可能延展成一个小吃，因此 小吃的制作极其容易，原料极其丰富，独具地方特色，而且适合千家万户，适合每一个人。小吃是在口味上具有特定风格特色的食品的总称，可以作为宴席间的点缀或者早点、夜宵的主要食品。世界各地都有各种各样的风味小吃，特色鲜明，风味独特。小吃就地取材，场地随意性大，投资小等原因，是小投资者的不二选择。御品世家小吃培训技术加盟条件1. 经销商必须具有独立民事责任能力人，法人或自然人。2. 具备足够资金实力，可满足资金投资要求。3. 具有良好的信用和一定的经营管理能力。4. 有良好的商业信用和经营场所。5. 有较强的公关能力及策划组织各种促销活动的能力。6. 必须保证严格遵守御品世家的有关管理经销业务，信用保障，其它商业规划等方面的规划。注：本项目投资金额、加盟店数量、招商加盟地区和经营模式，请以最新咨询为准！我们建议您在下方【留言板留言】 或致电咨询 ，您即可与企业免费通话并及时获得加盟项目最新动态（企业要求各不一，建议了解多个项目做对比）。招商加盟网，更多加盟项目请登陆加盟网了解。",,,,,"特许,合作",湖北,3年,小吃,自由创业者、在岗投资、毕业生创业、其他,https://www.qj.com.cn/brand/whypsj/index/
6565,2,"2018-06-13 02:20:47",餐饮培训,餐饮,1,"2018-06-12 23:37:56",餐饮,6565,"2018-06-13 08:46:56",醉味坊熟食培训,东莞市醉味实业投资有限公司,"1-5 万",餐饮,67家,餐饮餐饮培训,"东莞市醉味坊餐饮管理有限公司是一家集食品研究与技术开发、卤味技术开发、小本创业、开店指导、加盟、餐饮咨询与餐饮业务策划服务为一体的综合性餐饮业服务公司。醉味坊熟食培训公司以汇集天下名卤，培训创业精英为宗旨，本着勇于进取，勇于创新，追求卓越的精神，以实现社会效益和经济效益并重;达到企业、员工、联盟者三赢。醉味坊熟食培训公司拥有先进的设备，专业的讲师团队，实力雄厚。醉味坊熟食培训是汇聚全国各地美食之所长，柔和川、湘、粤菜众味与一体的知名熟食品牌。醉味坊品牌以中华熟食文化的传播与推广为宗旨，以美食美味每一天、绿色安全为理念，研制出的了水晶鸡、盐焗鸡、夫妻肺片、梅菜扣肉、红烧肉、白切鹅等四十多个精品菜肴。醉味坊熟食培训凭借其健康的原料，独特的美味，精细的工艺，所到之处很快成为当地熟食爱好者的佳选，更有“没有醉味坊熟食不成席”的美誉。醉味坊熟食培训投资不高，总部手把手教学，学会为止。醉味坊熟食培训酱香系列：酱香牛肉、酱香牛筋、酱香鸭、酱香鸭头、酱五花肉、酱猪尾巴、酱猪耳朵、酱香鸭架醉味坊熟食培训烧腊系列：烧鸭、烧鹅、澳门烧肉、蜜汁叉烧、叉烧排骨醉味坊熟食培训盐焗系列：卤翅中、卤翅尖、盐焗凤爪、盐焗鸭掌、盐香鸡腿、盐焗鸭、盐焗鸡、盐焗猪蹄、盐焗手撕鸡醉味坊熟食培训麻辣系列：绝味鸭肠、绝味鸭脖、辣味鸭头、麻辣鸭翅、麻辣鸭掌、麻辣鸡翅、麻辣猪手、麻辣豆腐干、麻辣鸭肠醉味坊熟食培训五香川卤：卤猪耳朵、卤猪头肉、烟熏拱嘴、卤猪尾巴、卤排骨、卤肘子、卤口条、白切鸭、白切鹅醉味坊熟食培训泡椒系列：泡椒凤爪、泡椒鸭掌、泡椒猪耳、泡椒猪蹄、泡椒猪尾、泡椒菌把、泡椒鸡珍、酸辣肘子醉味坊熟食培训凉拌荤菜：夫妻肺片、夫妻耳片、棒棒鸡、麻辣鸡块、干拌牛肉、红油兔丁、凉拌鸡素包醉味坊熟食培训凉拌蔬菜：酸辣海带丝、蒜泥海白菜、红油笋子、爽口木耳、麻辣藕片、红油云丝、蒜泥拍青瓜醉味坊熟食培训市场分析人人都说创业难，店面租金是个大问题。醉味坊针对中国市场特征，推出全新的超灵活经营、大小生意通吃的四种模式，适应不同的经营区域、经营能力以及利润要求，攻守兼备，无往不胜!让你轻松起步，绝不让创业之路被沉重的店租压垮!醉味坊熟食培训内容1、原材料采购及识别：学习期间需跟随采购人员到市场上采购各类冻货、鲜货、干货，了解规格、型号、价格等;需逐一识别各类香料的形状、气味、特性。2、原材料粗加工及备货：学习各种原材料的清洗、浸泡、除毛、分解、淹渍等粗加工的处理方法和保存;掌握各种原材料的损耗比例，学习如何根据成品数量准备原材料。3、6种不同口味的卤水配方及调制：学习“酱香、广香、麻辣、五香川卤”的卤料包配制、卤水的制作;酱香系列的淹渍方法盐焗系列盐焗制作;烧腊系列，烤熏系列，泡椒系列的泡水制作。4、成品的卤煮及刀工火候掌控：醉味坊熟食培训学习在调制好的卤水中如何卤煮各种菜品，以及火候大小，卤煮时间控制，成品起锅、尝味;计算各种成品的缩水比例和成本价格;并练习各种刀法。5、各种凉拌菜配方及拌制技术：醉味坊熟食培训学习各种凉拌菜的配方及拌制，凉拌菜所需调料的制作，以及肺片汤调制、原汤调制，耳片汤调制。6、秘制红油的炼制：醉味坊熟食培训学习秘制红油的配方，以及在不同油温下使用不同的辣椒调色、调香、调味;学习红油的沉淀、过滤以及保存方法。7、成品的运输及配送：醉味坊熟食培训学习成品的称重、入库，以及根据店面需要菜品的数量，准备相应的调料、辅料，按需配送;掌握运输途中的包装、保管方法。8、店面成品的摆放及保管：醉味坊熟食培训学习如何在店面摆放成品，以及如何保持成品的湿润度、颜色，确保成品任意时间看上去都摆放有序、色泽鲜艳。9、店面现场操作及管理：醉味坊熟食培训学习在店面里如何向顾客介绍菜品，以及菜品的称重、计价、切、拌、封装、打包;学习如何促销、处理异议，以及店面员工管理。10、存货的加工和保管：醉味坊熟食培训学习如何处理当天未销售完的剩余菜品，以及存货的二次加工制作、冷冻保存，存货在店面的摆放及销售技巧。醉味坊熟食培训合作条件1、备一定的资金实力，能够满足合作店的启动资金要求。2、认同“醉味坊”的商标、产品、经营理念和企业文化。3、投资有风险，投资者需要要风险意识。4、愿意从事“醉味坊”事业的经营管理，愿将醉味坊视为自己的事业。醉味坊熟食培训加盟保障培训方式：醉味坊熟食培训实操为主，理论为辅。学员在师傅的指导下亲手操作，从原材料采购到卤水的调制、成品的卤煮、红油的炼制、配料的制作、店面的实操，直到能够独立完成整个流程的操作。培训考核：醉味坊熟食培训结束后，学员以能够亲手独立制作卤菜系列，盐焗系列，烧腊系列，泡椒系列，红油凉菜系列，熏烤系列并在我公司直营店上架销售，方可通过考核。郑重承诺：醉味坊熟食培训毫无保留传授卤水配方、红油配方以及各种调料、成品的核心制作工艺，签《培训协议》并享有售后指导和免费学习新菜品的权利。食宿相关：醉味坊熟食培训免费提供三餐，住宿由我们负责联系，费用自行承担。注：本项目投资金额、加盟店数量、招商加盟地区和经营模式，请以最新咨询为准！我们建议您在下方【留言板留言】 或致电咨询 ，您即可与企业免费通话并及时获得加盟项目最新动态（企业要求各不一，建议了解多个项目做对比）。招商加盟网，更多加盟项目请登陆加盟网了解。",,,,,"特许,合作",广东,3年,熟食,自由创业者、在岗投资、毕业生创业、其他,https://www.qj.com.cn/brand/dgzwsy/index/
6566,2,"2018-06-13 02:20:47",餐饮培训,餐饮,1,"2018-06-12 23:37:56",餐饮,6566,"2018-06-13 08:46:56",老豆达人奶茶,老豆达人奶茶有限公司,"1-5 万",餐饮,344家,"餐饮奶茶,餐饮培训",老豆达人奶茶以代表活力的橙黄色调为主，简洁时尚的装饰，吸引着时尚年轻一族。新颖健康的饮品、大众的价位、多家品牌连锁店，地处繁华，让大维流传着很好的口碑。我们追求新鲜的、健康的、可以喝一辈子的全民饮料。老豆达人奶茶采用进口原料、无色素，无糖精，并且现场制作、保证新鲜度，好喝更健康！老豆达人奶茶经营理念：为我们的顾客不断创新、量身定做，提供新鲜的、健康的、顾客满意的饮品。2006年10月，老豆达人奶茶接受中国—东盟06国际美食节的诚挚邀请，参加美食节。并在美食节200多个参展企业中一举夺得饮品类金奖，“芒果冰沙”和“木瓜牛奶”分获“广西名小吃”金奖、银奖。老豆达人奶茶，加盟双重投资模式，自由切换，让你投入的每一分，都有花的价值。老豆达人奶茶，三万元起得特色餐饮项目，轻创业，轻上阵，时尚新茶饮。老豆达人奶茶，真材实料，口感清爽，为消费者带来全新感受。老豆达人奶茶全新手摇牛乳茶，开启全新茶饮时代，一杯牛乳茶，30次手摇，细腻泡沫，口感甜美，让你遇见浪漫。老豆达人奶茶遵循好茶才有好口感，追溯源头，甄选材料，茶基地红茶精致而成，让一杯老豆达人奶茶味道刚刚好。老豆达人奶茶精准工艺，六道工序制成一个茶包，四项控制还原真实茶的口感，品一杯老豆达人奶茶，享受艺术时光。老豆达人奶茶，一种让味蕾欢快起来，让时间慢下来的神奇饮品。老豆达人奶茶致力于治愈现代都市人群的味觉缺失症候群，一口就充分调动起你的心动感受。奶的醇+茶的香，更细腻的口感，更完美的体验，哆可将继续发挥茶的无限可能，让带有中国茶文化特色的饮品成为更多人的选择。直至连锁终端成功的全产业链完整服务体系，业内遥遥领先。老豆达人奶茶，投资灵活，经营简单，开创全新都市生活方法，打造浪漫时光休闲吧。一家老豆达人奶茶同时还是小吃店，甜品屋，冰淇淋店，一店满足人群需求。加盟老豆达人奶茶，扶持多多，优惠多多，全程指导，完善售后，加盟商可以放心加盟。,"老豆达人奶茶加盟优势 一：老豆达人奶茶加盟店冬夏各有主打产品，不受季节限制，没有经营淡季，使市场和顾客对干杯定位清晰、印象深刻。二：创新设计的门面效果使老豆达人奶茶加盟店在任何地段都成为人们“最显眼的门店”，绝对招揽顾客关注。三：老豆达人奶茶全茶品现场新鲜调制，无任何色素添加剂，跟随时尚潮流并引导健康茶饮概念。四：老豆达人奶茶加盟店重要设备均原装进口，以配合高质量茶品制作。五：近10年的原料秘方和调配技术，使老豆达人奶茶产品口味始终保持最佳。六：老豆达人奶茶加盟区域保护协议，实现稳定的投资回报率。","老豆达人奶茶加盟条件 1 加盟商具有一定的资金实力，能亲自参加店铺的经营管理。2 店铺位置应处于当地繁华商业地段，当地的大型购物中心或商场内。3 按公司统一形象装修，由公司免费提供装修设计图，费用由加盟商自行承担。4 营业面积：商场专柜30平以上，临街专卖店40平以上！",,"老豆达人奶茶加盟流程 1．通过电话、传真、电子邮件或QQ咨询总部并沟通开店事宜。2．自行考察市场、落实（经营场地）。3．亲临总部实地考察。4．双方签订合同。5．总部协助策划一切开店事宜（经营辅导、技术培训）。6．择日试营业再开业。7．定期指导运营。",特许,上海,3年,奶茶,自由创业者、在岗投资、毕业生创业、其他,https://www.qj.com.cn/brand/lddrnc/index/
6567,2,"2018-06-13 02:20:47",餐饮培训,餐饮,1,"2018-06-12 23:37:56",餐饮,6567,"2018-06-13 08:46:59",七秒鱼汉堡奶茶,洛阳七秒鱼酒店管理有限公司,"0-1 万",餐饮,132家,餐饮餐饮培训,"七秒鱼汉堡奶茶培训中心， 专业为创业者提供6大类食品、8大类饮品现场实物培训、场地选择、设备配置、原料进货、宣传策划等全套一站式开店服务！",,"七秒鱼汉堡奶茶加盟条件 1.具有固定的营业场所，固定的销售网络和完整的销售队伍。　　2.有一定的经济实力及经营管理能力。　　3.具备有较丰富的市场营销经验，有代理快速消费品的操作经验，能较快地切入当地市场。　　4.在当地具有良好的商业信誉及社会关系，　　5.热衷于餐饮事业的发展。　　6.满足我们的加盟商授权标准。　　7.有详尽填写加盟申请表等相关资料，并获得我公司审批通过。","七秒鱼汉堡奶茶加盟支持 1.健康的加盟体系　　2.商圈保护支持　　3.店址选择支持　　4.系统、规范的委托管理　　5.员工选择与培训支持　　6.指导开店相关手续办理　　7.店面设计、装修支持　　8.媒体广告、行销宣传","七秒鱼汉堡奶茶加盟流程 1.电话咨询加盟事宜 　　加盟商先通过电话，网站对品牌及产品有个大概的了解，投资实力自行评估，做出准确判断。了解品牌加盟费用多少钱等一系列问题。　　2.总部实地考察 　　到总部参观考察，了解品牌的来源，理性分析抓住时机对品牌项目的确定。　　3.加盟店现场考察 　　项目确定后回当地选址，也就是所开店面区域的保留，店面确定。确定店面需要公司专业的市场评估人员作出准确分析，店面积，位置，租金，客流量等，做出综合分析后，以确定作出准确分析。　　4.开业驻点指导　　考试结业后，内侧后确定开业日期，开业前提前一个星期与公司运营部确定带店老师上门带店指导开业，以及订购所有食材准确的发货时间，与新媒体部门联系确认开业营销活动及网络推广。　　注：本项目投资金额、加盟店数量、招商加盟地区和经营模式，请以最新咨询为准！我们建议您在本品牌主页下方【留言板留言】 或致电咨询，您即可与企业免费通话并及时获得加盟项目最新动态（企业要求各不一，建议了解多个项目做对比）。",特许,上海,3年,汉堡奶茶加盟培训和原料的销售,自由创业者、在岗投资、毕业生创业、其他,https://www.qj.com.cn/brand/7sfishjm/index/
6568,2,"2018-06-13 02:20:47",餐饮培训,餐饮,1,"2018-06-12 23:37:56",餐饮,6568,"2018-06-13 08:47:04",缘位餐饮,重庆缘位餐饮管理有限责任公司,"1-5 万",餐饮,1000家,餐饮餐饮培训,"　　多年来，缘位餐饮以“传承百年，经典美味”的饮食文化为已任，秉承“真诚助人，共生共赢”的经营理念，专心致力于饮食文化的传播和推广。　　缘位餐饮创立以来，汇集多位国内顶级美食专家潜心研究中国民族民间饮食文化遗产,成功发掘原汁原味的多项名菜、拥有民间餐饮秘方数十项;拥有全国品种全、具特色、适合各地、各种人群的特色小吃项目，技术都来自于正宗的名小吃发源地，让每位创业者都能学到正宗的小吃口味，实现零风险经营。 以""做好吃的食品""为理念，为消费者提供了更符合现代生活形态的美食。　　缘位餐饮通过培训的方式，让中小餐饮创业者在生意火爆的店面进行实战式学习;培训从培训中心到实店，从全套技术配方到制作销售;从技术经营再到开业，一条龙培训，让您后果无忧!　　旗下自有菜品食品研发中心、8000平米大型餐饮工厂和专业调味品厂，为集团旗下所有品牌提供有力的支撑。缘滋缘位崇尚中式餐饮连锁新理念。为确保每个缘位门店餐品的口味统一，安全卫生，缘滋缘位建立了中央厨房，中央厨房生产的调料采用高温杀菌技术，确保产品在常温条件下保存2年不变质，采用了统一配送制。实现了每个门店厨房的无油烟无明火，一人可操作，十秒可出餐，预定可万份。缘位餐饮，带你“大开眼见”!",,,"缘位餐饮加盟支持 　　营运支持：可行性分析、盈亏平衡分析、成本控制、营业业绩评估、营运问题诊断等。　　营建支持：选址规划、商圈分析、设计方案、设备方案、训练规划等。　　培训支持：招聘员工、管理培训、礼仪服务、业务提升、培训评估等。　　物配支持：底料配送、菜品配送、服装配送、原料采购、物品配送等。　　产品支持：总部由专门的技术人员进行新产品开发、各种技术更新。　　企划支持：开业策划、营销策划、广告宣传、促销宣传、公关活动等。　　手册支持：服务手册、财务手册、人事手册、厨房手册、员工手册、营运手册。","缘位餐饮加盟流程 　　1、网上咨询项目，可通过网站、电话等了解信息。　　2、现场考察，可来总部进行全面考察!　　3、全面考察满意后方可签订合同，签字盖章生效，需缴纳一次加盟费;　　4、签约合同后领取培训资料，安排住宿，总部即可展开开店指导工作;　　5、有意向性店面，总部协助评估确保加盟商找到一个性价比高的店面;　　6、总部进行技术培训，见环节原料采购加工制作一对一教学，直到回为止!　　7、总部安排专业师傅上面带店教学15天!确保短时间内掌握技术，能够对立经营!","直营,特许,合作",重庆,0年,"餐饮培训 酸辣粉 特色小吃培训",自由创业者、在岗投资、毕业生创业、其他,https://www.qj.com.cn/brand/cyjmpx/index/
6569,2,"2018-06-13 02:20:47",餐饮培训,餐饮,1,"2018-06-12 23:37:56",餐饮,6569,"2018-06-13 08:47:07",喜洛菲小吃培训,广东市广品餐饮企业管理有限公司,"10-20 万",餐饮,55家,餐饮餐饮培训,广品餐饮公司简介广品餐饮隶属广州市广品餐饮企业管理有限公司，致力于特色小吃项目的技术研发、技术培训、技术指导、品牌管理、品牌推广发展于一体的企业．广品餐饮旨在帮助更多的打工者摆脱打工命运，自己开店创业当老板，踏上小康致富路。　广品餐饮自成立以来，秉承“自信、诚信；用心、创新”的经营理念，“传承小吃文化，成就创业梦想”的企业宗旨，“每天更进一步　”的员工精神，立足广州，发展全国，以广大学员为中心，以强大的研发团队、独特的技术配方为支撑，以扶持创业及品牌化运营为导向，以全国服务网络为依托，倾力打造全国小吃培训及连锁加盟品牌。　公司多次被评为“优秀企业”、“诚信单位”、“先进培训机构”和“示范窗口培训单位”等光荣称号。为方便全国各地学员的需求，广品餐饮已在广州、深圳等地设立分校，方便各地学员学习。　广品餐饮公司拥有一支强大的研发团队和教师团队，研发中心倡导“传统与时尚、美味与健康”的饮食新文化，紧密跟踪传统美食行业的发展趋势和消费理念，以市场需求为导向，对传统项目的原材料配方、制作流程等不断进行改进和创新；同时，加大新品开发力度，不断完善各地传统风味小吃，目前已拥有国内品种丰富的小吃厨师奶茶点心培训基地，可有效满足全国各地学员及加盟商的个性化需求。强大的研发实力、持续的产品创新已成为广品保持行业领先的有力保障。　广品餐饮拥有一支以高级烹调师和高级技师为骨干、经验丰富、治学严谨的师资队伍。＊培训采用“一对一”实操教学模式，随到随学、循环授课、实际操作、手把手教学、包教包会，在教学上理论与实践相结合，着力培养学员实际动手能力和创新能力。　此外，广品餐饮具备丰富的项目运营经验和大量的品牌化管理案例，通过对学员进行专业的系统指导，使学员迅速掌握创业技能，并提供后续的品牌化运营支持。学员毕业后大多能迅速步入经营正轨，一部分成功学员已开始连锁化运营，在“小行业”里实现了“大梦想”。　未来，广品将继续凭借独特的经营和管理模式，积极进取，勇于开拓，持续创新，争取不断创造新的佳绩。　注：本项目投资金额、加盟店数量、招商加盟地区和经营模式，请以最新咨询为准！我们建议您在下方【留言板留言】　或致电咨询　，您即可与企业免费通话并及时获得加盟项目最新动态（企业要求各不一，建议了解多个项目做对比）。招商加盟网，更多加盟项目请登陆加盟网了解。,,,,,直营,广东,1年,鲜煮艺、火锅、烧烤,自由创业者、在岗投资、毕业生创业、其他,https://www.qj.com.cn/brand/xiluofei/index/