category_2_x_tushu.id,category_2.id,category_2.ts,category_2.title,category_1.id,category_1.ts,category_1.title,tushu.id,tushu.ts,tushu.title,tushu.pingfen,tushu.pingjia_renshu,tushu.chuban,tushu.neirong_jianjie,tushu.zuozhe_jianjie,tushu.zuozhe,tushu.chubanshe,tushu.yuanzuoming,tushu.yizhe,tushu.chubannian,tushu.yeshu,tushu.dingjia,tushu.zhuangzhen,tushu.congshu,tushu.isbn,tushu.wuxing_pingjia,tushu.sixing_pingjia,tushu.sanxing_pingjia,tushu.erxing_pingjia,tushu.yixing_pingjia
1,1,"2018-06-11 04:24:12",小说,1,"2018-06-11 04:24:12",文学,1,"2018-07-09 02:12:22",解忧杂货店,8.6,285958,"[日] 东野圭吾 / 李盈春 / 南海出版公司 / 2014-5 / 39.50元","现代人内心流失的东西，这家杂货店能帮你找回—— 僻静的街道旁有一家杂货店，只要写下烦恼投进卷帘门的投信口，第二天就会在店后的牛奶箱里得到回答。 因男友身患绝症，年轻女孩静子在爱情与梦想间徘徊；克郎为了音乐梦想离家漂泊，却在现实中寸步难行；少年浩介面临家庭巨变，挣扎在亲情与未来的迷茫中…… 他们将困惑写成信投进杂货店，随即奇妙的事情竟不断发生。 生命中的一次偶然交会，将如何演绎出截然不同的人生？ 如今回顾写作过程，我发现自己始终在思考一个问题：站在人生的岔路口，人究竟应该怎么做？我希望读者能在掩卷时喃喃自语：我从未读过这样的小说。——东野圭吾","东野圭吾 日本著名作家。 1985年，《放学后》获第31届江户川乱步奖，开始专职写作； 1999年，《秘密》获第52届日本推理作家协会奖； 2005年出版的《嫌疑人X的献身》史无前例地同时获得第134届直木奖、第6届本格推理小说大奖，以及年度三大推理小说排行榜第1名； 2008年，《流星之绊》获第43届新风奖； 2009年出版的《新参者》获两大推理小说排行榜年度第1名； 2012年，《解忧杂货店》获第7届中央公论文艺奖。 2014年，《祈りの幕が下りる時》（暂译《祈祷落幕时》）获第48届吉川英治文学奖。","[日] 东野圭吾",南海出版公司,ナミヤ雑貨店の奇蹟,李盈春,2014-5,291,39.50元,精装,新经典文库·东野圭吾作品,9787544270878,49.6%,38.2%,10.9%,1.0%,0.3%
2,1,"2018-06-11 04:24:12",小说,1,"2018-06-11 04:24:12",文学,2,"2018-07-09 02:12:26","巨人的陨落 : 世纪三部曲",8.9,37765,"[英] 肯·福莱特 / 于大卫 / 江苏凤凰文艺出版社 / 2016-5-1 / 129.80元","在第一次世界大战的硝烟中，每一个迈向死亡的生命都在热烈地生长——威尔士的矿工少年、刚失恋的美国法律系大学生、穷困潦倒的俄国兄弟、富有英俊的英格兰伯爵，以及痴情的德国特工… 从充满灰尘和危险的煤矿到闪闪发光的皇室宫殿，从代表着权力的走廊到爱恨纠缠的卧室，五个家族迥然不同又纠葛不断的命运逐渐揭晓，波澜壮阔地展现了一个我们自认为了解，但从未如此真切感受过的20世纪。","肯·福莱特 Ken Follett (1949 -)，现象级畅销小说大师。1978年出版了处女作《风暴岛》，并于次年获得爱伦坡奖，声名鹊起，专职写作。2010年，荣登全球作家富豪榜上第5名。2013年，获得爱伦坡终身大师奖。他的小说出版前，都会请历史学家审读书稿，绝不容许出现任何史实错误。有出版人曾指出，肯·福莱特 “没有一个饱受折磨的灵魂”，他愉快地承认了，“大家都在写内心的痛苦，可我总是觉得很开心”。他说：“很多作家只写能取悦他们自己的东西，并模模糊糊地希望这也能取悦别人。但我每写一页都在清醒地思考：读者会怎么想？读者觉得这真的会发生吗？读者关心这些吗？读者想要知道接下来会发生什么吗？我敬佩那些用文字和新奇结构进行文学实验的作家，但我从不这么玩。” 作者官方网站：www.ken-follett.com","[英] 肯·福莱特",江苏凤凰文艺出版社,"Fall of Giants",,2016-5-1,1168,129.80元,平装,世纪三部曲,9787539989891,59.2%,33.3%,6.5%,0.6%,0.3%
3,1,"2018-06-11 04:24:12",小说,1,"2018-06-11 04:24:12",文学,3,"2018-07-09 02:12:29",我的前半生,7.9,22522,"亦舒 / 新世界出版社 / 2007-8 / 22.00元",一个三十几岁的美丽女人子君，在家做全职家庭主妇。却被一个平凡女人夺走丈夫，一段婚姻的失败，让女主角不得不坚强，变得更美丽，有了事业，最终遇见一个更值得爱的男人……,亦舒，言情文学作家。原名倪亦舒，兄长是香港作家倪匡。亦舒1946年生于上海，祖籍浙江镇海，五岁时定居香港。中学毕业后，曾在《明报》任职记者，及担任电影杂志采访和编辑等。1973年，亦舒赴英国修读酒店食物管理课程，三年后回港，任职富丽华酒店公关部，后进入政府新闻处担任新闻官，也曾当过电视台编剧。现为专业作家，并已移居加拿大。,"[加拿大] 亦舒",新世界出版社,,,2007-8,271,22.00元,平装,亦舒新经典,9787802283930,31.8%,43.4%,22.3%,1.9%,0.6%
4,1,"2018-06-11 04:24:12",小说,1,"2018-06-11 04:24:12",文学,4,"2018-07-09 02:12:34",房思琪的初恋乐园,9.2,18180,"林奕含 / 北京联合出版公司 / 2018-1 / 45.00元","令人心碎却无能为力的真实故事。 向死而生的文学绝唱 打动万千读者的年度华语小说。 李银河 戴锦华 骆以军 张悦然 冯唐 詹宏志 蒋方舟 史航 等多位学者作家社会名人郑重推荐。 痛苦的际遇是如此难以分享，好险这个世界还有文学。 我下楼拿作文给李老师改。他掏出来，我被逼到涂在墙上。老师说了九个字：“不行的话，嘴巴可以吧。”我说了五个字：“不行，我不会。”他就塞进来。那感觉像溺水。可以说话之后，我对老师说：“对不起。”有一种功课做不好的感觉。 小小的房思琪住在金碧辉煌的人生里，她的脸和她可以想象的将来一样漂亮。补习班语文名师李国华是同一栋高级住宅的邻居。崇拜文学的小房思琪同样崇拜饱读诗书的李老师。 有一天李老师说，你的程度这么好，不如每个礼拜交一篇作文给我吧，不收你周点费。思琪听话地下楼了。老师在家里等她，桌上没有纸笔。 思琪的初恋是李老师。因为李老师把...(展开全部)",林奕含（1991——2017），台湾作家。出生于台南，曾居台北。梦想是一面写小说，一面像大江健三郎所说的：从书呆子变成读书人，再从读书人变成知识分子。,林奕含,"磨铁 ·北京联合出版公司",,,2018-1,272,45.00元,平装,,9787559614636,67.1%,28.3%,4.1%,0.3%,0.2%
5,1,"2018-06-11 04:24:12",小说,1,"2018-06-11 04:24:12",文学,5,"2018-07-09 02:12:37",追风筝的人,8.9,316243,"[美] 卡勒德·胡赛尼 / 李继宏 / 上海人民出版社 / 2006-5 / 29.00元","12岁的阿富汗富家少爷阿米尔与仆人哈桑情同手足。然而，在一场风筝比赛后，发生了一件悲惨不堪的事，阿米尔为自己的懦弱感到自责和痛苦，逼走了哈桑，不久，自己也跟随父亲逃往美国。 成年后的阿米尔始终无法原谅自己当年对哈桑的背叛。为了赎罪，阿米尔再度踏上暌违二十多年的故乡，希望能为不幸的好友尽最后一点心力，却发现一个惊天谎言，儿时的噩梦再度重演，阿米尔该如何抉择？ 故事如此残忍而又美丽，作者以温暖细腻的笔法勾勒人性的本质与救赎，读来令人荡气回肠。","卡勒德·胡赛尼（Khaled Hosseini），1965年生于阿富汗喀布尔市，后随父亲迁往美国。胡赛尼毕业于加州大学圣地亚哥医学系，现居加州。“立志拂去蒙在阿富汗普通民众面孔的尘灰，将背后灵魂的悸动展示给世人。”著有小说《追风筝的人》(The Kite Runner，2003）、《灿烂千阳》(A Thousand Splendid Suns，2007)、《群山回唱》（And the Mountains Echoed,2013）。作品全球销量超过4000万册。2006年，因其作品巨大的国际影响力，胡赛尼获得联合国人道主义奖，并受邀担任联合国难民署亲善大使。","[美] 卡勒德·胡赛尼",上海人民出版社,"The Kite Runner",,2006-5,362,29.00元,平装,卡勒德·胡赛尼作品,9787208061644,55.1%,36.4%,7.7%,0.5%,0.2%
6,1,"2018-06-11 04:24:12",小说,1,"2018-06-11 04:24:12",文学,6,"2018-07-09 02:12:40",百年孤独,9.2,133138,"[哥伦比亚] 加西亚·马尔克斯 / 范晔 / 南海出版公司 / 2011-6 / 39.50元",《百年孤独》是魔幻现实主义文学的代表作，描写了布恩迪亚家族七代人的传奇故事，以及加勒比海沿岸小镇马孔多的百年兴衰，反映了拉丁美洲一个世纪以来风云变幻的历史。作品融入神话传说、民间故事、宗教典故等神秘因素，巧妙地糅合了现实与虚幻，展现出一个瑰丽的想象世界，成为20世纪最重要的经典文学巨著之一。1982年加西亚•马尔克斯获得诺贝尔文学奖，奠定世界级文学大师的地位，很大程度上乃是凭借《百年孤独》的巨大影响。,"加西亚•马尔克斯（Gabriel García Márquez）1927年出生于哥伦比亚马格达莱纳海滨小镇阿拉卡塔卡。童年与外祖父母一起生活。1936年随父母迁居苏克雷。1947年考入波哥大国立大学。1948年因内战辍学，进入报界。五十年代开始发表文学作品。六十年代初移居墨西哥。1967年出版《百年孤独》。1982年获诺贝尔文学奖。","[哥伦比亚] 加西亚·马尔克斯",南海出版公司,"Cien años de soledad",,2011-6,360,39.50元,精装,新经典文库:加西亚·马尔克斯作品,9787544253994,68.0%,25.4%,5.8%,0.5%,0.3%
7,1,"2018-06-11 04:24:12",小说,1,"2018-06-11 04:24:12",文学,7,"2018-07-09 02:12:45",雪落香杉树,8.5,2840,"[美] 戴维·伽特森 / 熊裕 / 全本书店|作家出版社 / 2017-6 / 52.00元","编辑推荐: 1995福克纳奖得主 占据《纽约时报》畅销榜首数月 美国书商协会年度之选 被译成30余种文字，全球畅销500万册 当代美国文学史上罕见的超级畅销获奖经典 全美大中学文学课堂读本，被列入大学文学课程考试大纲 拥有哈罗德•布鲁姆和Cliff Notes等众多导读本 恢弘精妙，融爱情、战争、历史、悬疑和成长小说于一体 多次被改编成电影和舞台剧，同名电影由伊桑霍克和工藤夕贵主演 内容简介： 一位默默无闻的美国中学教师，用十年时间写下令自己一夜成名的故事，虚构了西雅图附近一座香杉积翠，草莓遍地的海岛，一处被海水封闭的小型人世，交织上演着爱情、战争、种族歧视和悬疑谋杀案…… 日裔少女初枝的生活中先后到来两个男人：邻居男孩伊什梅尔是她的初恋，他们气息相通；暗恋她并*终成为她丈夫的日本同学宫本天道，他们血脉相连。珍珠港事件爆发，日美矛盾空前激化，日裔居民...(展开全部)","戴维·伽特森，1956年生，美国小说家、诗人。《雪落香杉树》是他的成名作，他花了十年时间在教书之余写成，出版后获福克纳奖和美国书商协会年奖，并畅销近五百万册。 译者 熊裕，资深文学编辑与译者，译有《借东西的小人》、《多莱尔的希腊神话书》等多部作品。",,全本书店|作家出版社,"Snow Falling on Cedars",熊裕,2017-6,370,52.00元,精装,,9787506387873,42.8%,43.4%,12.1%,1.2%,0.5%
8,1,"2018-06-11 04:24:12",小说,1,"2018-06-11 04:24:12",文学,8,"2018-07-09 02:12:49",霍乱时期的爱情,9.0,73667,"[哥伦比亚] 加西亚·马尔克斯 / 杨玲 / 南海出版公司 / 2012-9-1 / 39.50元","★马尔克斯唯一正式授权，首次完整翻译 ★《霍乱时期的爱情》是我最好的作品，是我发自内心的创作。——加西亚•马尔克斯 ★这部光芒闪耀、令人心碎的作品是人类有史以来最伟大的爱情小说。——《纽约时报》 《霍乱时期的爱情》是加西亚•马尔克斯获得诺贝尔文学奖之后完成的第一部小说。讲述了一段跨越半个多世纪的爱情史诗，穷尽了所有爱情的可能性：忠贞的、隐秘的、粗暴的、羞怯的、柏拉图式的、放荡的、转瞬即逝的、生死相依的……再现了时光的无情流逝，被誉为“人类有史以来最伟大的爱情小说”，是20世纪最重要的经典文学巨著之一。","加西亚•马尔克斯（Gabriel García Márquez） 1927年出生于哥伦比亚马格达莱纳海滨小镇阿拉卡塔卡。童年与外祖父母一起生活。1936年随父母迁居苏克雷。1947年考入波哥大国立大学。1948年因内战辍学，进入报界。五十年代开始出版文学作品。六十年代初移居墨西哥。1967年《百年孤独》问世。1982年获诺贝尔文学奖。1985年出版《霍乱时期的爱情》。 加西亚•马尔克斯豆瓣小站：http://site.douban.com/marquez/","[哥伦比亚] 加西亚·马尔克斯",南海出版公司,"El amor en los tiempos del cólera",,2012-9-1,401,39.50元,精装,新经典文库:加西亚·马尔克斯作品,9787544258975,58.0%,33.0%,8.3%,0.5%,0.2%
9,1,"2018-06-11 04:24:12",小说,1,"2018-06-11 04:24:12",文学,9,"2018-07-09 02:12:54","新名字的故事 : 那不勒斯四部曲-02",9.0,7210,"[意] 埃莱娜·费兰特 / 陈英 / 人民文学出版社 / 2017-4 / 59.00元","只有你身为女人 才会知道这些丑陋的秘密 两个女人 50年的友谊和战争 如何成为那个更强大的她，又不被她战胜 那不勒斯四部曲NO.2 《我的天才女友》后续， 意大利最神秘的作家费兰特 探索青年时代的激情、困惑、挣扎、背叛和失去 全球畅销近千万册 被翻译成40多种语言 希拉 里·克林顿、 乔纳森·弗兰岑、詹姆斯·伍德、詹姆斯·弗兰科都是她的粉丝 ------------------------- 《新名字的故事》是埃莱娜·费兰特的“那不勒斯四部曲”的第二部，描述了埃莱娜和莉拉的青年时代。在她们的人生以最快的速度急遽分化的那些年里，她们共同体验了爱、失去、困惑、挣扎、嫉妒和隐蔽的破坏。 莉拉在结婚当天就发现婚姻根本不是她想象的那样，她的初夜几乎是一场强奸。她带着一种强大的破坏欲介入了斯特凡诺的家族生意，似乎成为了她和埃莱娜小时候都想成为的那种女人。久未有身...(展开全部)","埃莱娜·费兰特，目前意大利最受欢迎也最神秘的作家。埃莱娜·费兰特是一个笔名，其真实身份至今是谜。 埃莱娜·费兰特1992年发表第一部长篇小说《讨厌的爱》，很快引起关注，1995年就被意大利导演马里奥·马尔托内拍摄为同名影片；此后她相继出版小说《被抛弃的日子》(2002) 、《迷失的女儿》（2006）、《夜晚的沙滩》（2007）和散文、访谈集《不确定的碎片》（2003）。 2011年至2014年，埃莱娜·费兰特以每年一本的频率出版《我的天才女友》《新名字的故事》《离开的，留下的》和《失踪的孩子》这四部情节相关的小说，被称为“那不勒斯四部曲”。它们以史诗般的体例，描述了两个在那不勒斯穷困社区出生的女孩持续半个世纪的友谊。 “那不勒斯四部曲”也在世界范围内掀起了“费兰特热”，千万读者为书中对女性友谊极度真实、尖锐、毫不粉饰的描述所打动。虽然作者从未公开其性...(展开全部)","[意] 埃莱娜·费兰特",人民文学出版社,,陈英,2017-4,492,59.00元,平装,那不勒斯四部曲,9787020125265,59.7%,32.9%,6.7%,0.5%,0.3%
10,1,"2018-06-11 04:24:12",小说,1,"2018-06-11 04:24:12",文学,10,"2018-07-09 02:12:58",鱼王,9.0,1740,"[俄] 维克托·阿斯塔菲耶夫 / 夏仲翼 等 / 理想国 | 广西师范大学出版社 / 2017-4 / 78.00元","长篇小说《鱼王》是阿斯塔菲耶夫最具个性的一部代表作，俄罗斯当代文学的经典。全书由十三个内容相对独立的“叙事短篇小说”组成，全部围绕着人与自然的关系，深入细致地描绘了充满神秘诱惑的西伯利亚以及生活在那里的人们，他们关于生活的沉思。荒凉苦寒的自然环境，同时又是大自然尽显壮美广袤富饶之地，人类的足迹在其间虽如雪泥鸿爪，却又带着生命不息的尊严。 这些篇章在思想内容和艺术形式上显示了独特的风格，淡化情节，描写细腻鲜活，“集长篇小说、中篇小说、抒情散文、道德议论为一体” (王小波)，从不同的角度和方式显露出连贯的内容和意象，犹如不经意穿成的一串珍珠，每一颗都以其自身的美丽折射出耀眼的光芒。 《鱼王》写作时为十三篇，其中《没心没肺》一篇在1975年首次出版时未能收入，此后的汉语译本皆因袭此删节版。本次由俄语翻译家张冰将该篇翻译补入，首次呈现这部杰作 的全貌，并收...(展开全部)","维克托·彼得洛维奇·阿斯塔菲耶夫(1924-2001)，20世纪下半叶俄罗斯文学代表人物之一。生于西伯利亚克拉斯诺亚尔斯克一个农民家庭，作品多取材于自身经历，被认为继承了屠格涅夫、普里什文和巴乌斯托夫斯基的自然文学传统 ， 并创造出将小说、道德思辨和抒情散文熔于一炉的独特风格。阿斯塔菲耶夫善于描写自然生活， 洞察人与大自然的关系， 开掘人的心灵， 返照时代的剪影。正如评论家马卡洛夫所说：“ 阿斯塔菲耶夫的作品是关于我们生活的沉思， 是关于人在大地上和社会上的使命以及人的道德标准的沉思， 是关于俄罗斯民族性格的沉思。” 代表作《鱼王》《树号》《牧童和牧女》《最后一次鞠躬》等。","[俄] 维克托·阿斯塔菲耶夫","理想国 | 广西师范大学出版社",Царь-рыба,"夏仲翼 等",2017-4,644,78.00元,精装,理想国·阿斯塔菲耶夫作品,9787549586547,57.3%,33.5%,7.8%,1.1%,0.4%
11,1,"2018-06-11 04:24:12",小说,1,"2018-06-11 04:24:12",文学,11,"2018-07-09 02:13:02",月亮和六便士,9.0,79838,"[英] 毛姆 / 傅惟慈 / 上海译文出版社 / 2006-8 / 15.00元",一个英国证券交易所的经纪人，本已有牢靠的职业和地位、美满的家庭，但却迷恋上绘画，像“被魔鬼附了体”，突然弃家出走，到巴黎去追求绘画的理想。他的行径没有人能够理解。他在异国不仅肉体受着贫穷和饥饿煎熬，而且为了寻找表现手法，精神亦在忍受痛苦折磨。经过一番离奇的遭遇后，主人公最后离开文明世界，远遁到与世隔绝的塔希提岛上。他终于找到灵魂的宁静和适合自己艺术气质的氛围。他同一个土著女子同居，创作出一幅又一幅使后世震惊的杰作。在他染上麻风病双目失明之前，曾在自己住房四壁画了一幅表现伊甸园的伟大作品。但在逝世之前，他却命令土著女子在他死后把这幅画作付之一炬。通过这样一个一心追求艺术、不通人性世故的怪才，毛姆探索了艺术的产生与本质、个性与天才的关系、艺术家与社会的矛盾等等引人深思的问题。同时这本书也引发了人们对摆脱世俗束缚逃离世俗社会寻找心灵家园这一话题的思考，而关...(展开全部),"威廉·萨默赛特·毛姆（William Somerset Maugham）于1874年1月25日出生在巴黎。父亲是律师，当时在英国驻法使馆供职。小毛姆不满十岁，父母就先后去世，他被送回英国由伯父抚养。毛姆进坎特伯雷皇家公学之后，由于身材矮小，且严重口吃，经常受到大孩子的欺凌和折磨，有时还遭到冬烘学究的无端羞辱。孤寂凄清的童年生活，在他稚嫩的心灵上投下了痛苦的阴影，养成他孤僻、敏感、内向的性格。幼年的经历对他的世界观和文学创作产生了深刻的影响。 1892年初，他去德国海德堡大学学习了一年。在那儿，他接触到德国哲学史家昆诺·费希尔的哲学思想和以易卜生为代表的新戏剧潮流。同年返回英国，在伦敦一家会计师事务所当了六个星期的练习生，随后即进伦敦圣托马斯医学院学医。为期五年的习医生涯，不仅使他有机会了解到底层人民的生活状况，而且使他学会用解剖刀一样冷峻、犀利的目光...(展开全部)","[英] 威廉·萨默塞特·毛姆",上海译文出版社,"The Moon and Sixpence",,2006-8,275,15.00元,平装,译文名著文库,9787532739547,55.8%,35.0%,8.3%,0.6%,0.2%
12,1,"2018-06-11 04:24:12",小说,1,"2018-06-11 04:24:12",文学,12,"2018-07-09 02:13:03","世界的凛冬 : 世纪三部曲 2",8.9,11796,"[英] 肯·福莱特 / 陈杰 / 江苏凤凰文艺出版社 / 2017-3-1 / 132.00（全三册）","我亲眼目睹，每一个迈向死亡的生命都在热烈地生长。 全球读者平均3个通宵读完的超级小说《巨人的陨落》的续篇！ 火遍全球的20世纪人类史诗“世纪三部曲”第二部。 美国《纽约时报》小说畅销榜第1名！ 加拿大书商协会畅销书排行榜第1名！ 德国小说类畅销书排行榜年度第1名！ 意大利小说类畅销排行榜年度第1名！ 西班牙《真理报》畅销书榜第1名！ 丹麦Bog & idé畅销书榜第1名！ 整个20世纪的吉光片羽，都被肯•福莱特写进了这部伟大的小说里。 一切都始于那个裂变中的大时代——希特勒上台，爱德华八世退位，原子弹在广岛和长崎爆炸……世界剧烈改变，我该怎么办？ 这正是他们的困惑——一群处于人生黄金时代的少男少女，来自德国、美国、英国、苏俄和威尔士的五大家族，他们父辈的命运因一战而彻底改变。如今，世界再次破碎，甚至更加暴烈和残酷。然而，这就是他们的时代！在时间的永恒...(展开全部)","肯•福莱特（Ken Follett，1949－） 现象级畅销小说大师，爱伦坡终身大师奖得主。 20部小说被译成33国语言，累计总销量超1.5亿册。 在欧美出版界，肯•福莱特这个名字就是畅销的保证。 1978年，出版了处女作《风暴岛》，并于次年获得爱伦坡奖，声名鹊起，专职写作。2013年，获得爱伦坡终身大师奖。 他的小说出版前，都会请历史学家审读书稿，绝不容许出现任何史实错误。 他说：“很多作家只写能取悦他们自己的东西，并模模糊糊地希望这也能取悦别人。但我每写一页都在清醒地思考：读者会怎么想？读者觉得这真的会发生吗？读者关心这些吗？读者想要知道接下来会发生什么吗？我敬佩那些用文字和新奇结构进行文学实验的作家，但我从不这么玩。”","[英] 肯·福莱特",江苏凤凰文艺出版社,"Winter of the World",陈杰,2017-3-1,1168,132.00（全三册）,平装,世纪三部曲,9787539999074,61.8%,30.1%,6.9%,0.9%,0.3%
13,1,"2018-06-11 04:24:12",小说,1,"2018-06-11 04:24:12",文学,13,"2018-07-09 02:13:06",活着,9.1,147968,"余华 / 南海出版公司 / 1998-5 / 12.00元","地主少爷福贵嗜赌成性，终于赌光了家业一贫如洗，穷困之中的福贵因为母亲生病前去求医，没想到半路上被国民党部队抓了壮丁，后被解放军所俘虏，回到家乡他才知道母亲已经去世，妻子家珍含辛茹苦带大了一双儿女，但女儿不幸变成了聋哑人，儿子机灵活泼…… 然而，真正的悲剧从此才开始渐次上演，每读一页，都让我们止不住泪湿双眼，因为生命里难得的温情将被一次次死亡撕扯得粉碎，只剩得老了的福贵伴随着一头老牛在阳光下回忆。",余华，浙江海盐人，1960年出生于浙江杭州，后来随父母迁居海盐县。中学毕业后，因父母是医生，余华曾当过牙医，五年后弃医从文，进入县文化馆和嘉兴文联，从此开始文学创作生涯。曾在北京鲁迅文学院与北师大中文系合办的研究生班深造，1984年开始发表小说。余华是中国先锋派小说的代表人物，与叶兆言、苏童等人齐名。作品有短篇小说集《十八岁出门远行》、《世事如烟》，长篇小说《在细雨中呼喊》、《战栗》及《兄弟》。,余华,南海出版公司,,,1998-5,195,12.00元,平装,余华作品,9787544210966,65.1%,29.1%,5.3%,0.3%,0.2%
14,1,"2018-06-11 04:24:12",小说,1,"2018-06-11 04:24:12",文学,14,"2018-07-09 02:13:08",1984,9.3,47777,"[英] 乔治·奥威尔 / 刘绍铭 / 北京十月文艺出版社 / 2010-4-1 / 28.00","★村上春树以《1Q84》向本书致敬 ★著名学者刘绍铭经典译本内地首次出版 ★62种文字风靡110个国家，全球销量超过5000万册 ★《时代周刊》“最好的100本英语小说” ★兰登书屋“100本20世纪最佳英语小说” ★入选英美中学生必读书书目 1936年以来，我所写的每 一部严肃作品，都是直接或间接地反对极权主义，支持我所理解的民主社会主义。 ——乔治•奥威尔（《我为何写作》） 《1984》是一部杰出的政治寓言小说，也是一部幻想小说。作品刻画了人类在极权主义社会的生存状态，有若一个永不褪色的警示标签，警醒世人提防这种预想中的黑暗成为现实。历经几十年，其生命力益显强大，被誉为20世纪影响最为深远的文学经典之一。","乔治•奥威尔（1903-1950）， 英国著名作家。主要作品有《动物农场》、《1984》等。 1903年出生于印度，1907年举家迁回英国，后因经济原因无力深造，被迫远走缅甸，参加帝国警察部队。终因厌倦殖民行径、痴迷写作而辞去公职，辗转回到欧洲，流亡伦敦、巴黎等地，一边深刻体验下层民众生活，一遍从事文学创作，有多部作品出版。1936年西班牙内战爆发，参加左翼组织，因重伤返回英国，但最终树立社会主义信念。1939年，二战爆发，积极参加反纳粹的活动。由于西班牙内战与二战的苦痛经历，对战争与和平、极权与民主、社会关怀与人类理想进行了深刻的思考。 1945年，著名的政治寓言小说《动物农场》出版。1949年，《1984...(展开全部)","[英] 乔治·奥威尔",北京十月文艺出版社,"Nineteen Eighty-Four",,2010-4-1,304,28.00,精装,新经典文库·桂冠文丛,9787530210291,70.8%,24.9%,3.9%,0.3%,0.1%
15,1,"2018-06-11 04:24:12",小说,1,"2018-06-11 04:24:12",文学,15,"2018-07-09 02:13:09",杀死一只知更鸟,9.2,19847,"[美] 哈珀·李 / 高红梅 / 译林出版社 / 2012-9 / 32.00元","成长总是个让人烦恼的命题。成长有时会很缓慢，如小溪般唱着叮咚的歌曲趟过，有时却如此突如其来，如暴雨般劈头盖脸……三个孩子因为小镇上的几桩冤案经历了猝不及防的成长——痛苦与迷惑，悲伤与愤怒，也有温情与感动。这是爱与真知的成长经典。 《杀死一只知更鸟》获1961年普利策奖。 美国图书馆借阅率最高的书，英国青少年最喜爱的小说之一。 美国中学推荐课外读物。 由小说改编的电影获第25届奥斯卡三项大奖。 美国电影协会评选的“100名银幕英雄与恶人”中，派克主演的芬奇律师名列英雄第一位。 作为史上最受喜爱的小说之一，《杀死一只知更鸟》已获得显赫声誉。它赢得过普利策奖，被翻译成四十多种语言，在世界范围内售出超过三千万册，并曾被拍成，备受欢迎的电影。 ——哈珀•柯林斯出版集团 斯塔尔六月对北卡罗来纳州律师协会发表演说时，自比为《杀死一只知更鸟》中勇敢的南方白人律师阿蒂...(展开全部)","哈珀•李（1926— ） 生于美国阿拉巴马州， 曾被授予普利策小说奖及其他众多文学奖项。她与杜鲁门•卡坡蒂是幼年的邻居和一生的朋友。《杀死一只知更鸟》据说是以卡坡蒂为原型之一创作的，现已成为公认的美国文学经典。此后，她一直隐居在家乡亚拉巴马的小镇上 ，拒绝各种采访，过着平静的生活。有人问她为什么不在盛名之下接着写作，她回答：“有过这样一次，还有什么可写的？”","[美] 哈珀·李",译林出版社,"To Kill a Mocking Bird",高红梅,2012-9,346,32.00元,精装,译林纪念版,9787544722766,68.9%,26.4%,4.3%,0.3%,0.1%
16,1,"2018-06-11 04:24:12",小说,1,"2018-06-11 04:24:12",文学,16,"2018-07-09 02:13:13",围城,8.9,200622,"钱锺书 / 人民文学出版社 / 1991-2 / 19.00","《围城》是钱钟书所著的长篇小说。第一版于1947年由上海晨光出版公司出版。1949年之后，由于政治等方面的原因，本书长期无法在中国大陆和台湾重印，仅在香港出现过盗印本。1980年由作者重新修订之后，在中国大陆地区由人民文学出版社刊印。此后作者又曾小幅修改过几次。《围城》 自从出版以来，就受到许多人的推崇。由于1949年后长期无法重印，这本书逐渐淡出人们的视野。1960年代，旅美汉学家夏志清在《中国现代小说史》(A History of Modern Chinese Fiction)中对本书作出很高的评价，这才重新引起人们对它的关注。人们对它的评价一般集中在两方面，幽默的语言和对生活深刻的观察。从1990年代开始，也有人提出对本书的不同看法，认为这是一部被“拔高”的小说，并不是一部出色的作品。很多人认为这是一部幽默作品。除了各具特色的人物语言之外，作者...(展开全部)","钱钟书(1910－1998)，字哲良，默存，号槐聚，中国江苏无锡人，中国近代著名作家、 文学研究家。毕业于清华大学外文系，获文学学士，赴上海，到光华大学任教。后考取第三届(1935年)庚子赔款公费留学资格，名列榜首，留学英国牛津大学 埃克塞特学院。大学毕业后任教于多所高校。新中国成立后被评为一级教授。晚年就职于中国社会科学院，任副院长。其夫人杨绛也是著名作家，育有一女钱媛(1937年-1997年)。曾为《毛泽东选集》英文版翻译小组成员。1998年逝世，享年88岁。",钱钟书,人民文学出版社,,,1991-2,359,19.00,平装,,9787020024759,55.3%,35.8%,8.4%,0.4%,0.2%
17,1,"2018-06-11 04:24:12",小说,1,"2018-06-11 04:24:12",文学,17,"2018-07-09 02:13:17",斯通纳,8.8,16538,"[美] 约翰·威廉斯 / 杨向荣 / 世纪文景/上海人民出版社 / 2016-1 / 39.00元","《斯通纳》讲述了生命中最重要的部分：爱，认同，怜悯，志业，傲骨，信任与死亡。 一个勇者有过的失败不失意的人生：即使不能拥有完美的生活，所幸追求过完整的自我。 美国，密苏里州。来自偏远农场的农家子弟、19岁的威廉·斯通纳进入州立密苏里大学学习农学。自一堂选修文学课为起点， 他的一生就此悄然改变。未来的斯通纳成为了一名大学老师，结婚、生子、教学、退休、衰老、死亡。在他生命的尽头，或许他可以坦然面对这个问题：你的一生，还要期望别的什么吗？ 一部蕴含着真诚、激情与紧凑力量的小说，探究了历史洪流所忽视的人性之间的冲突、溃败与幸存，重新唤起思考每个个体独特存在的意义。作者约翰·威廉斯向世人展示了凡人中的勇者在如何生活。 ---------------------------------------- 威廉斯的写作显得澄澈、节制却准确。就像被打磨光滑的橡木上反射出...(展开全部)","约翰·威廉斯（John Edward Williams, 1922—1994），美国作家，诗人，学者。辍过学，当过电台播音，从过军。退役后入大学就读并获博士学位。 于1945年-1985年间在母校丹佛大学任教，教授大学英语及创意写作。曾编辑出版学术文集《文艺复兴时期的英语诗歌》，也创作过两本诗集。 一生只写了四部小说：《惟有黑夜》（1948）、《屠夫十字镇》（1960）、《斯通纳》（1965）、《奥古斯都》（1973，本书当年获得美国国家图书奖）。 对约翰·威廉斯的写作，英国作家朱利安·巴恩斯评论：“当我称之为‘绝佳’，我的意思是它们（《屠夫十字镇》《斯通纳》）已经超越了各自类型范围内的评价标准。”","[美] 约翰·威廉斯",世纪文景/上海人民出版社,Stoner,杨向荣,2016-1,336,39.00元,精装,约翰·威廉斯作品,9787208130500,51.7%,38.9%,8.6%,0.7%,0.2%
18,1,"2018-06-11 04:24:12",小说,1,"2018-06-11 04:24:12",文学,18,"2018-07-09 02:13:21",囚鸟,8.0,1916,"[美] 库尔特·冯内古特 / 董乐山 / 百花洲文艺出版社 / 2017-6 / 38.00元","我们都是受困于时代的“囚鸟”——既渴望逃离，又踟蹰不前。 联邦最低限度安保措施成人改造所里，颓唐的小老头儿瓦尔特•斯代布克正在等待领他出狱的狱卒。 在他过去的人生中，他曾是斯拉夫移民的儿子，哈佛大学毕业生，前共产党党员，前联邦政府官员，“水门事件”的涉案者…… 不久他还将获得一个新的身份，神秘的……","库尔特•冯内古特（Kurt Vonnegut，1922—2007），美国黑色幽默作家，美国黑色幽默文学的代表人物之一。代表作有《囚鸟》《五号屠宰场》《没有国家的人》。他的作品以喜剧形式表现悲剧内容，在灾难、荒诞、绝望面前发出笑声。这种“黑色幽默”风格始终是冯内古特小说创作的重要特质。2007年4月11日，于曼哈顿因病逝世。 译者简介 董乐山，1946年毕业于上海圣约翰大学英国文学系，长期从事新闻、翻译、教学和研究工作。中国作家协会会员、中国笔会中心会员、中国美国文学研究会常务理事、中国翻译工作者协会理事、中国三S研究会副会长。主要译作有《第三帝国的兴亡》《西行漫记》《美国梦》《囚鸟》《一九八四》等，并编有《美国社会知识辞典》，以及论述翻译的著作《译余废墨》。他创作的小说《傅正业教授的颠倒世界》曾译载于美国著名文艺刊物《巴黎评论》。","[美] 库尔特·冯内古特",百花洲文艺出版社,Jailbird,,2017-6,296,38.00元,平装,,9787550022348,44.4%,38.0%,14.4%,2.4%,0.9%
19,1,"2018-06-11 04:24:12",小说,1,"2018-06-11 04:24:12",文学,19,"2018-07-09 02:13:25",外婆的道歉信,8.0,7621,"[瑞典] 弗雷德里克·巴克曼 / 孟汇一 / 天津人民出版社 / 2017-5 / 42.00元","2016年瑞典年度作家 美国亚马逊作家排名No.1 版权售出40国 遍布欧美几乎每家书店 上市10个月 全球总销量突破150万册 出版后持续霸占《纽约时报》畅销榜50周至今 内容： 七岁的爱莎有个古怪又疯狂的外婆，会埋伏在雪堆里吓唬邻居，半夜从医院溜出来带着爱莎翻进动物园，在阳台上用彩弹枪射击推销员，基本上想干什么就干什么。这个四处惹麻烦的外婆却是爱莎唯一的朋友，也是她心中的超级英雄。不管什么情况下，外婆都会站在爱莎这一边，为了她去跟全世界拼命。 就算是超级英雄，也有失去超能力的一天。外婆不幸得了癌症去世，留给爱莎一项艰巨的任务——将外婆的道歉信送给她得罪过的九个邻居。收信人包括一只爱吃糖果的大狗，一个总在不停洗手的怪物，一个管东管西的烦人精和一个酗酒的心理医生。这一趟送信之旅让爱莎渐渐发现：外婆和邻居们的故事，比她听过的所有童话都更加精彩。 这是一...(展开全部)","[瑞典]弗雷德里克·巴克曼 1981年出生于瑞典赫尔辛堡，以撰写博客和专栏起家。某天他把自己和老爸在宜家吵架的过程写在博客上，妙趣横生的对话让他瞬间爆红，吸引众多网友到巴克曼的博客讨论和吐槽自己的家人。结果他灵机一动，以此创作出《一个叫欧维的男人决定去死》，开启了自己的畅销书作家之路。 《外婆的道歉信》是巴克曼的第二本小说，在世界各国都取得了巨大成功，巴克曼因此成为2016年瑞典年度作家。他对日常生活极具洞察力，作品风趣活泼，笔下的人物生动真实，让读者笑中带泪，感悟人生。 如今他和妻子及两个孩子居住在瑞典斯德哥尔摩。","[瑞典] 弗雷德里克·巴克曼",天津人民出版社,"Min mormor hälsar och säger förlåt",孟汇一,2017-5,352,42.00元,平装,,9787201116693,40.7%,36.7%,18.1%,3.5%,1.0%
20,1,"2018-06-11 04:24:12",小说,1,"2018-06-11 04:24:12",文学,20,"2018-07-09 02:13:26",平凡的世界（全三部）,9.0,109006,"路遥 / 人民文学出版社 / 2005-1 / 64.00元",《平凡的世界》是一部现实主义小说，也是一部小说形式的家族史。作者浓缩了中国西北农村的历史变迁过程，在小说中全景式地表现了中国当代城乡的社会生活。在近十年的广阔背景下，通过复杂的矛盾纠葛，刻划社会各阶层众多普通人的形象。劳动与爱情，挫折与追求，痛苦与欢乐，日常生活与巨大社会冲突，纷繁地交织在一起，深刻地展示了普通人在大时代历史进程中所走过的艰难曲折的道路。,路遥（1949年—1992年），陕西清涧人。1973年入延安大学中文系学习。1976年大学毕业后，先后在《陕西文艺》和《延河》杂志做编辑工作。1978年开始发表作品。著有长篇小说《平凡的世界》，中篇小说《惊心动魄的一幕》《人生》等。曾任陕西省作家协会副主席。,路遥,人民文学出版社,,,2005-1,1631,64.00元,平装,茅盾文学奖获奖作品全集,9787020049295,63.4%,27.9%,7.2%,1.0%,0.5%
944,1,"2018-06-11 04:24:12",小说,1,"2018-06-11 04:24:12",文学,23,"2018-07-09 02:13:28",1984,9.3,47778,"[英] 乔治·奥威尔 / 刘绍铭 / 北京十月文艺出版社 / 2010-4-1 / 28.00","★村上春树以《1Q84》向本书致敬 ★著名学者刘绍铭经典译本内地首次出版 ★62种文字风靡110个国家，全球销量超过5000万册 ★《时代周刊》“最好的100本英语小说” ★兰登书屋“100本20世纪最佳英语小说” ★入选英美中学生必读书书目 1936年以来，我所写的每 一部严肃作品，都是直接或间接地反对极权主义，支持我所理解的民主社会主义。 ——乔治•奥威尔（《我为何写作》） 《1984》是一部杰出的政治寓言小说，也是一部幻想小说。作品刻画了人类在极权主义社会的生存状态，有若一个永不褪色的警示标签，警醒世人提防这种预想中的黑暗成为现实。历经几十年，其生命力益显强大，被誉为20世纪影响最为深远的文学经典之一。","乔治•奥威尔（1903-1950）， 英国著名作家。主要作品有《动物农场》、《1984》等。 1903年出生于印度，1907年举家迁回英国，后因经济原因无力深造，被迫远走缅甸，参加帝国警察部队。终因厌倦殖民行径、痴迷写作而辞去公职，辗转回到欧洲，流亡伦敦、巴黎等地，一边深刻体验下层民众生活，一遍从事文学创作，有多部作品出版。1936年西班牙内战爆发，参加左翼组织，因重伤返回英国，但最终树立社会主义信念。1939年，二战爆发，积极参加反纳粹的活动。由于西班牙内战与二战的苦痛经历，对战争与和平、极权与民主、社会关怀与人类理想进行了深刻的思考。 1945年，著名的政治寓言小说《动物农场》出版。1949年，《1984...(展开全部)","[英] 乔治·奥威尔",北京十月文艺出版社,"Nineteen Eighty-Four",,2010-4-1,304,28.00,精装,新经典文库·桂冠文丛,9787530210291,70.8%,24.9%,3.9%,0.3%,0.1%
1021,1,"2018-06-11 04:24:12",小说,1,"2018-06-11 04:24:12",文学,37,"2018-07-09 02:13:36",飘,9.3,83346,"[美国] 玛格丽特·米切尔 / 李美华 / 译林出版社 / 2000-9 / 40.00元","小说中的故事发生在1861年美国南北战争前夕。生活在南方的少女郝思嘉从小深受南方文化传统的熏陶，可在她的血液里却流淌着野性的叛逆因素。随着战火的蔓廷和生活环境的恶化，郝思嘉的叛逆个性越来越丰满，越鲜明，在一系列的的挫折中她改造了自我，改变了个人甚至整个家族的命运，成为时代时势造就的新女性的形象。 作品在描绘人物生活与爱情的同时，勾勒出南北双方在政治，经济，文化各个层次的异同，具有浓厚的史诗风格，堪称美国历史转折时期的真实写照，同时也成为历久不衰的爱情经典。","米切尔（Margaret Mitchell, 1900-1949）美国女作家。出生于美国南部佐治亚州亚特兰大市。父亲是个律师，曾任亚特兰大历史协会主席。米切尔曾就读于华盛顿神学院、马萨诸塞州的史密斯学院。其后，她曾担任地方报纸《亚特兰大报》的记者。1925年与约翰·马尔什结婚，婚后辞去报职，潜心写作。 米切尔一生中只发表了《飘》这部长篇巨著。她从1926年开始着力创作《飘》，10 年之后，作品问世，一出版就引起了强烈的反响。 由于家庭的熏陶，米切尔对美国历史，特别是南北战争时期美国南方的历史产生了浓厚的兴趣。她在家乡听闻了大量有关内战和战后重建时期的种种轶事和传闻，接触并阅读了大量有关内战的书籍。她自幼在南部城市亚特兰大成长，耳濡目染了美国南方的风土人情，这里的自然环境和社会环境成了米切尔文思纵横驰骋的背景和创作的源泉。","[美] 玛格丽特·米切尔",译林出版社,"Gone with the Wind",李美华,2000-9,1235,40.00元,精装,,9787806570920,69.1%,24.9%,5.0%,0.5%,0.4%
971,1,"2018-06-11 04:24:12",小说,1,"2018-06-11 04:24:12",文学,39,"2018-07-09 02:13:47","我的天才女友 : 那不勒斯四部曲-01",8.4,10203,"[意] 埃莱娜·费兰特 / 陈英 / 人民文学出版社 / 2017-1 / 42.00元","只有你身为女人才会知道这些丑陋的秘密 两个女人，50年的友谊和战争 过去五年，几乎所有欧美读者都在谈论她、 全球畅销百万册 被翻译成40种语言 《金融时报》2015年度女性 2016《时代》周刊“世界最有影响力的100人” 希拉里·克林顿、 乔纳森·弗兰岑、詹姆斯·伍德、詹姆斯·弗兰科都是她的粉丝 ---------------------- 《我的天才女友》是埃莱娜·费兰特“那不勒斯四部曲”的第一部，讲述了两个女主人公莉拉和埃莱娜的少女时代。故事一开始，已经功成名就的埃莱娜接到莉拉儿子里诺的电话，说他母亲彻底消失了。埃莱娜想起莉拉对自己命运的预言，于是她写下她们一生的故事…… 莉拉和埃莱娜一起成长于那不勒斯一个破败的社区，从小形影不离，彼此信赖，但又都视对方为自己隐秘的镜子，暗暗角力。 莉拉聪明，漂亮。她可以毫不畏惧地和欺凌自己的男生对质，也可以去...(展开全部)","埃莱娜·费兰特，目前意大利最受欢迎也最神秘的作家。埃莱娜·费兰特是一个笔名，其真实身份至今是谜。 埃莱娜·费兰特1992年发表第一部长篇小说《讨厌的爱》，很快引起关注，1995年就被意大利导演马里奥·马尔托内拍摄为同名影片；此后她相继出版小说《被抛弃的日子》(2002) 、《迷失的女儿》（2006）、《夜晚的沙滩》（2007）和散文、访谈集《不确定的碎片》（2003）。 2011年至2014年，埃莱娜·费兰特以每年一本的频率出版《我的天才女友》《新名字的故事》《离开的，留下的》和《失踪的孩子》这四部情节相关的小说，被称为“那不勒斯四部曲”。它们以史诗般的体例，描述了两个在那不勒斯穷困社区出生的女孩持续半个世纪的友谊。 “那不勒斯四部曲”也在世界范围内掀起了“费兰特热”，千万读者为书中对女性友谊极度真实、尖锐、毫不粉饰的描述所打动。虽然作者从未公开其性...(展开全部)","[意] 埃莱娜·费兰特",人民文学出版社,"L'amica geniale",陈英,2017-1,330,42.00元,平装,那不勒斯四部曲,9787020120130,39.1%,45.8%,13.6%,1.3%,0.3%
974,1,"2018-06-11 04:24:12",小说,1,"2018-06-11 04:24:12",文学,40,"2018-07-09 02:13:51",局外人,9.0,38495,"[法] 阿尔贝·加缪 / 柳鸣九 / 上海译文出版社 / 2010-9 / 22.00元",《局外人》是加缪小说的成名作和代表作之一，堪称20世纪整个西方文坛最具有划时代意义最著名小说之一，“局外人”也由此成为整个西方文学-哲学中最经典的人物形象和最重要的关键词之一。,"阿尔贝·加缪（Albert Camus，1913—1960），法国声名卓著的小说家、散文家和剧作家，“存在主义”文学的大师。1957年因“热情而冷静地阐明了当代向人类良知提出的种种问题”而获诺贝尔文学奖，是有史以来最年轻的诺奖获奖作家之一。加缪在他的小说、戏剧、随笔和论著中深刻地揭示出人在异己的世界中的孤独、个人与自身的日益异化，以及罪恶和死亡的不可避免，但他在揭示出世界的荒诞的同时却并不绝望和颓丧，他主张要在荒诞中奋起反抗，在绝望中坚持真理和正义，他为世人指出了一条基督教和马克思主义以外的自由人道主义道路。他直面惨淡人生的勇气，他“知其不可而为之”的大无畏精神使他在第二次世界大战之后不仅在法国，而且在欧洲并最终在全世界成为他那一代人的代言人和下一代人的精神导师。","[法] 阿尔贝·加缪",上海译文出版社,L'Etranger,,2010-9,128,22.00元,精装,译文经典（精装本）,9787532751471,58.3%,34.3%,6.9%,0.4%,0.1%
976,1,"2018-06-11 04:24:12",小说,1,"2018-06-11 04:24:12",文学,52,"2018-07-09 02:13:54",步履不停,8.7,8372,"[日] 是枝裕和 / 郑有杰 / 北京联合出版公司 / 2017-5 / 36.80元","★电影大师是枝裕和亲自撰写，经典代表作原著小说 ★拿遍各大国际影展重要奖项，全球影迷热泪推荐！ ★绝无冷场的故事，比电影更幽微的人性暗涌；一茶一饭的淡香，触动每个家庭深潜的秘密 ★一些随口说出的约定还来不及实现，一些胸口小小的悸动被淡淡地忽略。人生就是不断地失去，时间终将带我们找到谅解的出口。 =================== 人生路上，步履不停，总有那么一点来不及。已经是夏末的季节了，院子里的紫薇花开得璀璨，黄斑蝶在山坡上翩然飞舞着。横山良多与妻儿一同返回位于湘南海边的老家。久违的横山一家人，每年只有在大哥纯平的忌日才会团聚。在沁凉的麦茶、红透的西瓜、母亲绝手的好料理炸玉米天妇罗，加上外卖的顶级寿司和鳗鱼饭之间，闲散地度过看似平凡的一天。然而他们细细分享品尝着的，却是欢笑背后隐隐的哀伤，小心翼翼的对话又忍不住的争执中，不经意触动的回忆以及深藏...(展开全部)","是枝裕和，日本当代电影大师，被誉为“小津安二郎的接班人”。1962年生人，早稻田大学文艺学科毕业后，加入TV Man Union拍摄纪录片，关注的题材多具社会关怀及人文主义色彩。1995年执导由宫本辉同名小说改编的《幻之光》，获得威尼斯电影节新导演及最佳摄影奖。2004年以真实事件改编电影《无人知晓》，14岁的柳乐优弥凭此片荣获戛纳电影节最佳男主角奖。 电影代表作有《步履不停》《幻之光》《无人知晓》《如父如子》《海街日记》等，著有随笔集《有如走路的速度》等，小说《步履不停》《比海更深》《奇迹》《如父如子》等。","[日] 是枝裕和",北京联合出版公司,歩いても、歩いても,郑有杰,2017-5,236,36.80元,平装,,9787550297685,46.3%,43.7%,9.5%,0.4%,0.1%
1120,1,"2018-06-11 04:24:12",小说,1,"2018-06-11 04:24:12",文学,56,"2018-07-09 02:13:56",红楼梦,9.6,131777,"[清] 曹雪芹 著、高鹗 续 / 人民文学出版社 / 1996-12 / 59.70元","《红楼梦》是一部百科全书式的长篇小说。以宝黛爱情悲剧为主线，以四大家族的荣辱兴衰为背景，描绘出18世纪中国封建社会的方方面面，以及封建专制下新兴资本主义民主思想的萌动。结构宏大、情节委婉、细节精致，人物形象栩栩如生，声口毕现，堪称中国古代小说中的经 典。 由红楼梦研究所校注、人民文学出版社出版的《红楼梦》以庚辰（1760）本《脂砚斋重评石头记》为底本，以甲戌（1754）本、已卯（1759）本、蒙古王府本、戚蓼生序本、舒元炜序本、郑振铎藏本、红楼梦稿本、列宁格勒藏本（俄藏本）、程甲本、程乙本等众多版本为参校本，是一个博采众长、非常适合大众阅读的本子；同时，对底本的重要修改，皆出校记，读者可因以了解《红楼梦》的不同版本状况。 红学所的校注本已印行二十五年，其间1994年曾做过一次修订，又十几年过去，2008年推出修订第三版，体现了新的校注成果和科研成果。...(展开全部)","曹雪芹,（？-1763，一作1764）清小说家。名霑，字梦阮，号雪芹、芹圃、芹溪。为满洲正白旗“包衣”人。自曾祖起，三代任江宁织造，其祖曹寅尤为康熙帝所信用。雍正初年，在统计阶级内部政治斗争牵连下，雪芹家受到重大打击，其父免职，产业被抄，遂随家迁居北京。他早年经历了一段封建大官僚地主家庭的繁华生活，后因家道衰落，趋于艰困。晚期居北京西郊，贫病而卒，年未及五十。性情高傲，嗜酒健谈。具有深厚的文化修养和卓越的艺术才能。他生活在我国已有资本主义生产萌芽的封建末世，在其后期又有机会接触到下层人民，因而对当时社会阶级斗争和思想斗争有较具体的感受，看到了统治阶级的腐朽凶残和内部的分崩离析。曾以十年时间，从事《石头记》（即《红楼梦》）的创作。书中通过一个贵族官僚大家庭的盛衰历史的描写，塑造了许多典型人物形象，对当时社会的黑暗腐败，进行了深刻的解剖和批判，并热情地歌...(展开全部)",,人民文学出版社,,,1996-12,1606,59.70元,平装,中国古典文学读本丛书,9787020002207,82.0%,14.2%,3.0%,0.4%,0.3%
1011,1,"2018-06-11 04:24:12",小说,1,"2018-06-11 04:24:12",文学,72,"2018-07-09 02:14:37",吃鲷鱼让我打嗝,8.0,2176,"[美] 杰西·艾森伯格 / 吴文忠 / 人民文学出版社 / 2017-4 / 49.00元","演员×剧作家×小说家、导演×制片×编剧 杰西•艾森伯格 首部短篇小说集、同名美剧拍摄中 《吃鲷鱼让我打嗝》是杰西•艾森伯格创作的首部短篇小说集。全书以“吃鲷鱼让我打嗝”系列开篇，后承“家人”、“历史”、“室友偷走了我的拉面” 系列、“约会”等八个部分。故事背景既有当代美国的各种实景，也有庞贝古城和“电话之父”贝尔的电话空间。既采用常规的短篇小说体，也大胆使用书信体、短信体、邮件体等多种形式。 作品中，人物个性和虚构场景融为一体，柔情和潜藏在滑稽幽默之后的悲情相互交织，极致诠释了艾森伯格式喜剧，探索了现代世界的疯狂与光怪陆离。 书中漫画由法国获奖插画师让•朱利安创作， “为巴黎祈福”是他的作品。 《今日美国》：杰西•艾森伯格在文坛的前途就跟他在影坛一样，不可限量。 《泰晤士报》：你还没听过杰西•艾森伯格这位有才华的年轻人？那快了！ 《周六夜现场》最年轻...(展开全部)","杰西•艾森伯格（Jesse Eisenberg，1983— ） 美国演员、剧作家和幽默小说家。 十六岁开始创作剧本，出版《亚松森》《修正主义者》《战利品》和《我们所有人的一隅》四部作品，前三部皆自编自演登陆剧院。长期为文学杂志《麦克斯韦尼》《纽约客》供稿。作品展现不俗的文学格调，是颇受赞誉的文学界新秀。 2011年，因饰演《社交网络》中Facebook创始人马克•扎克伯格一角，获金球奖和奥斯卡金像奖最佳男演员双料提名。此外，主演《惊天魔盗团》《爱在罗马》《咖啡公社》等电影，并携手安妮•海瑟薇为《里约大冒险》配音。","[美] 杰西·艾森伯格",人民文学出版社,"Bream Gives me Hiccups",吴文忠,2017-4,244,49.00元,精装,,9787020120963,32.9%,43.9%,20.9%,2.0%,0.3%
985,1,"2018-06-11 04:24:12",小说,1,"2018-06-11 04:24:12",文学,87,"2018-07-09 02:15:05",白鹿原,8.6,47348,"陈忠实 / 人民文学出版社 / 1997-12 / 28.00元",这是一部渭河平原五十年变迁的雄奇史诗，一轴中国农村班斓多彩、触目惊心的长幅画卷。主人公六娶六丧，神秘的序曲预示着不祥。一个家族两代子孙，为争夺白鹿原的统治代代争斗不已，上演了一幕幕惊心动魄的活剧：巧取风水地，恶施美人计，孝子为匪，亲翁杀媳，兄弟相煎，情人反目……大革命、日寇入侵、三年内战，白鹿原翻云覆雨，王旗变幻，家仇国恨交错缠结，冤冤相报代代不已……古老的土地在新生的阵痛中颤栗。厚重深邃的思想内容，复杂多变的人物性格，跌宕曲折的故事情节，绚丽多彩的风土人情，形成作品鲜明的艺术特色和令人震撼的真实感。,,陈忠实,人民文学出版社,,,1997-12,677,28.00元,平装,茅盾文学奖获奖书系,9787020026906,49.0%,39.8%,10.2%,0.8%,0.2%
986,1,"2018-06-11 04:24:12",小说,1,"2018-06-11 04:24:12",文学,88,"2018-07-09 02:15:07",繁花,8.8,11026,"金宇澄 / 上海文艺出版社 / 2013-3-1 / CNY 48.00","这是一部地域小说，人物的行走，可找到“有形”地图的对应。这也是一部记忆小说，六十年代的少年旧梦，辐射广泛，处处人间烟火的斑斓记忆，九十年代的声色犬马，是一场接一场的流水席，叙事在两个时空里频繁交替，传奇迭生，延伸了关于上海的“不一致”和错综复杂的局面，小心翼翼的嘲讽，咄咄逼人的漫画，暗藏上海的时尚与流行；昨日的遗漏，或是明天的启示……即使繁花零落，死神到来，一曲终了，人犹未散。 《繁花》让人为之一震，小说的好处自有高人评说----程永新 优雅之野心，当今几乎不可能出现的文体----张辛欣 近年来最有看头的小说---吴亮",金宇澄，生于上海，祖籍吴江黎里，著有中短篇集《迷夜》、随笔集《洗牌年代》，主编《城市地图》、《飘泊在红海洋——我的大串联》等。现任《上海文学》常务副主编。,金宇澄,上海文艺出版社,,,2013-3-1,444,"CNY 48.00",平装,,9787532148004,51.5%,35.8%,10.4%,1.7%,0.6%