jiudian_yongpin.id,jiudian_yongpin.ts,jiudian_yongpin.title,jiudian_yongpin.jiage,jiudian_yongpin.gongsi,jiudian_yongpin.dizhi,jiudian_yongpin.chanpin_shuoming,jiudian_yongpin.pinpai,jiudian_yongpin.xinghao,jiudian_yongpin.guige,jiudian_yongpin.danjia,jiudian_yongpin.qiding,jiudian_yongpin.gonghuo_zongliang,jiudian_yongpin.youxiaoqi,jiudian_yongpin.gengxin_shijian,jiudian_yongpin.liulan_cishu
201,"2018-08-24 02:02:59","深圳垃圾桶 双色套装垃圾桶",45.00/个50个起订,深圳明达酒店用品有限公司,广东省深圳,"名称：双色套装垃圾桶 重量：1.8（kg） 品牌：明达 贸易属性：内贸 箱装数量：12箱/个 产地：深圳市 型号：MD-005 规格：（￠）220×（H）270mm 材质：不锈钢/烤漆/红桃木 垃圾桶采用内桶与外桶相结合，当内桶配与不同颜色及尺寸略有大小的垃圾袋，只要把外筒往上一套，便把垃圾袋多余部分遮住，使其不会外露。内外桶均采用金属结构，既可达到防火标准，外桶又可根据酒店房间格调配与不同颜色。",明达,MD-005,（￠）220×（H）270mm,45.00元/个,"50 个","10000 个",长期有效,2014-04-10,355
202,"2018-08-24 02:03:03","酒店客房垃圾桶 款式多 品种齐全 可来图来样定做",15.00/个100个起订,广州知鑫意酒店用品厂,广东省佛山,"品牌：知鑫意 材质：不锈钢 规格：225*250mm 颜色：黑色 重量：1.5（kg） 产地：广州 箱装数量：12个 贸易属性：内贸 价格段：20-30元 表面处理:砂光/钛金/烤漆/皮革 尺寸：225*250 产品运输：公路货运 产品名称:ZXY-C301房间垃圾桶 此产品采用冷轧板冲压成型，表面经打磨，酸洗，磷化等工序后，喷漆、高温烘烤而成！双层实际使用方便、卫生且美观，应用范围广，经过特殊防锈处理、使用颜色持久，耐气候性强。 产品型号多样:请各位客户一一查看，如果您对产品的价格、材质、规格尺寸、产品图片、包装…..等有什么疑问请来电咨询或QQ咨询，我们将有专业的客服人员为您解答 温馨提示: 1.由于本品不只是网售，所以可能存在缺货的情况,在购买前请各位亲先联系了解一下实际情况再购买，以免双方造成不必要的误会。希望各位亲购物愉快。 2.运费问题：由于各位亲所在地理位置不 同和所购买的宝贝的重量和路程不一样，运费的价格不同，所以运费到付货运按实际费用来收取。这样亲 不会多支付一分运费。 3.质量保证，本厂所有商品模具流程化生产，产品经过质检 合格后出厂，各位亲请放心购买。本店产 品繁多, 由于精力有限，不能将店里所有商品一一上架，请见谅！亲欲购买产品如有疑问或其它问题需要询问时，请直接联系我。我会第一时间回复！亲收到货后请当场检验，如有质量问题请拒收退回调换，以免快 递人员走后造成调换不便，（一旦你签收就表示货物完好，如需调换则来回快递费由买家承担）谢谢各位 买家的理解与支持。",知鑫意,ZXY-C301,225*250mm,15.00元/个,"100 个","2000 个",长期有效,2018-06-21,320
203,"2018-08-24 02:03:05",皮革垃圾桶大号客厅厨房餐厅杂物收纳桶,38.80/个1个起订,深圳市美金源工艺品有限公司,广东省深圳,"产品尺寸:225*270*10L 产品颜色:黑色平纹 产品材质:优质PU皮革+不锈铁双层桶 产品用途:家中客厅.卧室跟公司大厅，会议室等也适用与酒店与KTY高档场所。 产品订制:可根据客户自行提供的尺寸，材质，及颜色 ，LOGO订做，样板费用另计，也可来样订做，快递费用自付，下单后样板的费用退回50%，价格商议。",美金源,001,225*270*10L,38.80元/个,"1 个","326 个",长期有效,2018-04-18,337
204,"2018-08-24 02:03:08",厂家促销不锈钢长方形纸巾盒/纸巾架/纸巾筒,1.00/件1件起订,新会会城科腾不锈钢制品有限公司,广东省江门,"公司主要生产及配套加工，不锈钢垃圾桶、不锈钢纸巾盒、不锈钢面包箱、不锈钢药箱、不锈钢化妆箱、不锈钢纸巾架、不锈钢酒杯、不锈钢卫浴、不锈钢马桶刷、不锈钢支架、不锈钢毛巾架、不锈钢餐具、不锈钢厨房用具、不锈钢锁匙箱、不锈钢卫浴架、不锈钢皂碟、不锈钢漱口杯、等不锈钢制品。产品美观大方、质量可靠、品种多、规格全、价格优。公司自成立以来深受客户赞许，先后与国内多家贸易公司建立了良好的合作关系，产品畅销世界各地。 经营范围：不锈钢垃圾桶、不锈钢纸巾盒、不锈钢面包箱、不锈钢药箱、不锈钢化妆箱、不锈钢纸巾架、不锈钢酒杯、不锈钢卫浴、不锈钢马桶刷、不锈钢支架、不锈钢毛巾架、不锈钢餐具、不锈钢厨房用具、不锈钢锁匙箱、不锈钢卫浴架、不锈钢皂碟、不锈钢漱口杯、等不锈钢制品。",,,,1.00元/件,"1 件","10000000 件",长期有效,2017-12-05,89
205,"2018-08-24 02:03:10",厂家直销酒店房间桶、垃圾桶阻燃塑料桶,5.00/个48个起订,佛山市南海区东就五金厂,广东省佛山,"佛山市南海区东就五金厂是一家生产五金制品的企业，是经国家相关部门批准注册的企业。主营客房烟灰桶、果皮箱、酒店银行商场用的伸缩带栏杆座等，公司位于中国广东佛山市南海区松岗镇。佛山市南海区东就五金厂本着“客户第一，诚信至上”的原则，与多家企业建立了长期的合作关系。热诚欢迎各界朋友前来参观、考察、洽谈业务。 佛山市南海区东就五金厂是一家生产五金制品的企业，是经国家相关部门批准注册的企业。主营客房烟灰桶、果皮箱、酒店银行商场用的伸缩带栏杆座等，公司位于中国广东佛山市南海区松岗镇。佛山市南海区东就五金厂本着“客户第一，诚信至上”的原则，与多家企业建立了长期的合作关系。热诚欢迎各界朋友前来参观、考察、洽谈业务。 佛山市南海区东就五金厂是一家生产五金制品的企业，是经国家相关部门批准注册的企业。主营客房烟灰桶、果皮箱、酒店银行商场用的伸缩带栏杆座等，公司位于中国广东佛山市南海区松岗镇。佛山市南海区东就五金厂本着“客户第一，诚信至上”的原则，与多家企业建立了长期的合作关系。热诚欢迎各界朋友前来参观、考察、洽谈业务。 佛山市南海区东就五金厂是一家生产五金制品的企业，是经国家相关部门批准注册的企业。主营客房烟灰桶、果皮箱、酒店银行商场用的伸缩带栏杆座等，公司位于中国广东佛山市南海区松岗镇。佛山市南海区东就五金厂本着“客户第一，诚信至上”的原则，与多家企业建立了长期的合作关系。热诚欢迎各界朋友前来参观、考察、洽谈业务。 佛山市南海区东就五金厂是一家生产五金制品的企业，是经国家相关部门批准注册的企业。主营客房烟灰桶、果皮箱、酒店银行商场用的伸缩带栏杆座等，公司位于中国广东佛山市南海区松岗镇。佛山市南海区东就五金厂本着“客户第一，诚信至上”的原则，与多家企业建立了长期的合作关系。热诚欢迎各界朋友前来参观、考察、洽谈业务。",东就,F1-F2,"225*255 225*260",5.00元/个,"48 个","99999 个",长期有效,2016-10-11,163
206,"2018-08-24 02:03:13",供应酒店垃圾桶,价格面议,广东佳永实业有限公司,广东省汕头,"广东佳永实业有限公司自1990年创建之日起，顺应着酒店用品行业的发展潮流，经过二十余年坚持不懈的拼搏，引进了国际先进的生产配套设备，致力于生产高档次酒店客房用品、航空旅游用品、礼品等各种产品。现已成功发展为汕头地区酒店客房用品行业领导者，在国内外具有影响力的优质生产企业。 公司采用国际标准的GMPC生产环境标准，配备注塑、吹瓶、丝印、化工、车缝等一体化生产车间。严格按照ISO9001：2008国际质量管理系统管理。以“专业化打造全球品牌”为发展目标，“以人为本，服务于人”始终是佳永的经营理念，我们深知人才是企业最重要的资产，只有一流的人才，才能创造一流的品质，打造一流的品牌，塑造一流的企业! 佳永公司将以国际化视野引领中国酒店用品的潮流，强势的营销精英为开路先锋！以健康成长的企业文化来稳固我们快速发展的步伐！以超越自我，走品牌战略来不断提升我们的核心竞争力!以诚实守信，学习创新来实现我们百年名企的发展愿景。 “追求完美，创造卓越”是我们的质量方针！将温暖和舒适送进客房，将体贴与惬意融入起居，让你的生活更美好是我们永远的祝福和目标！佳永的腾飞，将与你的梦想同步！你的旅行生活，将会因有佳永而更精彩！我们的品质，就是你的品牌！我们的专业，就是你的效益! 我们热忱欢迎世界各地的客商前来洽谈合作！ 只有佳产品，才能永合作！",,,,面议,"100 个","1000000 个",长期有效,2016-05-05,293
207,"2018-08-24 02:03:13",供应客房不锈钢垃圾桶,价格面议,广州麦斯金属制品厂,广东省广州,"圆形单层客房垃圾桶,出产价出售.不锈钢17元/个.烤漆10元/个.钛金的20元/个",,,1000,17.00元/,,,长期有效,2015-07-03,338
208,"2018-08-24 02:03:17",酒店客房丽格桶，客房垃圾桶，厂家直销垃圾桶,价格面议,佛山利宾酒店用品厂,广东省佛山,佛山利宾酒店用品厂是一家集设计、生产、销售为一体的专业酒店用品生产企业，具备强大的生产能力和严格的质检制度，并不断融合国内外的先进工艺及技术优势，为广大新老客户提供最优质的产品。企业以诚交往，以客房为中心，以诚合作打造共赢互利，急客户所急，想客户所想！我们在产品品质、价格、速度及服务等方面倾注全部力量，确保所提供的产品能为客户在其市场最具竞争优势。我们以”信誉至上，质量第一“为宗旨，树立”广纳客源，真诚合作“的经营理念。质量是企业生存的源泉，人才是企业的财富，成功的生产技术和先进的生产设备是提高产品质量的根本保证。以最专业的精神打造最好的品质，不断创新，关注未来，为社会创造新的生活方式。我们诚邀您携手共创美好明天！,佛山利宾酒店用品厂,,,面议,"10 件","1000 件",长期有效,2014-12-20,411
209,"2018-08-24 02:03:20",圆筒垃圾桶，金属垃圾桶，宾馆垃圾桶，酒店垃圾桶,价格面议,广州市胜忆酒店用品有限公司,广东省广州,"2008年诞生于珠江三角洲之北的中国南大门—广州胜忆酒店用品 有限公司，拥有着非凡的国际视野，并以其对世 面界酒店用品行业 的专业认知，锁定并拓开中国内地酒店用品运营 市场，并使得产品 欧、美、东南亚等世界各地。 历经多年酒店用品行业的磨练及洗礼，现如今广州胜忆酒店用品有 限公司已凭借优质的产品、一流的服务成为酒店行业的知名企业。 然而。这些并没有令胜忆止步于眼前，顺时势创立了“胜忆”品 牌，开创了公司“室内分类垃圾桶”新领域。 迄今，胜忆拥有5800 平方米标准厂房、拥有着高素质员工，以创新的设计理念、专业的 生产技术、优质的售后服务团队，旗下品牌“胜忆”已成为国内酒 店用品知名品牌，产品多达数千种，灵活运用了多元化的材质并应用于酒店及公共环境用品。 广州胜忆酒店用品有限公司以“创新，为客户创造价值”为理念，以“行业精品”为品质要求。全心打造自主品牌，让全球享有 优质的产品及一流的服务，实现“双赢”。",广州市胜忆酒店用品有限公司,,,面议,"10 个","1000 个",长期有效,2014-12-20,419
210,"2018-08-24 02:03:25",长期供应曾键电器科技公司生产酒店客房垃圾桶,价格面议,曾键电器科技有限公司,广东省顺德,"曾键电器科技公司生产的10L酒店客房不锈钢双层垃圾桶，远销国内外市场，获得了广大客户的好评，客房垃圾桶产品直径225mm，高度270mm​； 1 内桶，外桶 材料均采用0.4mm不锈钢201，磨砂雪花纹； 2 内桶材料采用阻燃pvc,外桶材料采用0.4mm不锈钢201，磨砂雪花纹； 曾键电器科技生产的酒店客房垃圾桶 ，采用激光无痕焊接技术，​不生锈，不漏水，环保无污染，酒店客房垃圾桶，底板安装了防撞胶圈和，使得产品不会擦伤地面陶瓷，客房垃圾桶顶部安装了不锈钢装饰圈​，美观大方，经久耐用！​客房垃圾桶采用了圆形的内外双层结构，使得产品坚固，客户套装的垃圾袋不会外露，给顾客留下舒适的感觉！ 曾键电器科技公司生产的客房垃圾桶适用于：酒店，宾馆，KTV，休闲中心，家居等场所 营销方式：批发（12个起批）",曾键科技,zjkj10L,225mm*270mm,面议,"8 个","2000 个",2018-12-01,2014-12-15,167
211,"2018-08-24 02:03:26",佛山厂家酒店客房垃圾桶、13升和14升化工桶,价格面议,福鑫环卫用品厂,广东省佛山,厂家批量直销高档酒店垃圾桶、13升化工桶、14升化工桶,,,,面议,,,长期有效,2014-12-03,203
212,"2018-08-24 02:03:28",罗定垃圾桶批发，罗定素龙垃圾桶生产，罗定垃圾桶批发价格,56.00/个1个起订,广州麦穗酒店清洁用品有限公司,广东省广州,"罗定垃圾桶批发，罗定素龙垃圾桶生产，罗定垃圾桶批发价格 本品采用国内最好1.0MM201不锈钢板，经过数控模具压形、冲压、抛光、焊接、成形等工序完成三分类垃圾桶，色泽亮丽、美观、大方，并具有防潮、防腐、防蛀、防锈、防紫外线、耐高温、易清理等特点。 广泛适用于酒店、酒店客房、酒楼、工厂、学校、公园、写字楼、办公楼、办公室、旅游区、社区、花园小区、医院、医务室、街道、人行道、走廊、广场、商场、机场、火车站、地铁站、客运站、车站等区域使用。",麦穗,P-K103,￠220*H270MM,56.00元/个,"1 个","688 个",长期有效,2014-11-28,291
213,"2018-08-24 02:03:32","供应椭圆客房双层客房桶 高端室内垃圾桶",价格面议,南和酒店用品综合公司,江西省,"1、 根据图片所展示的产品，对该产品进行品鉴。产品独有的特色、独特设计理念、优美的搭配效果、个性展现独特作用、产品做工精细、适合所有公共场所使用，自由构思设定，不必囿于以上所列。 2、 要对消费者具有购买引导性，具有购买的欲望、感染力，能对促进购买发挥极积作用。 3、 产品从各个角度品鉴，都会给人不同观看效果，产品放在任何装修条件下都不会降低产品的档次。 4、 本公司产品丰富、新品不断，不定期展开各类活动，均需品鉴能手参与，中标者如有意向可长期合作。",,,,面议,"50 个","10000 个",长期有效,2014-11-28,318
214,"2018-08-24 02:03:36",木制垃圾桶｜五星级酒店客房木制品|酒店客房木艺,价格面议,深圳市智合木业有限公司,广东省深圳,此款木制垃圾桶采用了进口水曲柳实木制作而成。木制垃圾桶油漆为本色。木制垃圾桶工艺为表面镶嵌了高光瓷片，在瓷片上还丝印上图案。木制垃圾桶雕刻中国风仿宋图案，海陵岛保利皇冠假日酒店就是采用了这套产品的风格设计！,智合木业,HK-006-ZHI,240*240*330,面议,"300 个","10000 个",长期有效,2014-11-10,203
215,"2018-08-24 02:03:41","供应不锈钢垃圾桶 不锈钢垃圾架",价格面议,天津市永恒中天不锈钢制品有限公司,天津,"不锈钢垃圾桶，天津不锈钢垃圾桶，北京不锈钢垃圾桶，主要以生产不锈钢制品、铝制品和碳钢制品，药机配件、机械加工，生产技术雄厚，生产科研逐年上水平，形成永恒不锈钢产品的系列化，有不锈钢罐类、桶类、各种车辆工作台、操作台、洗刷槽、鞋柜、更衣柜，各种规格的粉针盘（不锈钢、铝），可按客户要求制作各种不锈钢非标产品，是制药机、食品、化工、轻工事业、宾馆、饭店等以及装饰工程、市政设施。是各行业的理想选择。还有异型产品制造的专业技术人员，属于本地段知名的企业，具有产品新、信誉好的特点。 天津市永恒中天不锈钢制品有限公司的宗旨是：“信誉第一，用户至上”。欢迎新老客户来电来函洽谈业务！我们愿与社会各界朋友携手共创美好明天! 不锈钢垃圾桶，垃圾桶，深圳不锈钢垃圾桶，不锈钢脚踏式垃圾桶",,,6000,360.00元/,,,长期有效,2014-08-18,306
216,"2018-08-24 02:03:45","酒店用品 HT144环保分类垃圾桶",价格面议,广州华瑞不锈钢制品有限公司,广东省广州,"十五年前，南国春风，“华瑞酒店用品制造”横空出世莽昆仑。十五年磨砺，十五年锻造，从小厂到行业领袖，源于对品质的追求，也孕育了华瑞强烈的社会责任感。 忆往昔，峥嵘岁月；看今朝，重担在肩。信息时代，瞬息万变，唯与时俱进，勇推陈，敢创新，依靠高新技术和优秀人才，华瑞的品牌之路方才无限长兴。 承千秋商贾信行于五洲，立百代辉煌诚扬于四海。过去，华瑞深谙行业之神韵，强品质，精管理；现在，华瑞乘业内之美誉，获美国、欧盟、中东等国外多家五星酒店垂青，确立企业新目标：雄心铸造。 行业内的国际化品牌！我们奋斗着，我们坚持着，并期待与您——共成长，同兴旺，同创造，共分享！ 长风破浪会有时，直挂云帆济沧海。让我们一起翱翔，一起远航，为梦想加冕！ Fifteen years ago, Guangzhou Hua Rui Stainless Steel Products Co., Ltd was set up in South China. With fifteen years' sharpening and forging, our company is growing up to be the industry leader from small plant. We pursue high quality, and also have strong sense of social responsibility. In the past, we worked hard. In the future, we will make great effort. In the information age, everything is constantly changing. Only we innovate and depend on high technology and talents, we can have a bright future. Running business must have the integrity. And honesty can make the enterprise's brilliant and famous. In the past, our company emphasized on high quality and fine management. Now, we have won the reputation from five-star hotels in USA, European countries, Middle-East countries. Our new target: ambition casting. International brand within the industry! We fight, we persist, and look forward to working with you, growing with you, creating with you, and share with you! When you hoist the sails to cross the sea, you will ride the winds and cleave the waves. Let's fly together, for the dream of the coronation! 适合各种公共场所，如街道，公园，医院，花园等等... HT144环保分类垃圾桶 size:580*380*1100mm 【商品运输】 通过物流运输，卖方负责将货发到买家所在的城市，货物自提，运费提付。 【联系方式】 联系电话：020-36689112\手机:15920555571 传 真：020-36689182 http://gzhuaxiongbxg.cn.alibaba.com/ http://huarui880.cn/ http://华瑞不锈钢.cn/ http://gzhuaxiongbxg9889.com/",,HT144环保分类垃圾桶,580*380*1100mm,面议,,,长期有效,2014-06-25,471
217,"2018-08-24 02:03:48","A07 厂家直销皮制首饰盒，珠宝盒，包装盒，酒盒，礼品盒",86.00/个10个起订,深圳市索拉里科技有限公司,广东省深圳,"A07 厂家直销皮制首饰盒，珠宝盒，包装盒，酒盒，礼品盒 深圳市索拉里科技有限公司，是以集设计、生产、营销、服务为一体的专业现代化星级酒店皮具及高档商务皮具制作厂家，公司成立以来，一直把产品质量视为本厂生存立足之本，不断改进和创新生产工艺，掌握先进的生产技术，致力于国内外所有星级酒店皮具生产制作。 主要产品有：星级酒店客房皮具制品、商务酒店专用皮具套装、各种精美高档的皮制首饰盒，珠宝盒。如：皮质洗衣夹石英钟、抽屉式易耗品盒、皮质服务指、，皮质纸巾盒、垃圾桶、鞋框、鞋篮、托盘、毛巾框、遥控器套、遥控器座、杯垫、皮质收银夹、酒水单夹、冰桶、食品架、相框、洗衣单架、便签本、茶包盒、书报架、包装盒，酒盒，礼品盒，化妆包，女士钱包，小零钱包，化妆箱、鞋盒、皮带盒、礼品盒、化妆盒、珠宝首饰盒、笔盒、纸巾盒、红酒盒、香水盒、衣物盒、等各类产品的包装盒。 我们有专业的设计部门，可按您的要求或者来图来样设计、制作、生产，并能在产品上压印原色、烫金、烫银、丝印、刺绣客户的logo。 我们致力于打造更专业的皮质包装，不断的推出新产品，新款式，品质保证，时尚百搭，欢迎新老顾客来电来函咨询！",Solynee索拉里,A07,,86.00元/个,"10 个","100000 个",长期有效,2014-06-17,196
218,"2018-08-24 02:03:48",客房精美垃圾桶，皮质垃圾桶,价格面议,佛山和兴酒店用品厂,广东省佛山,佛山市和兴酒店用品厂是佛山市第一家以生产客房垃圾桶，丽格桶，大理石垃圾桶为主，配套其它酒店用品的专业性厂家，以优质的产品，优惠的价格，诚信的服务为宗旨。为酒店用品市场创造财富，深受业界人士的好评，是值得顾客信赖的合作伙伴。诚心的希望各界朋友、顾客来电洽谈。,佛山和兴酒店用品厂,,,面议,"10 件","1000 件",长期有效,2014-06-12,528
219,"2018-08-24 02:03:49","方形8L客房桶 阻燃垃圾桶 包皮垃圾桶 酒店宾馆垃圾桶",价格面议,佛山市南海区山盛五鑫模具厂,广东省佛山,"名称：豪华塑料阻燃方桶 材质：塑料pp 尺寸: 240*155*285MM 容量：8L 颜色：杏、灰、黑； 描述：采用顶级原材料,产品无毒无味，材质坚固，耐酸碱，防霉变、阻燃抗撞，不易破裂与凹陷； 圆角设计增加强度与耐久性；可循环利用。防刮花表面容易清洗，符合国际环卫设备发展趋势。 产品特点：轻巧方便、外型美观、经久耐用、利于环保。 用途：广泛适用于酒店宾馆、商业楼宇、医院、家居、KTV等各种场所。 量大：价格可再谈。",山盛,C-135,235*160*285,面议,"20 个","9999 个",2014-11-24,2014-05-27,0
220,"2018-08-24 02:03:54",客房用圆筒垃圾桶,价格面议,佛山市宝艺酒店用品厂,广东省佛山,"佛山市宝艺酒店用品厂凭着精湛的技术和过硬的质量在同行中脱颖而出，成为酒店用品行业中明星供应商，自创立以业，一直秉承以人为本，和谐发展的理念为酒店用品家居行业开发更多的产品服务大众、以质量求生存，以信誉求发展，做好每一样产品、服务好每一位客户是我们一直以来的宗旨。 佛山市宝艺酒店用品厂专业经营生产批发各种五金不锈钢制品，主要产品有：酒店用品、一米线栏杆座、广告牌指示牌、酒店行李车服务车、布草车清洁车、雨伞架伞袋机、座地烟灰桶垃圾桶、户外垃圾桶、木质垃圾桶、不锈钢垃圾桶、报刊架资料架、行李架衣架、演讲台、酒水车、灯箱、折床、等各类五金不锈钢制品、适用于各酒店、学校、百货商场、办公楼、地铁、车站、花园小区、户外公共场所、政府机构！诚邀全国各地经销商加盟合作、欢迎来图来样订做，热诚欢迎社会各界人士来我公司指导、经销合作！",宝艺酒店用品厂,,,面议,"10 件","1000 件",长期有效,2014-03-26,138
221,"2018-08-24 02:03:55",供应厂家直销保险柜，深圳保险柜，办公保险柜，家用保险柜,价格面议,泽之明智能科技有限公司,广东省深圳,"厂家直销保险柜，深圳保险柜价格，办公保险柜，家用保险柜 型号： 虎牌QBG-D-60电子保险柜 尺寸：670*420*360mm（高*宽*厚） 颜色： 深蓝/乳白 门厚： 13cm 板厚： 25cm 附件： 活动隔板、抽屉或小门、报警器、钥匙、说明书、保修卡 配置： 固定孔、滚轮组、机械/电子/触摸屏密码锁面板 安全参数：密码组3 安全性能：防火防盗电子报警 认证资质：公安部认证 适用对象：通用",,,,面议,,,长期有效,2017-08-21,334
222,"2018-08-24 02:03:57","【浴垫】无异味浴垫 品牌 厂家",98.00/10050100起订,杭州欧萨科技有限公司,浙江省杭州,"① 不含PVC，无毒无气味；② 强力大吸盘，超强防滑；③ 不发霉，经久耐用；④ 质感柔软，可机洗。","VOFU/沃尔夫品牌: VOFU/沃尔夫材质: 其他/other清洗类型: 可手洗 可机洗货号: VB-R5适用场景: 家用颜色分类: 白色地垫售卖方式: 成品地毯（元/块）地垫适用空间: 卫浴图案:",vb-r6,"38x57cm 38x80cm",98.00元/100,"50 100","1000 100",长期有效,2016-04-22,113
223,"2018-08-24 02:03:58",给你一个舒适的家——防滑垫,价格面议,扬州洪福酒店用品厂,江苏省扬州,"专业订制宾馆酒店全套用品 本店有自己的加工厂，全部胚布加工，绝对最低价，质量保证。 本店供应以下产品： 1、套件系列：三公分缎条全棉套件、提花套件（水波纹、牵牛花、羽毛花）、印花套件（如巧克力棒、图章花等） 2、芯类：高弹棉枕芯、仿羽布羽丝绒枕芯、保健枕、九孔棉被芯、羽丝绒被芯等 3、垫类：席梦思保护垫、带边床垫（床笠式） 4、装饰类：床尾巾、床旗、床裙、靠垫等 我们的优势： （1）我们专业从事宾馆酒店床品加工数年，积累了很多的床品生产的丰富经验，在产品的质量和交期上能给我们客户最大的保障 （2）我们抓紧质量的同时始终不放弃对成本的控制，特别是对各供应商的质量和价格更是关注，力求给我们的客户创最高的价值。 我们的目标客户：国内外的各种宾馆酒店经销商，终端客户",自主品牌,,"120*200 150*200 180*200 200*200",面议,"1 条","1000 条",长期有效,2016-04-18,85
224,"2018-08-24 02:04:00","酒店浴室浴缸垫 浴室防滑垫 pvc发泡浴缸垫 品牌",价格面议,杭州欧萨酒店设备有限公司,浙江省杭州,"酒店专用进口橡胶防滑垫 » 台湾进口, 天然橡胶, 超韧性 » 超多吸盘, 背面布满161个强力吸盘 » 非PVC 环保无毒无味 可以机洗 » 尺寸 380*800mm, 加长型，适合浴缸使用",VOFU,VB-R5,38*57cm,面议,"1 张","10000 张",长期有效,2016-03-02,102
225,"2018-08-24 02:04:01","疏水防滑垫 排水橡胶垫 酒店防滑垫 酒店安全地垫",40.00/块50块起订,丽安防护新材,山东省青岛,"浴室防滑垫 厕所防滑地垫 酒店安全地垫 酒店防滑垫 产品型号：GM0409 产品规格：600*900*7mm 产品特征： 1、安全无毒：本款产品有天然橡胶和丁苯胶等高分子材料所制成的地板。用料环保，无污染，长时间铺设不会对铺设环境造成污染，不会产生有毒有害气体。 2、疏水易清洗：本款产品有着优异的疏水性能。因此，产品清洗起来也就方便了很多，可以直接用水冲洗或是用沾水抹布擦拭。若是在户外使用，也无需担心产品上会出现积水现象。 3、防滑抗疲劳：由于产品本身中还有天然橡胶的成分，使其抗疲劳性能尤为突出。使受用者在反复踩踏的情况下也不会产生在水泥地面或是大理石地面的脚部疲劳感，同时引起回弹性好，也使得产品可以大大降低出现意外不慎跌倒或是 将贵重物品不慎掉落时的损害。",丽安防护新材,GM0409,600*900*7mm,40.00元/块,"50 块","1000 块",长期有效,2015-11-28,205
226,"2018-08-24 02:04:05","供应PVC防滑垫 软胶防滑垫PVC",价格面议,东莞市高步迪标塑胶制品厂,广东省东莞,"产品特点：PVC软胶防滑垫为PVC软胶材料制作，高品质、柔软、环保抗静电、抗菌；高回弹，韧性好，弹性极佳，抗张力强，能有效阻隔地面寒气，抓地力强，平铺伏贴。防滑垫适用于家居（浴室、厨房）、汽车、及各类公共场所，既是送礼佳品，又起到了广告推作用。 材质：PVC软胶 价格区间：根据客户提供规格来定 规格：客户自定 品牌：客户自定 造型：平面3D效果 加印LOGO：可以根据客户的要求把客户自己的LOGO设计上去 样品、图样：客户提供，或客户来稿来样打样 起订量：5000 pcs 供货期：20天 注释：以上图片仅供参考，欢迎来电来访、来稿来样、打样订购生产，详情请联系我们",,,起定量1000件,面议,,,长期有效,2014-12-13,436
227,"2018-08-24 02:04:09",浙江供应pu大堂门垫厨房垫弹力垫抗疲劳前台地垫,价格面议,瑞安市博锐新材料有限公司,浙江省温州,"抗疲劳弹力垫 有效缓解腰部、腿部、脚部压力 表面易清洁及抗污染 如何让您站着做家务、洗浴等更轻松便捷呢？ 让“健康拍档”抗疲劳弹力垫帮您解决吧!“健康拍档”弹力垫回弹性非常好（普通拜垫无此效果），使您站在上面非常舒适，从而达到减压、抗疲劳的作用。保护您的健康就这么简单，您现在就能拥有！ 感受一下您脚下地点的柔软与舒适。保护您的健康! 5年保质 Healthpal健康拍档抗疲劳弹力垫，在购买之日起5年内无法正常使用，我们将提供换货服务。 温馨提示：清洁请使用湿布及温和清洁剂 产品无污染99%无菌、防霉 产品底部有防滑设计 环保:100%聚氨酯（polyurethane foam) 1.软质高回弹发泡类：玩具礼品，PU球，PU高回弹家具坐垫，PU高回弹摩托车、自行车、汽车坐垫，PU高回弹健身运动器材鞍座、PU牙科治疗椅靠背、PU医疗头枕、PU医疗床成型床垫，PU高回弹拳击手套内胆，PU高回弹空手道内胆，PU高回弹护脚内胆，PU护头等系列产品； 2.软质慢回弹发泡类：各种慢回弹玩具，慢回弹仿真食品，慢回弹床垫，慢回弹枕头，慢回弹航空枕，慢回弹儿童枕等系列产品； 3.半硬质自结皮发泡类：应用于各种家具配件、班椅扶手、客车座椅扶手、按摩浴缸枕头、浴缸扶手、浴缸靠背、浴缸座垫、汽车方向盘、汽车靠垫、汽车内外饰、防撞护杠、医疗手术器械床垫、头枕，健身器材座垫、健身器材配件 4.半硬质鬼节发泡类：PU高回弹吊死鬼，高回弹吊死鬼门帘，PU高回弹、硬泡骷髅人，PU半硬泡南瓜，PU半硬泡墓碑，高韧性刀剑，半硬泡动物模型； 5.硬质仿木发泡类：硬泡门扇、建筑装饰地角线、顶线、吸顶盘、镜框、烛台、壁架、音箱，硬泡卫浴配件，硬泡灯具、灯饰配件，仿真石材装饰板，美尔装修板，电视背景板，硬泡鞋托，硬泡板材，硬泡雕塑板，硬泡人体模特，珠宝展示台，硬泡工艺品； 6.软硬质园林类：PU花盆环系列，环保木糠花盆系列，PU仿真花叶系列，PU仿真树干系列； 7.软硬质环保缓冲包装类：应用于各种易碎贵重物件的包装制品； 8.材料和设备类：PU高、低压发泡机和PU生产线设备，PU高回弹、慢回弹组、硬泡、礼品玩具、自结皮等系列组合料，PU高回弹、慢回弹、硬泡、自结皮、弹性体、鞋材等系列脱模剂，模具制作面材、背材、离型脱模剂，锁",健康拍档,,50*80*2cm,面议,"50 片","1000000 片",长期有效,2014-11-05,665
228,"2018-08-24 02:04:09","大泡泡防滑垫 防滑垫 浴室防滑垫 防滑地垫 浴室垫",价格面议,东莞市广海大橡塑科技有限公司,广东省东莞,"吸附力达到国际标准，12个月内吸附力为30KG，材质柔软，耐温性强，产品拉伸力300% 广海大是全球最大的橡胶防滑垫生产制造商，年销量过亿，工厂占地面积50000余平方米，员工人数达1000余人，产品畅销东南亚、欧美各大酒店、超市。专业生产浴室防滑垫、迷你垫、浴帘、防滑按摩拖鞋、洗衣机垫等家居卫浴用品",GHD,GHDYF-0177,50*100,面议,"100 片","1000 片",长期有效,2014-04-28,433
229,"2018-08-24 02:04:11",广能酒店餐厅防滑垫，餐厅专用防滑垫，保护您的安全,60.00/片2片起订,广能橡塑化工有限公司,山东省青岛,"GM0406/GM0402/GM0404 尺寸：1524x914x12mm/1000x1000x15mm/1020x1020x13mm 颜色：黑色，红色， 绿色 可按客户要求定做。 材质：橡胶用途：适合用于车间和操作间，尤其适合于有水和油污的环境，铺于工人脚下，起到防滑抗疲劳的作用。 · 我厂主要生产批发带孔橡胶垫，餐厅防滑垫主要用在各种需要减震，防滑，防疲劳，疏水，耐油的地面上，质量可靠，规格齐全，异性定做。 · 其特性：多孔的设计，橡胶的较好弹性收到客户亲睐。 由天然胶硫化，成型而成。结构简单，使用方便。在无线电设备、仪器、仪表中，保护整机免受外伤部振动干扰，并具有良好的缓冲作用。 餐厅防滑垫及各种酒店防滑垫所有材料都是无毒无害的环保材料及高分子环保材料，所以又被称为环保材料。优势： 1、高弹性，脚感舒适。 2、是防滑性好，这是瓷砖等其它硬质地板比不上的； 3、强度高，耐磨性好，尤其适合于人流较多、交通繁忙和负荷较重的场合 4、在户内和户外都能长期使用 5、特殊的性能和用途：如高度绝缘、抗静电、耐高温、耐油、耐酸碱等。 青岛橡胶地垫、橡胶排水垫、带孔防滑垫、排水橡胶垫 广能特价销售 公司经营范围：橡胶垫类防震橡胶垫 橡胶缓冲垫 防静电橡胶垫 耐油橡胶地垫 疏水耐油垫 厨房防滑地垫厨房橡胶垫 橡胶防滑垫 防滑橡胶地垫 游泳池地垫 橡胶草坪垫 草坪垫 畜牧垫 猪舍垫 船甲板垫防滑垫厂家浴室防滑垫泳池防滑垫防滑地垫 耐油防滑地垫 幼儿园橡胶地垫 带孔橡胶垫 带孔防滑垫车间防滑垫 车间防滑胶垫 车间橡胶垫 抗疲劳橡胶垫 户外防滑垫 户外橡胶地垫 户外安全地垫 彩色橡胶地垫青岛橡胶地垫橡胶排水地垫排水胶垫 拼接疏水地垫 疏水防滑垫 厕所防滑地垫 橡胶门垫 车斗橡胶板 操作间地垫 橡胶牛卧床橡胶植草格公司位置：青岛胶南海王路东段348-7号",广能,GM0415A,1390*850*8mm,60.00元/片,"2 片","1000 片",2017-04-05,2014-04-21,0
230,"2018-08-24 02:04:13",优伟家居供应优质瑜珈垫全网最低价可批发零售一件代发,价格面议,圣弗罗（香港)新型建材发展有限公司,广东省广州,"厂家特价出售瑜伽垫/PVC高回弹瑜伽垫/环保瑜伽垫/户外健身垫6mm 尺寸：61*173cm/卷 厚度：6mm/8mm 颜色：多色 包装方式：腰封+收缩膜 优点： （1）无毒性、不含金属元素。 　　 （2）自然氧化裂解，可回收、避免环境污染。 　　 （3）柔软、伏贴，平铺地面，整张垫子都能帖住地面和抓住地面。 　　 （4）轻质，便于携带收藏； 　　 （5）防水、防滑，即使脚掌、手掌出汗，在上面做瑜伽练习，防滑效果依然优秀。正、背面造有美观的防滑纹路，止滑效果更佳。 　　 （6）弹性好、回弹力强，在上面做瑜伽，您会觉得软软的、十分舒适，一点也不会觉得薄。 　　 保养说明： 为确保卫生，最好每隔一周就清洗一次瑜伽垫最简易的清洗方式就是将两滴洗洁精兑四碗水，喷洒在瑜伽垫上，然后用干布擦净。如果瑜伽垫已经很脏了，还可以用布蘸上洗衣粉来轻轻拭擦瑜伽垫，再用清水冲干净，之后用干毛巾卷起瑜伽垫，吸干多余的水分。最后，把瑜伽垫晾干即可。 　　 如果垫子非常脏，浴缸加满冷水，再加入洗衣粉。洗衣粉愈少愈好，因为任何残留，都会让以后瑜伽垫变滑。然后用湿布擦洗垫子，再冲干净。用大干毛巾卷起瑜伽垫，吸干多余的水分。放开晾干。 　　 需要注意的是，洗衣粉用量尽量少，因为洗衣粉一旦残留在瑜伽垫上，瑜伽垫就可能变滑。另外晾干瑜伽垫的时候切记不要把它放在太阳底下暴晒哦。 优伟家居是目前国内最大防滑垫生产产家，产品远销北美，欧洲，并与国外知名销售企业沃尔玛，化工巨头巴斯夫有良好合作关系！ 目前公司新开发瑜珈垫产品已经上线，在保证质量的同时可以做到全网最低价海量供货，库存充足，现面向全国广泛招募分销商，合作模式灵活，可批发零售，一件代发，线上线下均可！更有淘宝全程培训保姆式培训教你网络创业月入过万！ 欢迎全国各地朋友咨询合作！",,,,面议,"1 件","999999 件",长期有效,2013-12-26,255
231,"2018-08-24 02:04:13",供应酒店杯垫，硅胶杯垫，耐高温杯垫，pvc杯垫，十年质保,价格面议,东莞市美尚塑胶工艺礼品有限公司,广东省东莞,"供应酒店杯垫，硅胶杯垫，耐高温杯垫，pvc杯垫，十年质保塑胶杯垫放在桌面上垫杯子，环保无毒,对所有产品无任何不良反应.时尚高档,为产品促销,企业形象推广的绝好促销品.这种产品有很强的立体感、色彩鲜艳、手感很好、有很好的视觉效果，有很好的装饰和广告的效果！量身订制，产品柔软美观，可以有效的起到减震作用， 龙北电45.jpg 以保护玻璃钢或其它易碎桌面杯垫的印刷，规格，厚度可由客户指定。质量保证，生产期短，交货快捷，价格适宜。欢迎广大客户来电来访!本厂专业生产PVC软胶杯垫,饰品,礼品.款式新颖,可根据客户要求定做.附: 杯垫、PVC杯垫、塑胶杯垫、软胶杯垫、家料制品、餐垫、隔热垫、煲垫、精美杯垫、米奇杯垫、卡通杯垫、迪士尼杯垫、pvc软胶杯垫、丝印圆形杯垫、酒杯杯垫夜光杯垫 、套装杯垫、杯皮等。放在桌面上垫杯子，环保无毒,这种产品有很强的立体感、色彩鲜艳、手感很好、有很好的视觉效果有很好的装饰和广告的效果！量身订制，产品柔软美观，可以有效的起到减震作用，以保护玻璃钢或其它易碎桌面.杯垫的印刷，规格，厚度可由客户指定。质量保证，生产期短，交货快捷，价格适宜。欢迎广大客户来电来访!本厂专业生产PVC软胶杯垫,饰品,礼品.款式新颖,可根据客户要求定做.附: 杯垫、PVC杯垫、塑胶杯垫、软胶杯垫、家用塑料制品、餐垫、隔热垫、煲垫、精美杯垫、米奇杯垫、卡通杯垫、迪士尼杯垫、pvc软胶杯垫、丝印圆形杯垫、酒杯杯垫光杯垫 、套装杯垫、杯皮等。",硅胶杯垫,酒店杯垫,90*3mm,面议,"100 个","8000 个",长期有效,2013-06-19,1
232,"2018-08-24 02:04:14",卫生间防滑垫，酒店浴室防滑垫,3.00/片10片起订,新怡佳家居用品有限公司,福建省泉州,"厚度：16mm_12mm 两种厚度 颜 色:柠檬黄、浅绿、天空蓝、中国红、月光灰等 产品特点： a.可任意拼装的PVC地砖装饰材料 b.紧紧贴地面，不易移动 ，不变形，不突起 c.易拼接，易组装，易裁减，易清洗。 d.铺设方便，防滑防水，耐酸碱。 多种款式可任意选择",新怡佳,25*,250mm*250mm,3.00元/片,"10 片","20000 片",长期有效,2013-05-03,412
233,"2018-08-24 02:04:17",生产酒店工程地毯，家居地毯，办公室地毯，地垫，挂毯,价格面议,广州雅邦地毯有限公司,广东省广州,"主要生产、研发手工地毯、酒店地毯、家居地毯、家用地毯、长毛地毯、宾馆地毯、展览地毯、一次性地毯、办公地毯、尼龙地毯、簇绒地毯，拥有“雅丽斯”和“雅邦”两大系列品牌， 产品远销欧美、中东及俄罗斯。",,,,面议,,,长期有效,2013-01-29,383
234,"2018-08-24 02:04:17","浴室防滑垫 酒店浴室防滑垫 橡胶防滑垫 PVC透明防滑垫",15.00/条50条起订,深圳易馨生活用品有限公司,广东省深圳,"型号：yxx002-按摩垫 材质：橡胶 规格：35*55CM 适用范围：浴室 重量：500G 外型：方型 颜色：米白色 品牌：易馨 产品类别：防滑垫 浴室，浴房，浴缸，卫生间的光滑地面是您容易被忽略的安全杀手，一旦有蒸汽、水滴或空气返潮现象，一不小心就会滑倒，危及您和家人的安全。防滑垫就能大大提升浴室活动安全性，根据人体脚底穴道设计的按摩点，触感舒适，让你边沐浴边保健。款式多样，更添浴室妆饰情趣!!! 底部带有很多小吸盘，可以牢牢的吸在浴缸里和地板上面，绝对保证防滑。产品全部是厂家直销，通过ISO9001：2000国际质量管理体系论证，淡淡橡胶香味。 ------------------------------ 「型号」：GHDY-XJ0037 「名称」：方格按摩 「规格」：36*57CM 「重量」：600G 「颜色」：米白，蓝色,绿色,青色。颜色请写在备注里,若无备注,则随机发货! 『三大热点』 天然环保：采用泰国进口的 100 ％无毒原材料，经过高科技精工而成。 保健按摩：经专业科技研发为凹凸图纹，赤脚走立于上对脚底进行按摩促进血液系统循环、减除疲劳、有利于身体健康。 妆饰艺术：精制美观放在室内可增加艺术性和欣赏美观性。 『四大功能』 1 、吸力强劲：专业科技研发的底部吸盘，强劲的吸咐在光滑的物面上，吸咐力达到国际标准。(12个月内吸咐力为 3OK GF) 2 、柔软坚韧：材质柔软．耐温性强。产品伸力为大于等于 300 ％。 3 、耐温性好：使用温度在零下8度到零上80度之间。 4 、清洁易洗：安全耐用、不易变色、防老化性能、污脏后易清洁。 『五大特色』 1 、性价比高、品味高尚、符合现代生活。 2 、符合欧盟各项要求和指标。 3 、适用范围广。可在浴室、厨房、卫生间、门斤等方面使用。 4 、专业制造、精益求精。 5 、服务有保障、让您买的安心，用的放心。 『实物细节』 本着质量第一，以诚求信，平等互利的宗旨，我们将为您提供最具竞争力的价格和高品质的产品。",易馨,按摩垫,35*55,15.00元/条,"50 条","10000 条",长期有效,2012-09-04,509
235,"2018-08-24 02:04:22",供应防滑垫,价格面议,圣托贸易有限公司,广东省顺德,"具体参数 ： 尺寸：780*380 mm 详细描述 ： 产品名称：防滑垫型号：XC-BE-02规格：78*38颜色：白色透明、兰色透明、桔黄色、兰色",,,大量库存,40.00元/,,,长期有效,2012-02-01,538
236,"2018-08-24 02:04:24",供应防滑垫,价格面议,富士洗浴休闲设备厂,广东省惠州,防滑地板胶广泛用于酒店贵宾房、桑拿中心、浴室、浴池四周洗手间等有水的地方，防止意外摔倒。撤洗方便随意组合,,,,面议,,,长期有效,2010-12-01,167
237,"2018-08-24 02:04:28",供应纯棉地垫,价格面议,淮安市欣洁毛巾制造有限公司,江苏省淮安,淮安市欣洁毛巾制造有限公司、供应纯棉地垫、有意者来电询问、0517-85801912、15052676588,,,10000,38.00元/,,,长期有效,2010-09-05,349
238,"2018-08-24 02:04:32",供应DDK三条纹1000型吸尘吸水地垫,价格面议,帝肯实业（上海）有限公司,上海,"DDK三条纹1000型吸尘吸水地垫 产品特点: 强吸水、防沙吸尘、美观！最高性价比的三条纹地垫坑纹毯地垫！―― DDK地毯型PVC复合地垫颜色：枣红 、灰、 咖啡等多色系可供选择。规格：1.2*18M ；1.8*18M DDK地垫----品质与价格同优！",,,,面议,,,长期有效,2010-09-01,403
239,"2018-08-24 02:04:33",供应一次性用品,价格面议,扬州市白云酒店用品有限公司,江苏省扬州,主要生产销售酒店一次性用品，酒店标牌，大堂用品及配套产品，主要有酒店牙刷牙膏、梳子、香皂、浴帽、针线包、剃须刀、沐浴液、洗发液、护发素、润肤露、无纺丝拖鞋、毛巾拖鞋、指甲锉、棉签、洗衣粉、擦鞋器、高档擦鞋布、鞋拔、口杯套、杯盖、吸水杯垫、浴擦、防滑垫、浴帘、消毒封条、服务指南、各种标示牌、房价表、天气牌、酒店大堂擦鞋机、布草车、垃圾桶、塑料托盘、漆器托盘、酒店客房皂液器、星级酒店客房床单、床垫、棉被、枕头、21线毛巾、32线毛巾、螺旋巾、全棉浴巾、毛毯等各类棉织品。,,,,面议,,,长期有效,2010-08-12,460
240,"2018-08-24 02:04:36",供应天然彩色卵石按摩门垫,价格面议,鹤壁市山城区韵石鹅卵石制品厂,河南省鹤壁,"鹤壁市山城区韵石鹅卵石制品厂位于河南省鹤壁市山城区，是一家民营企业。系鹅卵石装饰、保健领域诚信的设计、生产、服务商。以自有技术开发、专业的心贴心服务，最大程度满足客户鹅卵石装饰、保健领域的需要。企业核心价值观：宽容、合作、学习、新颖。企业经营理念：服务自然、圆润和谐、关爱健康、善待生命。 目前主要生产独有专利产品天然卵石拼图按摩毯垫(专利号ZL200920090432.0）。 二、卵石拼图按摩毯垫的功效和服务 足部是人体的第二个心脏，也是血液循环最弱的地方。当我们按摩足部穴位后，足部血液流速加快，沉积物会被按“碎”，它会随着血液循环的加快重新参加体循环进而排除体外。因此足部反射区的刺激按摩可以改善血液循环，恢复器官功能，减轻心脏负担，使新陈代谢功能提高。 同时人体也是一个带电体，特别是居于高楼大厦的人，在干燥的气候下，如静电不及时释放，就将影响到大脑神经及血压等功能。光着脚板踏在天然的地面上，让身体直接与大自然接触，便于静电的释放 天然卵石拼图毯、垫就是根据这两个原理研制生产的。利用名贵天然卵石代替人手对脚底穴位进行按摩的一种保健产品，同时也是理想的家居装饰产品。 1.保健 功能 （1）.脚踏卵石毯、垫能呵护脚部，促进血液循环，排除毒素。（2）.舒筋活络，松弛神经与肌肉，消除疲劳 （3）释放体内静电，呵护神经、血压功能 （4）.舒缓紧张情绪，促进睡眠。 2.装饰功能 古人曾说，山无石不奇、水无石不清、园无石不秀、室无石不雅。当今生活在城市的居民与大自然接触的机会愈来愈少，而祟尚自然，返朴归真的愿望和追求却越来越强烈。因此 家庭居室中摆置凝天地之灵气、聚日月之精华、孕万物之风采的天然卵石拼图毯垫。不仅美化了家居环境、提高了文化品位。而且令人赏心悦目，顿生雅趣。足不出户就能让您肌肤感受自然底蕴。让您的摆脱钢筋水泥筑就的封闭、喧嚣、抑郁氛围，让您的情愫思绪无疆飞扬。 3. 陶冶性情、哲理启迪功能 鹅卵石有很强的亲和力，令人领略到天赐尤物的尽善尽美，千姿百态，妙趣横生，让人体验到大自然的神韵灵性！天然鹅卵石在家居环境空间里追寻着一种天然真趣，可作为山水的象征。人们通过观赏鹅卵石，而联想到山川溪流，从而达到与自然亲近，陶冶性情之体验。 棱角分明的石块经泥石流、河水的长期剥蚀、冲刷和磨洗一部分变成尘沙，一部分变成“圆滑”的卵石。这一演变过程让我们深思......给人以启迪......其实我们每个人的成长过程不正是鹅卵石的形成过程吗？经过岁月的冲洗，风吹雨打，每个人都饱尝着人间的酸甜苦辣，由原先充满反叛的性格逐渐被削平了棱角，变得世故圆滑起来。成熟里显示了对社会的妥协。外圆内方是真性格，此乃鹅卵石令人喜爱之所在。 三、我们产品的特点 它与其他脚底按摩器有很大的区别。1、鹅卵石坊制作的卵石毯、垫采用天然卵石（半玛瑙质、水晶质、玉石质、大理石质、石英质、玄武石质等名贵石材），不同颜色的天然卵石含有的微量元素各不相同，都是对人体有益的微量元素。不同于目前市场上再生橡胶、塑料、挂釉瓷卵石毯垫，不含有硫和苯胺类及其他毒素物质。 2、卵石按摩毯、垫打破时间、区域的限制，既健康、卫生又无副作用，它使脚底按摩便利化、大众化，让人随时随地都可以与天然石接触。在淋浴间、阳台、客厅、卧室等地方的日常生活中，不用刻意就完成了身体的按摩保健等活动。 3、便于清洗，不用二次铺装。产品不能轻易清洗是一个很大的问题，由于我们的透明黏合剂灌注卵石厚度的一半既加强了卵石的粘结力，又便于清理掉在缝隙里碎小杂物。产品不用二次铺装，可直接铺在地板上使用，不用沟缝。目前市上产品仅是把卵石粘在网上，必须二次铺装沟缝。既麻烦又严重影响产品视觉效果。其沟缝剂严重模糊了图案的清晰，加之霉变发黑。不但不能美化家居，反而起相反作用。 4、由于使用我单位独自研发的“改性透明粘结剂”，保障了产品长期使用性。我们的黏合剂对各种石材具有很强的渗透性，附着力极强，且透明似水。优越粘结力保证了各种卵石不会脱落。产品耐水、耐油、耐腐蚀、耐黄变、耐老化。",,,,面议,,,长期有效,2010-04-20,433
241,"2018-08-24 02:04:40",中式古典餐厅门牌|酒店标识牌|拉丝不锈钢创意门牌,50.00/块1块起订,常州明道标识有限公司,江苏省溧阳,"酒店标牌是一种应用于酒店的广告标牌，主要用以突出酒店的风格特色，酒店标识牌的主要制作材质以亚克力、金属(铜、铁、铝、锡、钛金、不锈钢)为主，制作工艺较为复杂，选用材质也很多，在酒店标牌设计制作时注重功能性与艺术性的巧妙结合。 酒店标牌的内容大致有门号牌、大堂指示牌、楼层指示牌、功能指示牌、时钟指示牌、告示牌、房价牌等。 明道标识推荐两款较为典型的酒店标牌： 拉丝不锈钢创意门牌 常州明道标识有限公司是一家集标识标牌设计、制作、运输、安装和维护为一体的综合性专业标识标牌生产厂家, 主营产品包括地产标识、商场标识、医院标识、酒店标识、景区标识、企业单位标识、宣传栏、垃圾箱、休闲凳椅、资料架、广告灯箱等。公司以专业一流的生产设备以及设计精英团队为客户打造高品质标识系统, 我们秉承勤奋、务实、创新的理念，多年来为客户提供满意的服务。 竭诚欢迎新老客户垂询指导、携手合作！ 联系方式 公司网站：www.mdsign.cn 联系人： 钱先生 0519-87874444 QQ：800064442 地址：江苏省溧阳市天目湖镇茶亭古县北路152号",明道标识,md-21,400*195*15mm,50.00元/块,"1 块","1000 块",长期有效,2017-08-07,53
242,"2018-08-24 02:04:41",电子门牌，门显，房号门铃开关显示牌,价格面议,深圳市绿华电子有限公司,广东省深圳,"材质：微晶面板+304不锈钢 规格：直径150mm 触摸原理：采用手机电容式触摸屏原理 安全：内置过载保护，可防浪涌电流和防雷击 稳定：MCU可编程电路控制，核心元件原装进口 美观：LED背光灯设计，有利于夜间识别 人性化：个性体贴的“免打扰”功能给客人一个宁静舒适的私人空间 安装：国标86底盒嵌入式安装 适用范围：酒店、宾馆、大厦、会所、写字楼 特性： 1、LCD液晶屏，显示亮度均匀、面积大、档次高；微晶面板、豪华304不锈钢边框，尽显奢华。 2、纯平触摸屏面板，独有的暗背光触控设计，客人在任何光线下清晰对触摸屏进行操作；简洁大方的西欧风格的外型设计，是星级酒店、宾馆的首选。 3、人性化设计“请勿打扰“灯亮时，按门铃不响应，解除客人的烦恼，给客人更多的私人空间，提高服务质量。 4、内置过载保护，工作稳定可靠，电脑芯片可编程控制，具备“房号“、”酒店名称”、“请勿打扰”、“清理房间”、“门铃”，五合一触摸屏电子门牌智能化互锁指示，极具人性化，让室内室外沟通随心所欲。 5、适用于酒店、宾馆、公寓、会议室等，独具舒适智能化声音及信号提示，让客房倍添时代魅力，有效提高客房回住率。 6、ABS防火底盒，电路板完全封装，符合国际消防标准。 深圳绿华电子组建于2008年，为酒店电子门牌、触摸开关、取电开关行业的开创者和引导者，也是行业中规模最大的厂家，产品三年免保、保用八年；电话：18934049909 0755-89611122 深圳市绿华电子有限公司简介 深圳市绿华电子有限公司组建于2008年5月，由广东奇胜电子前技术总监和数名从事智能控制多年的资深工程师组建而成。之前专为多家国内酒店客房控制系统生产厂家，中国著名电器开关厂提供酒店电子门牌、触摸屏开关、取电开关、门铃等产品的贴牌和定制生产。 公司现专业研发生产酒店客房、餐饮包房、办公室等各种电子门牌、智能液晶触摸开关、智能空调温控器、插卡取电开关、节能客房控制系统。 我公司是中国首家将触摸屏技术、无线电磁波技术、CAN-bus网络技术综合应用于酒店客房节能控制系统中，使酒店的投入成本同比减少67%，经营成本同比减少36%以上，同时使酒店的管理更科学与快捷，酒店软硬件档次更上一层楼。 公司经过六年的积累与发展，现有产品开发部、售后服务部、生产车间、质检部、、仓库物流部、营销部等十一部门，生产车间拥有2条生产组装线和1个产品老化测试室。公司本着“质量为本，不断创新，诚信经营”的企业文化，截止2010年为中国唯一一家自主开发生产节能客房控制系统、液晶触摸开关系列的高科技企业，同时也是中国最专业，同行业规模最大的企业。 绿华电子产品质量承诺： 1、公司全面贯彻执行ISO9001：2000的国际质量体系标准：保证产品出厂合格率100% 三年内产品使用故障率在3％以下； 2、产品三年内免费保修，八年设计使用寿命。 绿华公司经营理念：质量为本，不断创新，诚信经营！",,,,面议,,,长期有效,2015-11-10,587
243,"2018-08-24 02:04:44","酒店指示牌 【厂家直销，订做批发】门锁酒店灯具",68.00/个1个起订,深圳市吉瑞达电子有限公司,广东省深圳,"“六合一”功能："" 请勿打扰、请即清理、请稍后、入住、房号和门铃” 显示，设计新颖； LCD背光显示触控设计，灯位指示一目了然方便夜间识别，操作方便快捷； 房间号码24小时常亮，取代于传统老式门牌，酒店微标彰显奢华档次； 豪华钢化玻璃面板，晶莹剔透，耐划痕，确保十年不变色； 适于高档酒店、宾馆、会所、KTV、桑拿、茶楼等场所。",吉瑞达,"钢化玻璃,金漆丝印系列",,68.00元/个,"1 个","1000 个",长期有效,2015-04-14,181
244,"2018-08-24 02:04:46",北京华宇腾飞工贸有限公司简介、亚克力简介,价格面议,北京华宇腾飞工贸有限公司,北京北京市,"北京华宇腾飞工贸有限公司是集设计、研发、制作、销售为一体专业亚克力制品的高新技术企业。公司主营：亚克力酒水车、发光酒水车、亚克力酒店家具；高档酒店用品：纸巾盒、亚克力标牌、装饰饰品、道具展柜；卫浴配套系列：镜前托盘、毛巾杆等。 企业成立至今，本着“以人为本”的经营理念，以市场需求为导向，凭借专业水平和成熟的技术，以环保主题，在产品研发上避开了各种对人伤害的材料。现产品经国家商标局注册在案，经国家权威机构认定为零污染、零辐射“绿色环保”型产品。产品一经上市受到众多消费者追捧和好评。现企业产品已稳定成熟，正健康有序走向市场，在此也热烈欢迎有识之士参加、加盟，共同携手走向辉煌！",,,,面议,,,长期有效,2015-01-24,344