category_3_x_jiudian_yongpin.id,category_3.id,category_3.ts,category_3.title,category_2.id,category_2.ts,category_2.title,category_1.id,category_1.ts,category_1.title,jiudian_yongpin.id,jiudian_yongpin.ts,jiudian_yongpin.title,jiudian_yongpin.jingying_moshi,jiudian_yongpin.gongsi,jiudian_yongpin.chanpin_jieshao,jiudian_yongpin.chanpin_danjia,jiudian_yongpin.suozai_diqu,jiudian_yongpin.zuixiao_qiding,jiudian_yongpin.gonghuo_zongliang,jiudian_yongpin.lianxi_dianhua,jiudian_yongpin.zhuying_cahnpin,jiudian_yongpin.dianhua,jiudian_yongpin.shangpu_wangzhi,jiudian_yongpin.dizhi
235,15,"2018-08-23 23:23:38",浴帽,2,"2018-08-23 23:06:25",一次性用品,1,"2018-08-23 23:06:25",酒店客房类,235,"2018-08-24 01:59:38",宾馆酒店客房旅店旅馆一次性用品淋浴帽透明防水洗漱洗浴专用批发,生产加工,广陵区科荣旅游用品厂,"类别 酒店一次性用品 加印LOGO 可以 加工定制 是 箱装数量 3000只/箱 产品类别 浴帽 产地 江苏扬州 【产品名称】一次性浴帽 【产品方式】磨砂塑料袋包装 【装箱规格】3000只/箱 【生产周期】现货 【关于产品】我们的产品图片均为实物拍摄，因拍摄技术和显示器原因，可能会有色差，均以实物为准，敬请谅解。客户订制时，我们可根据客户提供的样品生产。 【订制标志】我们可以根据您的需要，在产品或包裝上印制客户的Logo、公司名称、联系方式等信息，要求不同，价格不等，可联系我们洽谈。您在本店见到的图片一般为常规产品（通货）。订制产品，必须寄送样品。 【货款结算】我们建议您使用支付宝交易。如您订制产品，需方预付款40%定金，余款在支付宝采用先拍后付的原则。 【供货周期】拍前请亲询问产品库存、物流等，有现货的1个工作日内发货；没有现货，生产周期要视产品数量和产能而定。订制产品，生产周期为15-20天（40%预付款到，余款打上支付宝，日期算起），物流时间视两地距离及物流情况而定。本店客户大多为宾馆酒店，货量较大，部分商品需订制，同时为避免运输公司造成中途延误，请较远或较急的老板们提前订货。 【货物签收】货品请当面检查后再签收，如发现货品数量、质量有问题请让快递人员作证并拍照留证，立即跟我方客服人员取得联系，确定事实后方可进行补货、换货。 【货物退换】货品存有质量问题，在未经使用，附件完好的情况下，可掉换同等价值的商品或退掉。退货应于收货之时起的24小时内申请，并于申请之时起的24小时内寄回。对交易过程中可能出现的疑问或顾虑，请买家及时同客服联系，以利于交易顺利进行。如果是我方责任，错发、少发、质量问题则运费有我方承担，否则运费由买家自理。 客服热线：13390612102 QQ：3651950 Email：3651950@qq.com",面议,"江苏 扬州市",,,0514-89787454,酒店客房类,0514-89787454,http://kerong.net168.com/,"中国 江苏 扬州 广陵区 杭集镇利民路2号"
236,15,"2018-08-23 23:23:38",浴帽,2,"2018-08-23 23:06:25",一次性用品,1,"2018-08-23 23:06:25",酒店客房类,236,"2018-08-24 01:59:43","桑拿 客房浴帽 条形折叠浴帽 客房易耗品","生产加工,招商代理",广陵区天王旅游用品厂,浴帽包装系列,0.13元/套,"江苏 扬州市","3000 套",,13852596218,"酒店客房类 客房用品 鞋拔酒店客房类 一次性用品 牙膏酒店客房类 一次性用品 牙刷酒店客房类 一次性用品 浴帽酒店客房类 一次性用品 香皂酒店客房类 一次性用品 洗漱用品",13852596218,http://tianwang.net168.com/,"中国 江苏 扬州市广陵区杭集王集民主30号"
237,15,"2018-08-23 23:23:38",浴帽,2,"2018-08-23 23:06:25",一次性用品,1,"2018-08-23 23:06:25",酒店客房类,237,"2018-08-24 01:59:47","酒店一次性浴帽 加大加厚宾馆会所淋浴间防水加固松紧盒装",生产加工,江苏赛诺酒店用品有限公司,"品牌 purplelavender 类别 酒店一次性用品 材质 PE 货号 2015321 加印LOGO 可以 加工定制 是 箱装数量 贵仕系列浴帽 产品类别 浴帽 产地 江苏扬州 建议零售价 1.66 商品品牌：purplelavender 商品名称：贵仕系列浴帽 材质：PE 规格：28mm 重量：4.6g 包装：opp透明袋+纸盒",1.66元/套,"江苏 扬州市",,,0514-87277778,"酒店客房类 客房用品 挂牌酒店客房类 一次性用品",0514-87277778,http://sainuo.net168.com/,"中国 江苏 扬州市琼花街61号"
238,15,"2018-08-23 23:23:38",浴帽,2,"2018-08-23 23:06:25",一次性用品,1,"2018-08-23 23:06:25",酒店客房类,238,"2018-08-24 01:59:49",酒店宾馆用品一次性浴帽洗澡防水防尘帽染发焗油塑料帽沐浴帽,生产加工,江苏赛诺酒店用品有限公司,"建议零售价 ¥1.10 品牌 purplelavender 类别 酒店一次性用品 材质 PE 货号 20125487 加印LOGO 可以 加工定制 是 箱装数量 宝珀系列浴帽 产品类别 浴帽 产地 江苏扬州 商品品牌：purplelavender 商品名称：宝珀系列浴帽 材质：优质PE 规格：230mm 重量：5g 适用人群：通用",1.10元/套,"江苏 扬州市",,,0514-87277778,"酒店客房类 客房用品 挂牌酒店客房类 一次性用品",0514-87277778,http://sainuo.net168.com/,"中国 江苏 扬州市琼花街61号"
239,15,"2018-08-23 23:23:38",浴帽,2,"2018-08-23 23:06:25",一次性用品,1,"2018-08-23 23:06:25",酒店客房类,239,"2018-08-24 01:59:49","一次性浴帽 酒店宾馆一次性浴帽 简单透明OPP包装",生产加工,广陵区春天旅游用品厂,"品牌 海之涯 类别 酒店一次性用品 材质 聚丙 货号 CT-81 加印LOGO 可以 加工定制 是 箱装数量 5000 产品类别 浴帽 产地 江苏扬州 建议零售价 0.18 友情提醒：拍前请阅读本页面“买家必读”和“邮资说明”，以免造成不必要的麻烦，感谢合作。 春天酒店用品专业生产经营各种酒店用品，你可以先逛逛本店或者和客服聊聊，我们为您提供专业周到的服务。 产品描述 酒店宾馆用品浴帽：浴帽。本产品10个起订，专业酒店宾馆一次性浴帽，具体运费和其他问题请咨询客服。 产品展示 其他用品系列请咨询客服： 其他星级用品配套系列请咨询客服",0.09元/个,"江苏 扬州市","10 个",,0514-89789885,"酒店客房类 一次性用品",0514-89789885,http://chuantian.net168.com/,"中国 江苏 扬州市邗江区杭集镇工业园"
240,15,"2018-08-23 23:23:38",浴帽,2,"2018-08-23 23:06:25",一次性用品,1,"2018-08-23 23:06:25",酒店客房类,240,"2018-08-24 01:59:52",厂家供应酒店宾馆专用客房洗漱用品批发一次性淋浴高压加厚浴帽,生产加工,广陵区文博旅游用品厂,"广 陵 区 文 博 旅 游 用 品 厂 公 司 简 介 广 陵区文博旅游用品厂，位于历史文化名城东郊。紧邻京沪、宁通高速杭集立交桥处北侧，交通便捷。面对改革开放的形势，企业加强管理，形成了专业旅游用品生产 销售、配套印刷彩印的一条龙生产能力。企业以优质的服务，优良的产品，美观的外型，齐全的品种和周到的服务赢得广大客户的信赖。我们的产品涵盖了：客房床上用品、毛巾、浴巾、方巾、地巾、一次性拖鞋、一次性牙具、一次性香皂、航空旅游用品、一次性梳子、软管或瓶装洗发水、沐浴露、润肤乳、护发素、一次性杯子、擦鞋布、袋泡茶、擦鞋等一次性旅游、酒店客房用品系列，并承接国内外OEM订单。",0.18元/套,"江苏 扬州市","5000 套",,"0514 87272938","酒店客房类 一次性用品","0514 87272938",http://wenbo.net168.com/,"中国 江苏 扬州市邗江区 江苏省扬州市邗江区杭集镇王集村民主组32号"
241,15,"2018-08-23 23:23:38",浴帽,2,"2018-08-23 23:06:25",一次性用品,1,"2018-08-23 23:06:25",酒店客房类,241,"2018-08-24 01:59:54","一次性洗澡浴帽 焗油帽 成人条形白色浴帽免运费 防水加厚",生产加工,广陵区文博旅游用品厂,"品牌 文博 类别 酒店一次性用品 材质 PVC 货号 浴帽-通货 加印LOGO 可以 加工定制 是 进口 否 产地（国内） 江苏省 颜色 5000 裸装,2000 环保袋包装 产品类别 浴帽 产地 杭集",0.04元/套,"江苏 扬州市","2000 套",,"0514 87272938","酒店客房类 一次性用品","0514 87272938",http://wenbo.net168.com/,"中国 江苏 扬州市邗江区 江苏省扬州市邗江区杭集镇王集村民主组32号"
242,15,"2018-08-23 23:23:38",浴帽,2,"2018-08-23 23:06:25",一次性用品,1,"2018-08-23 23:06:25",酒店客房类,242,"2018-08-24 01:59:54","酒店宾馆旅社客房一次性浴帽 美容店星级酒店一次性浴帽生产批发",生产加工,扬州仪征市陈集镇途悦日用品厂,"类别 酒店一次性用品 货号 YM001 加印LOGO 可以 加工定制 是 箱装数量 50000 产品类别 浴帽 产地 江苏扬州 途悦日用品厂是 牙刷、梳子、香皂、拖鞋、洗发水、沐浴露等酒店宾馆用品专业制造商，依托陈集镇工业园区为生产加工基地，“中国酒店日用品”杭集镇为营销、物流中心，拥有 专业的研发技术知识、严谨的质量管理体系。本着务实进取的精神，我们力争走在酒店用品业界的前沿，以满足客户对现代美感和高质量生活的追求！ ※产品细节 ※专业品质 值得信赖 一、品牌优势 与两面针、中华、黑妹等品牌合作，生产精品系列，提升酒店宾馆形象，让消费者更有亲切感。 二、规模优势 通过大宗采购、精细管理等手段，加强生产成本控制，提升产品市场竞争力。 三、稳定的品控体系 生产过程每个环节都有规范的检测体系，建立产品追溯机制，最大化保证产品质量稳定。 四、完善的物流服务体系 加强售后服务，建立物流发货跟踪体系，以客户满意度为服务唯一宗旨。 ※产品生产实拍图 ※买家必读 一、关于产品 我们的产品图片均为实物拍摄，可为客户提供打样服务。 二、订制标志 我们可以根据您的需要，在产品或包装上印制客户的logo、公司名称、联系方式等信息。 三、供货周期 拍前请亲询问产品库存、物流等信息，现货在1个工作日内发货，订制产品生产周期10-20天。为避免产品使用延误，请较远或较急客户提前订货。 四、货物签收 货物签收前请仔细检查货物的包装数量多少、货物的包装有无破损，如有差异，请立即和我方客服人员进行联系。 五、货物退换 1、现货产品在未经使用、附件完好的情况下，可以调换同等价值的产品或换掉。定牌产品非因质量问题一律不予退换，请买家在拍前与客服详细沟通。 2、退换货请于收货签字起24小时内进行申请，逾期将不予受理。如果是我方错发、少发、质量问题运费由我方承担，否则运费由买家自理。 3、售后服务专线：13390669276（侯） 15252579692（陈） QQ：190914218",0.09元/套,"江苏 扬州市","3000 套",,0514-87270032,"酒店客房类 一次性用品",0514-87270032,http://tuyue.net168.com/,"中国 江苏 扬州市广陵区 杭集工业园嘉园路8号"
243,16,"2018-08-23 23:23:41",梳子,2,"2018-08-23 23:06:25",一次性用品,1,"2018-08-23 23:06:25",酒店客房类,243,"2018-08-24 01:59:57",酒店一次性长柄梳子,"生产加工,经销批发,办事处",扬州鼎杰旅游用品厂,【产品名称】:酒店一次性长柄梳,0.12元/,"江苏 扬州市",2000,10000,0514-87498076,"酒店客房类 一次性用品 牙刷酒店客房类 一次性用品 香皂酒店客房类 一次性用品 浴帽酒店客房类 一次性用品 梳子酒店客房类 一次性用品 拖鞋",0514-87498076,http://yang1113517974.net168.com/,扬州市广陵区杭集镇车四11号
244,16,"2018-08-23 23:23:41",梳子,2,"2018-08-23 23:06:25",一次性用品,1,"2018-08-23 23:06:25",酒店客房类,244,"2018-08-24 02:00:00","一次性折叠梳子 宾馆一次性梳子 酒店一次性梳子 酒店用品批发",生产加工,扬州彰荣酒店用品有限公司,"品牌 彰荣酒店用品 材质 PP PS 货号 zr1-36 加印LOGO 可以 加工定制 是 进口 否 产地（国内） 江苏省 箱装数量 1000 产品类别 梳子 产地 江苏扬州 扬州彰荣酒店用品有限公司 尊敬的客户您好 很荣幸与你相遇 我是销售酒店一次性用品的厂家 如有如要可以扣扣 哦 QQ:8559754 给你介绍一下我们的公司与产品 我厂是一家集生产 加工 经销 批发 国内星级宾馆 酒店专业工厂 经营范围包括：牙刷 梳子 香皂 洗发液 沐浴液 拖鞋 二合一 四合一 六合一 日化 旅游用品 定牌产品 来样都可以定做的 如果你或者你的朋友有做这方面的 我们可以加扣扣私聊哦 欢迎来电洽谈：0514-89793680 18912145575 扬州彰荣酒店用品有限公司（免费送样） 酒店客房一次性梳子 可折叠梳子，梳齿内注颜色可以选择。 陪不同包装配置不同的价格，具体请询问客服人员。 。",面议,"江苏 扬州市",,,0514-89793680,"酒店客房类 一次性用品 香皂酒店客房类 一次性用品 拖鞋酒店客房类 一次性用品 火柴酒店客房类 一次性用品 其他一次性用品",0514-89793680,http://zhangrong.net168.com/,"中国 江苏 扬州 广陵区 杭集镇四通路51号"
245,16,"2018-08-23 23:23:41",梳子,2,"2018-08-23 23:06:25",一次性用品,1,"2018-08-23 23:06:25",酒店客房类,245,"2018-08-24 02:00:05","酒店一次性梳子 格林豪泰梳子 环保纸长条梳子 定制店名 价格优惠",生产加工,广陵区杭集志坚旅游用品厂,"品牌 晨露 材质 塑料 塑料 pp聚丙烯 全国工业生产许可证编号 GB19342-2003 货号 20141111 加印LOGO 可以 加工定制 是 进口 否 产地（国内） 江苏省 箱装数量 2500 产品类别 梳子 产地 扬州 建议零售价 0.20 常年有现货，欢迎选购",面议,"江苏 扬州市",,,0514-87497390,"酒店客房类 一次性用品 牙刷酒店客房类 一次性用品 洗漱用品酒店客房类 一次性用品 洗浴用品",0514-87497390,http://zhijian.net168.com/,"中国 江苏 扬州 广陵区 杭集镇曙光路216-2"
246,16,"2018-08-23 23:23:41",梳子,2,"2018-08-23 23:06:25",一次性用品,1,"2018-08-23 23:06:25",酒店客房类,246,"2018-08-24 02:00:08","一次性长条梳 宾馆梳子 酒店梳子批发 酒店一次性用品 整箱可包邮",生产加工,扬州雅诗曼伲旅游用品有限公司,"品牌 雅诗曼伲 材质 塑料 塑料 PP/百折胶 货号 S-01 加印LOGO 可以 加工定制 是 进口 否 产地（国内） 江苏省 箱装数量 100 产品类别 梳子 产地 扬州 建议零售价 0.50 注意：梳子长16.8厘米，全新料！！！！！！！！！！ 一件里三小箱 每小箱1000支 发货方式：江浙沪整箱包邮（发快递）（舟山、崇明快递另议） 其他地方发物流偏远地区整箱需补贴点邮费（发物流）具体咨询客服 您可能还需要以下产品： 买家必读： 【关于产品】我们的产品图片均为实物拍摄，因拍摄技术和显示器原因，可能会有色差，均以实物为准，敬请谅解。客户订制时，我们可根据客户提供的样品生产。 【订制标志】我们可以根据您的需要，在产品或包裝上印制客户的Logo、公司名称、联系方式等信息，要求不同，价格不等，可联系我们洽谈。您在本店见到的图片一般为常规产品（通货）。订制产品，必须寄送样品。 【货款结算】我们建议您使用支付宝交易。如您订制产品，需方预付款40%定金，余款在支付宝采用先拍后付的原则。 【供货周期】拍前请亲询问产品库存、物流等，有现货的1个工作日内发货；没有现货，生产周期要视产品数量和产能而定。订制产品，生产周期为15-20天（40%预付款到，余款打上支付宝，日期算起），物流时间视两地距离及物流情况而定。本店客户大多为宾馆酒店，货量较大，部分商品需订制，同时为避免运输公司造成中途延误，请较远或较急的老板们提前订货。 【货物签收】货品请当面检查后再签收，如发现货品数量、质量有问题请让快递人员作证并拍照留证，立即跟我方客服人员取得联系，确定事实后方可进行补货、换货。 【货物退换】货品存有质量问题，在未经使用，附件完好的情况下，可掉换同等价值的商品或退掉。退货应于收货之时起的24小时内申请，并于申请之时起的24小时内寄回。对交易过程中可能出现的疑问或顾虑，请买家及时同客服联系，以利于交易顺利进行。如果是我方责任，错发、少发、质量问题则运费有我方承担，否则运费由买家自理。 联系电话：4006988370 黄总：18252730210 雅诗曼伲（扬州）酒店用品有限公司位于享有“中国酒店日用品之都”和“中国牙刷之都”美誉之地的扬州杭集，自2005年5月18日成立以来，在短短5年里，业务范围已经扩大到全国近30个省、市自治区，部分产品远销东南亚、欧美等国家。我厂集产品研发，生产，销售为一条龙，凭借着产品质量与售后服务赢得广大客户的信赖与好评，我们的主要客户群为3星级以上宾馆酒店，与拉萨饭店等多家国内知名星级酒店有良好的合作关系。公司自创办以来，始终秉承：“永无止境的持续改进，完善而真挚的服务，为客户提供满意的产品”的经营理念，根据不同客户的市场提供最合适的产品信息，为客户提出供高素质的完善服务。竭诚欢迎国内外新老客商前来洽谈。 联 系 人：黄星龙",面议,"江苏 扬州市",,,051489883370,"酒店客房类 一次性用品 牙刷酒店客房类 一次性用品 牙膏酒店客房类 一次性用品 香皂酒店客房类 一次性用品 火柴酒店客房类 一次性用品 浴帽",051489883370,http://yashimanni.net168.com/,江苏广陵区杭集镇竹园路1号
247,16,"2018-08-23 23:23:41",梳子,2,"2018-08-23 23:06:25",一次性用品,1,"2018-08-23 23:06:25",酒店客房类,247,"2018-08-24 02:00:09",供应刀鱼梳子一次性用品，外贸桑拿宾馆一次性牙刷用品,生产加工,广陵区美王旅游日用品厂,"材质 塑料 规格 011 型号 017 类别 酒店一次性用品 产品类别 牙刷 产品名称 梳子 本公司专业生产牙刷，外贸一次性牙刷，桑拿一次性牙刷，宾馆酒店一次性用品以及植毛加工，注塑加工 （牙刷，工业刷，宠物刷，电脑刷，面刷，磨牙牙刷，鞋刷，小胡刷，眉梳，眉笔，指甲刷，牙线刷等等 植毛热合包装以及成品销售）仪表盖注塑加工等，物美价廉 欢迎订购。 扬州市邗江美王旅游日用品厂 位于江苏 扬州市邗江区，主营 牙刷、宾馆酒店客房用品、植毛注塑加工 等。公司秉承“顾客至上，锐意进取”的经营理念，坚持“客户第一”的原则为广大客户提供优质的服务。 主要产品有：拖鞋、牙刷、香皂、剃须刀、浴帽、梳子、洗护用品、火柴、护理用品等。 无纺丝拖鞋每双0.21元起售、180克毛巾拖鞋每双0.76元起售；牙刷每支0.05元起售；牙膏0.03元起售；香皂每克0.01元起售；浴帽每只0.06元起售；梳子每把0.03元起售；洗发液、沐浴液：袋装0.06元起售、瓶装0.15元起售；软管0.20元起售；剃须刀每把0.10元起售；火柴每盒0.09元起售；圆珠笔0.15元起售；擦鞋纸通货0.03起售；塑料口杯套0.10起售；绿茶0.03起售；夹纸笔0.035起售；洗衣袋0.20起售；价格在同行业中最低，有现货。 数量不限，质量保证，欢迎广大新老客户的光临指导",面议,"江苏 扬州市",,,514-87491599,"酒店客房类 客房用品 鞋拔酒店客房类 一次性用品 火柴酒店客房类 一次性用品 拖鞋",514-87491599,http://yzmeiwang.net168.com/,江苏广陵区杭集镇三星路19号
248,16,"2018-08-23 23:23:41",梳子,2,"2018-08-23 23:06:25",一次性用品,1,"2018-08-23 23:06:25",酒店客房类,248,"2018-08-24 02:00:13","专业生产 批发直销 酒店宾馆客房一次性用品 梳子",生产加工,生态科技新城星空旅游用品厂,"品牌 星空旅游用品 货号 可咨询 加印LOGO 可以 加工定制 是 产品类别 梳子 产地 扬州 关于酒店一次性产品 1、简介 酒店一次性用品主要有以下产品：牙具、梳子、剃须刀、香皂、浴帽、洗发液、沐浴液、擦鞋布、针线包、杯垫、杯盖、消毒封条、垃圾袋、火柴、标签笔、软抽纸等。 2、采购注意 随着全球生态环境的日益恶化，保护环境、倡导绿色消费日益受到人们的关注。国务院制定的可持续发展策略以及国家经贸委近期推出的“三绿工程”都对我国饭店行业的可持续发展和环境管理工作提出了要求。同时，由于我国加入了WTO和北京申奥成功后，国际间交流日益频繁，绿色消费已逐渐成为今后消费的主流。为此中国饭店协会也于2006年出台了《绿色饭店标准》。 《绿色饭店标准》较1996年7月11日国家旅游局发布的《星级饭店客房用品质量与配备要求》相比，对客房一次性牙刷、牙膏、香皂等产品的配置提出了新的要求。具体规定如下： 房间的牙刷、梳子、小香皂、拖鞋等一次性客房用品和毛巾、枕套、床单、浴衣等客用棉织品，按顾客意愿更换，减少洗涤次数。 改变（使用可降解的材料）、简化或取消客房内生活、卫浴用品包装。 酒店运营者在采购一次性客房用品时,除了考虑产品成本、通常会忽略一些附加成本。如：堵水管问题、用水问题，洗涤次数等等，这些也应该被采购时考虑进去 牙刷采购应注意 影响牙刷品质的主要因素是刷毛品质与磨毛率，日用牙刷通常三个月更换一支，即使没有经过磨毛处理的牙刷在使用一段时间后，由于刷毛和牙齿的磨合也会形成“自然磨毛”，而一次性牙刷通常只使用2-3次，如果刷毛品质不好或磨毛率不够，将会对口腔造成损伤。因此，酒店用牙刷的质量标准绝对不能比日用牙刷低。 沐浴洗发用品采购应注意 我国是一个严重的缺水国家,是世界人均水资源极少的13个贫水国之一。水也是酒店最重要运营成本之一，如何节约用水是每个酒店都关注的问题。 市场上有种喷墨打印机只卖100多元/台，但当你用完耗材后去购买墨盒却发现，一个墨盒的价钱甚至会超过一台打印机的钱。同样，许多酒店配置的沐浴露虽然自身价格很便宜，但沐浴一次所耗费的热水却数倍于沐浴露自身的价值。 注意:选购沐浴洗发用品时需要考虑耗水程度,也就是用多少水才能彻底冲净.并不是一味追求泡沫丰富。 3成本控制 现酒店行业最为关注的问题之一：一次性消耗品中的六小件是否该为环保让步，在一些城市已经开始部分实行了。在相关部门还未下达取消一次性用品的文件之前，关于一次性消耗品的合理控制有必要提到日常工作中来。酒店现有的一次性消耗品有近20种，这20种是否都为宾客所需？我想并不如此，以下几种情况相信大家都曾发现： 1、牙刷一般都与牙膏成套包装，这对于续住客人来说较为浪费。一般与牙刷配套的牙膏为6g，一早一晚刷一次已经没有了，牙刷可以继续使用，但因为没有牙膏的缘故还是要拆开一副牙具才可以，因为这样的关系无形中加大了一次性用品的消耗，即不节能，更不环保。 建议：1）将牙膏单独放置（因其本身就有包装，无需另行处理），减少不必要的浪费。 2）针对入住时间超过三天的房间专门配备45 g—60g的品牌牙膏， 2、客房内有针线包使用率较低，也较为浪费。据统计，酒店一年共计使用针线包742个，这其中还包括内部使用。且针线包内所附棉线较少，颜色多达五种，需要某一种线时如不够还需另拆一包，所有的针使用一次便扔掉了。 建议：在房务中心备好针线盒，里面有充足的各色棉线、不同型号的针、护指的梭甲、小剪刀等等，宾客有需要时可提供免费租借服务，所有的针及其他物品均可重复使用，取消客房内配备一次性使用的针线包。 3、客房内提供的小香皂是卫生间不可或缺的物品，可供宾客洗手或清洁小件衣物等等。但大部分情况下宾客不能将一整块香皂都使用完，有些甚至拆开洗过手后就不再使用它了。回收后的香皂因体积较小，清洁效果不佳，回收的价值大打折扣。 建议：1）将香皂换成可重复使用的洗手液瓶装后放至客房内，减少浪费，提高酒店档次。 2）如宾客需洗小件衣物，可在卫生间提供有偿的小袋品牌洗衣粉，增强清洁效果。 4、女宾袋的使用率不仅低，而且无实际意义，建议撤掉。 5、客房大便笺夹内放置的信封分为普通信封和航空信封，但全年的使用量不到100个，有部分是因为宾客翻阅时造成的损坏。现与人沟通的渠道不但多样，而且快捷，书信时代已经过去。 建议：在大堂公共区域、商务中心放置信封，如宾客需要可自行拿取，无需放置客房。 如此一来，酒店客房的一次性用品使用成本可由原来的17.48降至16元左右。此外，除了减少客房内不必要的一次性用品的品种，还需要注意一次性用品的库存方式。现酒店采用的是短期库存预测法，即：根据前一个月的使用量及本月的预订情况制定本月一次性用品的采购数量，一般周期为一个月或两个月，不超过三个月。短期库存预测法的好处在于减少库存，流动资金较为灵活，不会造成部分不易保存物品的变质及过期。在采购时针对部分易变质的物品品种进行数量的控制，以减少物品的报损率。在淡、旺季节时对一次性物品的采购做到因时区分，淡季时物品少采购些，旺季时提前采购备货。这样可以让财务空出部分流动资金作为它用，而且在旺季时不会出现货不到位、价格飞涨现象。 在一次性用品的保存方面也需引起注意，客房部的二级仓库尽量选取较为干燥的地方对物品进行保存。酒店曾将客房部二级仓库放置于地下室，此举较为不妥，对物品的保存不利。6月份时曾出现香皂发霉，火柴受潮不能使用等现象。 除了以上客观因素上能减少一次性用品的使用量外，对这些易耗品的控制方法还有如下几种： 1、 明确责任人。将领用一次性用品的权限回收至各区域领班，规定每周至二级仓库领取一次。各区域领班根据各栋工作间所剩物品及下周预订情况酌情进行领用。 2、 按标准配发。每个工作间的配备量以物品一周的平均用量作为固定存储量，并按配置的10%配发至名区域作为机动。 3、 严格申领制度。各区域负责人领取物品时必须填写上周各物品各类的余数，并将本周领取的物品数量做详细登记，签字确认。 4、 实行奖惩制度。根据各栋每月的实际入住量，统计各栋实际使用的一次性物品使用量，依照酒店一次性物品的标准配备使用量，如超出标准配备的10%将给予处罚。年底时统计全年应用数量及实际使用数量，节约下来的金额抽出10%--15%给员工当作奖励。 5、 及时盘存。实行一周一小盘，一月一大盘制度，及时了解所有物品的消耗情况。 6、 各管理人员抓好物品的节省和再利用工作，做到物尽其用，发挥其最大利用价值。 相信在各方的努力下，定能将一次性用品的消耗量降低。做到科学管理、加强环保、提升服务质量、减少酒店成本投资。 4好处坏处 酒店一次性用品主要包括牙刷、牙膏、拖鞋、梳子、瓶装洗发水和沐浴液，它已经成为人们生活的一部分，不知从什么时候开始，使用一次性日用品成为一种卫生时尚。酒店一次性用品既方便了我们的生活同时又污染了环境，看来酒店一次性用品是既有好的一面又有不利的一面。 酒店是一个大众性的场所，人们在酒店过夜的时候很担心染上什么感染性的疾病，酒店一次性用品的提供则完全消除了人们这方面的担心。酒店一次性用品的配置方便了在酒店过夜的客人，他们不需要再为一些洗漱用品伤脑筋了。 宾馆酒店提供的一次性日用品为旅客带来方便的同时，惊人浪费已经成为大家有目共睹的事实，牙膏、香皂是酒店里浪费最严重的一次性物品。尤其是一次性香皂，一块大约25克，客人入住一天一般只使用四分之一左右，剩下的就连同包装一起扔掉了，第二天再换新的，牙膏、沐浴露等也是如此。 这不仅造成严重的资源浪费，而且对其焚烧或者填埋都会造成新的污染源，加重了环境污染治理的压力。对资源的充分利用和环境保护有很大的负面影响，所以，降低一次性用品的更换频率、减少一次性用品的提供种类、朝着环保的方向去努力……已经成为业界的共识。 由此看来酒店一次性用品的使用是弊大于利的，值得注意的是，世界上许多发达国家和地区使用一次性日用品都呈下降趋势，相对而言，作为人均资源相对贫乏的我国，不仅是一次性日用品的消费大国，同时也是生产和出口大国。这不能不引起我们对这个问题的反思。当然，减少一次性日用品的使用，仅靠消费者的自觉和相关供应厂商的自律是不够的，更重要的还要靠政府的有关部门在一次性日用品的市场需求和资源消耗之间找到一个平衡点。 5市场分析 随着节能环保经济概念的提出，一次性用品逐渐的开始从市场上消失，然而针对于酒店这个特殊的场所，考虑一次性用品取消的同时，也要兼顾消费者的实际体验，酒店对于消费者能否接受有所担心和忧虑。 同时，在酒店住宿市场的长短也影响了顾客对于小树用品的需求程度，外出时间较长的人都选择自带，而住宿一两天的旅客则表示不会使用酒店提供的一次性洗漱用品。而且，以家庭为单位出游的消费者更多的偏向于自带洗漱品。 就市场的发展而言，取消酒店一次性用品肯定会造成一定的影响，但是对于长远的发展还是有益处的，这个过渡期将会很长，政府应该出台一些细则，并鼓励酒店企业主动取消一次性用品的提供，真正的从根本上实现可持续性发展。 6采购指南 有机构统计过在酒店一次性用品的使用率，拖鞋最高，超过90%；其次是牙刷，达到80%；然后是洗发液、沐浴液，有50%-60%；其他如护理包、擦鞋布等等使用率都较低。 一次性牙刷是酒店一次性用品中必不可少的一种，在日常生活中，可以没有护理包、针线包、擦鞋布等等，但是却不能没有牙刷， 牙刷，这是酒店一次性用品里面必不可少的一款产品，在宾馆酒店里每一天早上起来，你可以没有护理包，没有针线包，没有擦鞋布这些小东西，但是牙刷却是你不能没有的。 一次性牙刷按照牙刷柄的材料来分，可以分为软塑牙刷，硬塑牙刷； 按照牙刷毛来区分，可以分为磨尖丝牙刷，尼龙牙刷，榆树丝牙刷，仿尼龙牙刷，丝王（丙丝）牙刷； 按照牙刷的款式来分主要有蛇头牙刷，树叶牙刷，美人鱼牙刷，弯把牙刷，磨砂佳洁士牙刷，半圆佳洁士牙刷，大平板牙刷，企鹅牙刷，鞋拔型牙刷，罗马柱牙刷等。 问题一:牙刷材料如何区分？ 上面提到，牙刷的材料主要分为软塑和硬塑，那么怎么区分这两种材料呢？我在这里为大家提供一种简单又实用的方法：大家可以将一支牙刷以自由落体的方式丢到地面上，如果牙刷落地声音清脆并且反弹的高度较高，那么这支牙刷柄的材料就是硬塑；相反，如果一支牙刷落地后没有反弹，没有清脆的掷地声，那么这支牙刷就是软塑的。此外，同款式同规格的牙刷，硬塑比软塑的易折断。 问题二：不同的软塑和硬塑材料牙刷是否在质量上存在区别? 两种材料是为了适应不同款式梳子的市场需要而衍生出来的，特定的款式只能使用固定的原材料，两种材料在质量上不存在任何差异。打给比方说，你想要做一支双色或者是纯透明的牙刷，那么你就必须是使用硬塑，没有其他的为什么，这是产品的生产工艺问题，又或者你想做出有半透明效果的牙刷，那么你就得选择软塑的原材料。 问题三:牙刷毛如何区分？ 牙刷毛可按照刷毛的柔软度进行区分，首当其冲的事磨尖丝，下面依次是尼龙毛，榆树丝，仿尼龙，丝王（丙丝），详情可以进本人产品相册，我为大家分别拍摄了几张牙刷毛的图片供朋友们进行简单的区分;第二个方法就是牙刷毛揉捏起来的手感。当然，最好的还是自己去把不同牙刷毛的牙刷亲身试用一下。 问题四：一次性牙刷的价格是如何计算的？ 牙刷是由牙刷柄和牙刷毛组成的，牙刷价格按克重计算， 在得到克重之后需要区分牙刷柄是属于哪种材料，牙刷毛属于那一款，在上面的问题都解决之后一支牙刷的价格就出来了。",面议,"江苏 扬州市",,,0514-87271665,"酒店客房类 一次性用品 牙膏酒店客房类 一次性用品 香皂酒店客房类 一次性用品 有偿用品酒店客房类 一次性用品 面巾纸",0514-87271665,http://xingkong.net168.com/,江苏扬州市杭集
249,16,"2018-08-23 23:23:41",梳子,2,"2018-08-23 23:06:25",一次性用品,1,"2018-08-23 23:06:25",酒店客房类,249,"2018-08-24 02:00:18","酒店一次性用品厂家专业生产直供 宾馆客房一次性用具 梳子",生产加工,生态科技新城星空旅游用品厂,"品牌 星空旅游用品 货号 可咨询 加印LOGO 可以 加工定制 是 产品类别 梳子 产地 扬州 关于酒店一次性产品 1、简介 酒店一次性用品主要有以下产品：牙具、梳子、剃须刀、香皂、浴帽、洗发液、沐浴液、擦鞋布、针线包、杯垫、杯盖、消毒封条、垃圾袋、火柴、标签笔、软抽纸等。 2、采购注意 随着全球生态环境的日益恶化，保护环境、倡导绿色消费日益受到人们的关注。国务院制定的可持续发展策略以及国家经贸委近期推出的“三绿工程”都对我国饭店行业的可持续发展和环境管理工作提出了要求。同时，由于我国加入了WTO和北京申奥成功后，国际间交流日益频繁，绿色消费已逐渐成为今后消费的主流。为此中国饭店协会也于2006年出台了《绿色饭店标准》。 《绿色饭店标准》较1996年7月11日国家旅游局发布的《星级饭店客房用品质量与配备要求》相比，对客房一次性牙刷、牙膏、香皂等产品的配置提出了新的要求。具体规定如下： 房间的牙刷、梳子、小香皂、拖鞋等一次性客房用品和毛巾、枕套、床单、浴衣等客用棉织品，按顾客意愿更换，减少洗涤次数。 改变（使用可降解的材料）、简化或取消客房内生活、卫浴用品包装。 酒店运营者在采购一次性客房用品时,除了考虑产品成本、通常会忽略一些附加成本。如：堵水管问题、用水问题，洗涤次数等等，这些也应该被采购时考虑进去 牙刷采购应注意 影响牙刷品质的主要因素是刷毛品质与磨毛率，日用牙刷通常三个月更换一支，即使没有经过磨毛处理的牙刷在使用一段时间后，由于刷毛和牙齿的磨合也会形成“自然磨毛”，而一次性牙刷通常只使用2-3次，如果刷毛品质不好或磨毛率不够，将会对口腔造成损伤。因此，酒店用牙刷的质量标准绝对不能比日用牙刷低。 沐浴洗发用品采购应注意 我国是一个严重的缺水国家,是世界人均水资源极少的13个贫水国之一。水也是酒店最重要运营成本之一，如何节约用水是每个酒店都关注的问题。 市场上有种喷墨打印机只卖100多元/台，但当你用完耗材后去购买墨盒却发现，一个墨盒的价钱甚至会超过一台打印机的钱。同样，许多酒店配置的沐浴露虽然自身价格很便宜，但沐浴一次所耗费的热水却数倍于沐浴露自身的价值。 注意:选购沐浴洗发用品时需要考虑耗水程度,也就是用多少水才能彻底冲净.并不是一味追求泡沫丰富。 3成本控制 现酒店行业最为关注的问题之一：一次性消耗品中的六小件是否该为环保让步，在一些城市已经开始部分实行了。在相关部门还未下达取消一次性用品的文件之前，关于一次性消耗品的合理控制有必要提到日常工作中来。酒店现有的一次性消耗品有近20种，这20种是否都为宾客所需？我想并不如此，以下几种情况相信大家都曾发现： 1、牙刷一般都与牙膏成套包装，这对于续住客人来说较为浪费。一般与牙刷配套的牙膏为6g，一早一晚刷一次已经没有了，牙刷可以继续使用，但因为没有牙膏的缘故还是要拆开一副牙具才可以，因为这样的关系无形中加大了一次性用品的消耗，即不节能，更不环保。 建议：1）将牙膏单独放置（因其本身就有包装，无需另行处理），减少不必要的浪费。 2）针对入住时间超过三天的房间专门配备45 g—60g的品牌牙膏， 2、客房内有针线包使用率较低，也较为浪费。据统计，酒店一年共计使用针线包742个，这其中还包括内部使用。且针线包内所附棉线较少，颜色多达五种，需要某一种线时如不够还需另拆一包，所有的针使用一次便扔掉了。 建议：在房务中心备好针线盒，里面有充足的各色棉线、不同型号的针、护指的梭甲、小剪刀等等，宾客有需要时可提供免费租借服务，所有的针及其他物品均可重复使用，取消客房内配备一次性使用的针线包。 3、客房内提供的小香皂是卫生间不可或缺的物品，可供宾客洗手或清洁小件衣物等等。但大部分情况下宾客不能将一整块香皂都使用完，有些甚至拆开洗过手后就不再使用它了。回收后的香皂因体积较小，清洁效果不佳，回收的价值大打折扣。 建议：1）将香皂换成可重复使用的洗手液瓶装后放至客房内，减少浪费，提高酒店档次。 2）如宾客需洗小件衣物，可在卫生间提供有偿的小袋品牌洗衣粉，增强清洁效果。 4、女宾袋的使用率不仅低，而且无实际意义，建议撤掉。 5、客房大便笺夹内放置的信封分为普通信封和航空信封，但全年的使用量不到100个，有部分是因为宾客翻阅时造成的损坏。现与人沟通的渠道不但多样，而且快捷，书信时代已经过去。 建议：在大堂公共区域、商务中心放置信封，如宾客需要可自行拿取，无需放置客房。 如此一来，酒店客房的一次性用品使用成本可由原来的17.48降至16元左右。此外，除了减少客房内不必要的一次性用品的品种，还需要注意一次性用品的库存方式。现酒店采用的是短期库存预测法，即：根据前一个月的使用量及本月的预订情况制定本月一次性用品的采购数量，一般周期为一个月或两个月，不超过三个月。短期库存预测法的好处在于减少库存，流动资金较为灵活，不会造成部分不易保存物品的变质及过期。在采购时针对部分易变质的物品品种进行数量的控制，以减少物品的报损率。在淡、旺季节时对一次性物品的采购做到因时区分，淡季时物品少采购些，旺季时提前采购备货。这样可以让财务空出部分流动资金作为它用，而且在旺季时不会出现货不到位、价格飞涨现象。 在一次性用品的保存方面也需引起注意，客房部的二级仓库尽量选取较为干燥的地方对物品进行保存。酒店曾将客房部二级仓库放置于地下室，此举较为不妥，对物品的保存不利。6月份时曾出现香皂发霉，火柴受潮不能使用等现象。 除了以上客观因素上能减少一次性用品的使用量外，对这些易耗品的控制方法还有如下几种： 1、 明确责任人。将领用一次性用品的权限回收至各区域领班，规定每周至二级仓库领取一次。各区域领班根据各栋工作间所剩物品及下周预订情况酌情进行领用。 2、 按标准配发。每个工作间的配备量以物品一周的平均用量作为固定存储量，并按配置的10%配发至名区域作为机动。 3、 严格申领制度。各区域负责人领取物品时必须填写上周各物品各类的余数，并将本周领取的物品数量做详细登记，签字确认。 4、 实行奖惩制度。根据各栋每月的实际入住量，统计各栋实际使用的一次性物品使用量，依照酒店一次性物品的标准配备使用量，如超出标准配备的10%将给予处罚。年底时统计全年应用数量及实际使用数量，节约下来的金额抽出10%--15%给员工当作奖励。 5、 及时盘存。实行一周一小盘，一月一大盘制度，及时了解所有物品的消耗情况。 6、 各管理人员抓好物品的节省和再利用工作，做到物尽其用，发挥其最大利用价值。 相信在各方的努力下，定能将一次性用品的消耗量降低。做到科学管理、加强环保、提升服务质量、减少酒店成本投资。 4好处坏处 酒店一次性用品主要包括牙刷、牙膏、拖鞋、梳子、瓶装洗发水和沐浴液，它已经成为人们生活的一部分，不知从什么时候开始，使用一次性日用品成为一种卫生时尚。酒店一次性用品既方便了我们的生活同时又污染了环境，看来酒店一次性用品是既有好的一面又有不利的一面。 酒店是一个大众性的场所，人们在酒店过夜的时候很担心染上什么感染性的疾病，酒店一次性用品的提供则完全消除了人们这方面的担心。酒店一次性用品的配置方便了在酒店过夜的客人，他们不需要再为一些洗漱用品伤脑筋了。 宾馆酒店提供的一次性日用品为旅客带来方便的同时，惊人浪费已经成为大家有目共睹的事实，牙膏、香皂是酒店里浪费最严重的一次性物品。尤其是一次性香皂，一块大约25克，客人入住一天一般只使用四分之一左右，剩下的就连同包装一起扔掉了，第二天再换新的，牙膏、沐浴露等也是如此。 这不仅造成严重的资源浪费，而且对其焚烧或者填埋都会造成新的污染源，加重了环境污染治理的压力。对资源的充分利用和环境保护有很大的负面影响，所以，降低一次性用品的更换频率、减少一次性用品的提供种类、朝着环保的方向去努力……已经成为业界的共识。 由此看来酒店一次性用品的使用是弊大于利的，值得注意的是，世界上许多发达国家和地区使用一次性日用品都呈下降趋势，相对而言，作为人均资源相对贫乏的我国，不仅是一次性日用品的消费大国，同时也是生产和出口大国。这不能不引起我们对这个问题的反思。当然，减少一次性日用品的使用，仅靠消费者的自觉和相关供应厂商的自律是不够的，更重要的还要靠政府的有关部门在一次性日用品的市场需求和资源消耗之间找到一个平衡点。 5市场分析 随着节能环保经济概念的提出，一次性用品逐渐的开始从市场上消失，然而针对于酒店这个特殊的场所，考虑一次性用品取消的同时，也要兼顾消费者的实际体验，酒店对于消费者能否接受有所担心和忧虑。 同时，在酒店住宿市场的长短也影响了顾客对于小树用品的需求程度，外出时间较长的人都选择自带，而住宿一两天的旅客则表示不会使用酒店提供的一次性洗漱用品。而且，以家庭为单位出游的消费者更多的偏向于自带洗漱品。 就市场的发展而言，取消酒店一次性用品肯定会造成一定的影响，但是对于长远的发展还是有益处的，这个过渡期将会很长，政府应该出台一些细则，并鼓励酒店企业主动取消一次性用品的提供，真正的从根本上实现可持续性发展。 6采购指南 有机构统计过在酒店一次性用品的使用率，拖鞋最高，超过90%；其次是牙刷，达到80%；然后是洗发液、沐浴液，有50%-60%；其他如护理包、擦鞋布等等使用率都较低。 一次性牙刷是酒店一次性用品中必不可少的一种，在日常生活中，可以没有护理包、针线包、擦鞋布等等，但是却不能没有牙刷， 牙刷，这是酒店一次性用品里面必不可少的一款产品，在宾馆酒店里每一天早上起来，你可以没有护理包，没有针线包，没有擦鞋布这些小东西，但是牙刷却是你不能没有的。 一次性牙刷按照牙刷柄的材料来分，可以分为软塑牙刷，硬塑牙刷； 按照牙刷毛来区分，可以分为磨尖丝牙刷，尼龙牙刷，榆树丝牙刷，仿尼龙牙刷，丝王（丙丝）牙刷； 按照牙刷的款式来分主要有蛇头牙刷，树叶牙刷，美人鱼牙刷，弯把牙刷，磨砂佳洁士牙刷，半圆佳洁士牙刷，大平板牙刷，企鹅牙刷，鞋拔型牙刷，罗马柱牙刷等。 问题一:牙刷材料如何区分？ 上面提到，牙刷的材料主要分为软塑和硬塑，那么怎么区分这两种材料呢？我在这里为大家提供一种简单又实用的方法：大家可以将一支牙刷以自由落体的方式丢到地面上，如果牙刷落地声音清脆并且反弹的高度较高，那么这支牙刷柄的材料就是硬塑；相反，如果一支牙刷落地后没有反弹，没有清脆的掷地声，那么这支牙刷就是软塑的。此外，同款式同规格的牙刷，硬塑比软塑的易折断。 问题二：不同的软塑和硬塑材料牙刷是否在质量上存在区别? 两种材料是为了适应不同款式梳子的市场需要而衍生出来的，特定的款式只能使用固定的原材料，两种材料在质量上不存在任何差异。打给比方说，你想要做一支双色或者是纯透明的牙刷，那么你就必须是使用硬塑，没有其他的为什么，这是产品的生产工艺问题，又或者你想做出有半透明效果的牙刷，那么你就得选择软塑的原材料。 问题三:牙刷毛如何区分？ 牙刷毛可按照刷毛的柔软度进行区分，首当其冲的事磨尖丝，下面依次是尼龙毛，榆树丝，仿尼龙，丝王（丙丝），详情可以进本人产品相册，我为大家分别拍摄了几张牙刷毛的图片供朋友们进行简单的区分;第二个方法就是牙刷毛揉捏起来的手感。当然，最好的还是自己去把不同牙刷毛的牙刷亲身试用一下。 问题四：一次性牙刷的价格是如何计算的？ 牙刷是由牙刷柄和牙刷毛组成的，牙刷价格按克重计算， 在得到克重之后需要区分牙刷柄是属于哪种材料，牙刷毛属于那一款，在上面的问题都解决之后一支牙刷的价格就出来了。",面议,"江苏 扬州市",,,0514-87271665,"酒店客房类 一次性用品 牙膏酒店客房类 一次性用品 香皂酒店客房类 一次性用品 有偿用品酒店客房类 一次性用品 面巾纸",0514-87271665,http://xingkong.net168.com/,江苏扬州市杭集