category_3_x_jiudian_yongpin.id,category_3.id,category_3.ts,category_3.title,category_2.id,category_2.ts,category_2.title,category_1.id,category_1.ts,category_1.title,jiudian_yongpin.id,jiudian_yongpin.ts,jiudian_yongpin.title,jiudian_yongpin.jingying_moshi,jiudian_yongpin.gongsi,jiudian_yongpin.chanpin_jieshao,jiudian_yongpin.chanpin_danjia,jiudian_yongpin.suozai_diqu,jiudian_yongpin.zuixiao_qiding,jiudian_yongpin.gonghuo_zongliang,jiudian_yongpin.lianxi_dianhua,jiudian_yongpin.zhuying_cahnpin,jiudian_yongpin.dianhua,jiudian_yongpin.shangpu_wangzhi,jiudian_yongpin.dizhi
1,1,"2018-08-23 23:21:44",挂牌,1,"2018-08-23 23:06:25",客房用品,1,"2018-08-23 23:06:25",酒店客房类,1,"2018-08-24 01:50:17",2017广州酒店用品展览会,商务服务,广州佛兴展览服务有限公司,"2017第二十四届广州国际酒店用品展览会 第二十四届广州国际食品饮料展览会 第二十四届广州国际厨房设备用品展览会 第二十四届广州国际清洁设备用品展览会 时间：2017年12月13日-15日电话：020- 87623656 13794375821 项目经理：李健荣 网址：www.gzhoshow.com 地址：中国进出口商品交易会琶洲展馆A、B、C区三十个展馆，32万平方米 2017第二十三届广州酒店用品展览会已发展成为世界规模最大的酒店用品展览会是行业风向标。一年一届的广州酒店用品展亦成为世界酒店用品业的焦点，吸引着全球酒店采购商精英的眼球。本届展会分八大主题展区（桌面用品、清洁设备用品、酒店大堂用品、厨房设备用品、食品饮料、客房用品、酒店家具、酒店智能产品），展览面积约32万平方米，聚集全世界的高端展商4000多家。群英汇聚，品牌林立。产品种类更加丰富，参展企业来源更加广泛，看点更多，亮点更亮。现场人气火爆，洽谈热烈，成交踊跃，吸引了三十多万名专业买家到会采购，其中包括来自120多个国家和地区的海外买家上万人。为中国酒店用品企业搭建一个更加专业、更加广阔的舞台，为繁荣中国酒店用品市场、推动中国酒店用品出口注入新的力量。 作为行业年度行业盛事，每届酒店用品展览会都是主流媒体与行业的焦点。本届展会广东佛兴展览服务有限公司邀请相关专业的杂志、门户网站、网络推广平台、走访各地卖场、组织行业活动、等一系列立体式的宣传推广。 一、展会日程安排： 1、2017年12月10-125日厂商报到、布展（上午9时至下午5时）； 2、2017年12月13-15日客商洽谈订货； 3、2017年12月15日下午撤展。 二、展位收费标准： 1、 每个9平方米的标准展位，收人民币7800元，1.1-5.1馆收人民币8800元（角位加收20%）展位内配一张台、两张凳、一支光管、一个电源插座，公司名称楣板一条。 2、 光地，每9平方米，收人民币7400元，1.1-5.1馆收人民币8400元,须27平方米起租，不配任何设备。另向展馆支付搭建管理费每平方米30元，向展馆支付电箱费和电费。 三、参展产品范围 ▲厨房餐饮设备用品展区 中西厨设备、厨房炉灶、宴会餐炉、不锈钢厨具、电磁炉、快餐设备、烘焙设备、制冷设备、冷藏柜、保鲜柜、保鲜膜、保鲜铝箔、食品机械、洗碗机、制冰机、热水器、排风设备、环保设备、啤酒设备 ▲酒店家具展区 酒店餐饮家具、酒店套房家具、酒店包房家具、酒店沙发、酒店床垫、仿古装饰家具、宴会家具、户外家具、休闲家具、电动餐桌、电磁炉餐桌等 ▲桌面用品展区 不锈钢餐具、竹木餐具、陶瓷餐具、玻璃餐具、美耐皿餐具、料理用具、酒精炉、玻璃器皿、玻璃转盘、金银器、筷子类 ▲客房、配套电器、钛金及大堂用品展区 酒店电视机、电话机、保险箱、电子门锁、水壶、易耗品、房物服务车、餐车、床头控制系统、客房灯具、雨伞架、演讲咨客台、大堂指示牌、棕榈树、雕塑装饰 ▲清洁及洗衣设备展区 洗地机、抛光机、擦地机、电子打泡箱、吸水机、吹风机、吸尘器、垃圾桶、尘推、地垫、清洁剂、洗涤剂、洗手液、皂液机、干肤器、石材护理设备、空气清新机、洗衣房设备 ▲纺织布艺、制服展区 床上用品、台布、台垫、餐巾、浴巾、地毯、洗衣袋、羽绒制品、酒店布草、酒店制服 ▲咖啡和茶、食品展区 咖啡机、咖啡食品、咖啡器具、茶具、茶系列、酒水、饮料、汤品、调味品、健康食品 ▲其它展区 酒店、餐饮系列软件、POS终端显示系统、酒店会议、娱乐、监控系统、感应系列产品、康体智能设备、媒体等 四、企业报名参展注意的事项： 1、参展企业须填写《参展申请表》，加盖公司章后传真或邮寄给我公司。 2、我公司收到《参展申请表》后，即为参展企业签定协议。 3、 参展协议书签定后，参展商在5天内应付展位费的50%作为参展订金，余款在展会开幕前两个月付清。逾期不付，承办单位不保障确认之展位。展位变动敬请原谅。 4、参展企业支付展位费时，请通过银行汇款，用支票时，请在支票抬头填写承办单位名称，请勿付现金和无抬头支票。否则由此造成的经济损失，均由参展企业负责。 5、收款单位：广东佛兴展览服务有限公司 开户行：中国建设银行广州市五羊新城支行 帐号：44001400905050077062 六、承办单位地址及电话： 广东佛兴展览服务有限公司 地址：中国广州市达道路16号广州军区影视大厦328室 邮编：510600 电话：（020）87623656 传真：（020）66296578 项目经理：李健荣　　手机：13794375821 QQ: 1533829121 MSN:gzhoshow@hotmail.com 网址: www.gzhoshow.com 广州名欧展览服务有限公司是一家集大型会议展览策划组织、展台设计制作、工程搭建为一体的专业化展览公司。我司是承办全国规模最大的广州酒店用品展览会并是指定特装搭建商。我司还承接广交会、广州家具展览会、广州建材展览会、广州灯饰展览会、广州美容美发展览会、广州烘焙展等一系列大中型展会展位设计搭建服务。公司依托多年承办全国规模最大的广州酒店用品展览会的优势经验，持续秉承“信誉第一、服务高效、设计创新”的经营理念，顺应产业发展、关注客户需要，致力于进一步为广大客户提供更专业、优质的会展综合服务。 名欧汇聚了一批高素质的项目人员、策划人员、设计师及完善的专业制作工厂.能为客户提供尽善尽美的专业服务；我们力求以最合理的价格提供最优质的服务，实现让客户最满意的个性化服务。 地址：中国广州市天河区黄村西华里八巷8号 邮编：510600 电话：（020）87623656 传真：（020）66296578 QQ: 1752233981 MSN:gzhoshow@hotmail.com 网址: www.gzhoshow.com",面议,"广东 广州市",,,020-87623656,"酒店客房类 客房用品 挂牌",020-87623656,http://fxstation.net168.com/,广州市越秀区达道路16号军区影视大厦328室
2,1,"2018-08-23 23:21:44",挂牌,1,"2018-08-23 23:06:25",客房用品,1,"2018-08-23 23:06:25",酒店客房类,2,"2018-08-24 01:50:20","现货批发亚克力欢迎光临银联标志挂牌 店铺营业中双面银联标识牌",生产加工,苍南县君瑞制衣厂,"（图为一个牌子的正反面内容） 现特价超值热卖！一件起拍！全部批发价格！ 以上为实物拍摄，实物更精美！ 材质：高度透明亚克力 工艺：精美夹层丝印，永不褪色 规格：300*150mm 送配件！ 此链接有3种款式内容，亲拍下后请告知客服需要的内容，否则随机发送哦！ 详情图片如下！",面议,"浙江 温州市",,,13057700076,"酒店客房类 客房用品 挂牌酒店客房类 客房用品 提示牌酒店客房类 客房用品 广告牌",13057700076,http://junrui.net168.com/,浙江苍南县钱库镇小云兜村委大楼5间
3,1,"2018-08-23 23:21:44",挂牌,1,"2018-08-23 23:06:25",客房用品,1,"2018-08-23 23:06:25",酒店客房类,3,"2018-08-24 01:50:22",包邮高档亚克力营业中马上回来营业时间有事外出双面创意挂牌门牌,生产加工,苍南县君瑞制衣厂,"长期有货，可直接拍下！ 正反面不一样内容， 可写营业时间或者联系电话 自行打印纸片裁剪放入可更换式设计 选项为一个牌子的正面和反面 （配送吸盘和链子）！ 规格：250*150mm 材质：高档透明亚克力 工艺：精美丝网印刷 本品特价不议价，量大可定制。",面议,"浙江 温州市",,,13057700076,"酒店客房类 客房用品 挂牌酒店客房类 客房用品 提示牌酒店客房类 客房用品 广告牌",13057700076,http://junrui.net168.com/,浙江苍南县钱库镇小云兜村委大楼5间
4,1,"2018-08-23 23:21:44",挂牌,1,"2018-08-23 23:06:25",客房用品,1,"2018-08-23 23:06:25",酒店客房类,4,"2018-08-24 01:50:25","厂家定做亚克力挂牌酒店宾馆请勿打扰 请即打扫房门 亚克力",生产加工,苍南县昌荣亚克力制品厂,"加工定制 是 印刷形式 丝印 规格 按客户要求订 材质 亚克力 适用范围 各大宾馆酒店等 品牌 昌荣工艺 材质：亚克力 规格：98*230mm 可按客户要求定做 工艺：精美夹层双面丝印，永不褪色 上图这款有现货零卖，量大购买需提前订购！ 也可定做其他样式，PVC材质酒店用请勿打扰，请即打扫房间挂牌 可免费设计",面议,"浙江 温州市",,,13587804103,"酒店客房类 客房用品 挂牌酒店客房类 客房用品 价目表酒店客房类 客房用品 标示牌",13587804103,http://rongya.net168.com/,"中国 浙江 温州 苍南县 钱库镇工贸路216号"
5,1,"2018-08-23 23:21:44",挂牌,1,"2018-08-23 23:06:25",客房用品,1,"2018-08-23 23:06:25",酒店客房类,5,"2018-08-24 01:50:28","新款上市高档亚克力标识牌 暂停营业内设空调营业中休息中挂牌",生产加工,苍南县昌荣亚克力制品厂,"加工定制 是 印刷形式 丝印 规格 250*125mm 材质 亚克力 适用范围 各大商场 品牌 昌荣工艺 高档特大号亚克力双面挂牌 内设空调 欢迎光临指示牌 营业中门牌 款式1：正面（谢绝议价），反面（概不退还）——金色 款式2：正面（营业中），反面（马上回来）——金色 款式3：正面（营业中），反面（休息中）——银白色 款式4：正面（营业中），反面（休息中）——黑色 款式5：正面（内设空调），反面（暂停营业）—黑色 款式6：正面（马上回来），反面（新款上市）—黑色 款式7：正面（同行免进），反面（欢迎光临）—黑色 款式8：正面（会议中），反面（推门请进）——银白色 详情请对照图片！ 以上为实物拍摄，实物更精美！ 店铺经营装饰必备！ 温馨提示：牌子上有透明保护膜，这个需要撕开，请不要误以为是划痕哦！谢谢 请不要错过，售完为止！ 材质：高度透明亚克力 工艺：精美夹层丝印，永不褪色 规格：250*125mm 为方便亲们使用方便，配件免费赠送，自行组装！ 详情图片如下！",面议,"浙江 温州市",,,13587804103,"酒店客房类 客房用品 挂牌酒店客房类 客房用品 价目表酒店客房类 客房用品 标示牌",13587804103,http://rongya.net168.com/,"中国 浙江 温州 苍南县 钱库镇工贸路216号"
6,1,"2018-08-23 23:21:44",挂牌,1,"2018-08-23 23:06:25",客房用品,1,"2018-08-23 23:06:25",酒店客房类,6,"2018-08-24 01:50:28","现货开关状态指示牌 开闭挂牌 管道标识挂牌设备阀门常开常闭牌",生产加工,苍南县昌荣亚克力制品厂,"建议零售价 ¥2.20 材质 压克力(亚克力) 工艺 印刷 品牌 昌荣工艺 产品编号 50-1-2 类别 几何形状 摆挂形式 挂饰 包装 PP袋独立包装 产地 浙江 加印LOGO 可以 是否专利货源 否 是否进口 否 尺寸 9X3.5CM 表面工艺 印刷 属性 565 制作工艺 雕刻 【宝贝名称】亚克力开闭挂牌 【宝贝数量】旺谈 【宝贝规格】9X3.5CM 【交货日期】有现货 　　产品为丝网印刷，层层之间胶性很好，产品颜色鲜艳，光泽度超好，不起泡、不退色，质量有保证，买家可以根据自己的喜好制定产品，下单时可发CDR或AI格式，如有需要卖家可帮你设计，免费设计！ 商务QQ:278389518 手机：13587804103 苍南县昌荣亚克力制品厂是专业从事有机玻璃（亚克力）产品设计制作的生产制造商。 创建于2006年，有多年的生产实践经验，本厂现拥有美国进口的大型CNC高速数控加工中心多台、抛光机多台、配套有台湾原产的大型数控裁板机、雕刻机、火焰烧光机、喷砂机、拆弯机，丝印生产流水线等先进的有机玻璃深加工设备，确保了生产的高效稳定。 本厂生产设备齐全、资金力量雄厚、技术先进，在产品深加工上拥有一批经验丰富的专业技术人员，拥有完善的管理体系，实行现代化生产管理。熟练掌握出口产品的批量生产工艺，在亚克力深加工、开模、成形、喷砂、喷油、雕刻、丝印、热弯、无缝粘接等加工技术上有自己独创的方法，能很好的控制生产成本和保证产品的高质量,产品主要外销欧美及日本市场。 产品范围：产品陈列架，展示道具，展示架，标识指示牌，形象促销用品，奖牌奖座，机械设备仪器面板，物业牌，酒水牌，包装盒，烟酒包装，化装品柜，各种小礼品，资料盒，POP牌等各类有机玻璃工艺制品。 本厂始终奉行“以人为本，诚信为基，科技创新”的企业经营理念，为客户提供最完美的产品，最贴心的服务！欢迎广大客户来决、来图、来样生产。 苍南县昌荣亚克力制品厂坐落于风景秀丽的江南水乡——温州苍南，地址：浙江省苍南县钱库镇工贸路216号 电话；13587804103 联系人；陈先生《经理",面议,"浙江 温州市",,,13587804103,"酒店客房类 客房用品 挂牌酒店客房类 客房用品 价目表酒店客房类 客房用品 标示牌",13587804103,http://rongya.net168.com/,"中国 浙江 温州 苍南县 钱库镇工贸路216号"
7,1,"2018-08-23 23:21:44",挂牌,1,"2018-08-23 23:06:25",客房用品,1,"2018-08-23 23:06:25",酒店客房类,7,"2018-08-24 01:50:32",供应宾馆酒店客房用品门挂牌、PP标示牌,生产加工,深圳市金晟丰塑胶制品有限公司,"印刷形式 根据要求 规格 定做 适用范围 各种标示牌 材质 PP PVC",面议,"广东 东莞市",,,18926055006,"酒店客房类 客房用品 挂牌酒店客房类 客房用品 笔筒酒店客房类 客房用品 鞋拔酒店客房类 客房用品 价目表",18926055006,http://jinsheng.net168.com/,广东深圳观澜镇新田元一村元水路78号
8,1,"2018-08-23 23:21:44",挂牌,1,"2018-08-23 23:06:25",客房用品,1,"2018-08-23 23:06:25",酒店客房类,8,"2018-08-24 01:50:33",供应客房用品门挂牌，宾馆门挂牌，PP挂牌(图),生产加工,深圳市金晟丰塑胶制品有限公司,"印刷形式 柯式印刷 规格 定做 材质 PP PVC PET 适用范围 酒店商场标示牌",面议,"广东 东莞市",,,18926055006,"酒店客房类 客房用品 挂牌酒店客房类 客房用品 笔筒酒店客房类 客房用品 鞋拔酒店客房类 客房用品 价目表",18926055006,http://jinsheng.net168.com/,广东深圳观澜镇新田元一村元水路78号
9,1,"2018-08-23 23:21:44",挂牌,1,"2018-08-23 23:06:25",客房用品,1,"2018-08-23 23:06:25",酒店客房类,9,"2018-08-24 01:50:34",供应PP酒店客房用品门挂牌、PVC指示牌，PP挂卡，PP吊牌,生产加工,深圳市金晟丰塑胶制品有限公司,"加工定制 是 印刷形式 按客户要求 规格 可定制 材质 PVC",面议,"广东 东莞市",,,18926055006,"酒店客房类 客房用品 挂牌酒店客房类 客房用品 笔筒酒店客房类 客房用品 鞋拔酒店客房类 客房用品 价目表",18926055006,http://jinsheng.net168.com/,广东深圳观澜镇新田元一村元水路78号
10,1,"2018-08-23 23:21:44",挂牌,1,"2018-08-23 23:06:25",客房用品,1,"2018-08-23 23:06:25",酒店客房类,10,"2018-08-24 01:50:36","宾馆客房请勿打扰牌请即清理 酒店用品挂牌 打扫牌 塑料标牌",生产加工,广陵区科荣旅游用品厂,"品牌 怡顺柔丝 类别 酒店一次性用品 加印LOGO 不可以 加工定制 是 箱装数量 500个/箱 产品类别 标牌 产地 江苏扬州 【产品名称】请勿打扰、立即打扫标牌 【产品规格】正反两面，一面：请勿打扰，一面：立即打扫 【生产周期】现货 【关于产品】我们的产品图片均为实物拍摄，因拍摄技术和显示器原因，可能会有色差，均以实物为准，敬请谅解。客户订制时，我们可根据客户提供的样品生产。 【订制标志】我们可以根据您的需要，在产品或包裝上印制客户的Logo、公司名称、联系方式等信息，要求不同，价格不等，可联系我们洽谈。您在本店见到的图片一般为常规产品（通货）。订制产品，必须寄送样品。 【货款结算】我们建议您使用支付宝交易。如您订制产品，需方预付款40%定金，余款在支付宝采用先拍后付的原则。 【供货周期】拍前请亲询问产品库存、物流等，有现货的1个工作日内发货；没有现货，生产周期要视产品数量和产能而定。订制产品，生产周期为15-20天（40%预付款到，余款打上支付宝，日期算起），物流时间视两地距离及物流情况而定。本店客户大多为宾馆酒店，货量较大，部分商品需订制，同时为避免运输公司造成中途延误，请较远或较急的老板们提前订货。 【货物签收】货品请当面检查后再签收，如发现货品数量、质量有问题请让快递人员作证并拍照留证，立即跟我方客服人员取得联系，确定事实后方可进行补货、换货。 【货物退换】货品存有质量问题，在未经使用，附件完好的情况下，可掉换同等价值的商品或退掉。退货应于收货之时起的24小时内申请，并于申请之时起的24小时内寄回。对交易过程中可能出现的疑问或顾虑，请买家及时同客服联系，以利于交易顺利进行。如果是我方责任，错发、少发、质量问题则运费有我方承担，否则运费由买家自理。 客服热线：13390612102 QQ：3651950 Email：3651950@qq.com",面议,"江苏 扬州市",,,0514-89787454,酒店客房类,0514-89787454,http://kerong.net168.com/,"中国 江苏 扬州 广陵区 杭集镇利民路2号"
11,1,"2018-08-23 23:21:44",挂牌,1,"2018-08-23 23:06:25",客房用品,1,"2018-08-23 23:06:25",酒店客房类,11,"2018-08-24 01:50:37","酒店宾馆会所请勿打扰 请即打扫挂牌 亚克力金丝衬底提示牌门牌",生产加工,江苏赛诺酒店用品有限公司,"建议零售价 ¥10.00 产品类别 酒店指示牌 品牌 stockwell 材质 亚克力 规格 290*80（mm） 工艺 亚克力雕刻 箱装数量 50 产地 中国大陆 货号 S054891 加工定制 是 加印LOGO 可以 品牌名称：Stockwell",10.00元/套,"江苏 扬州市",,,0514-87277778,"酒店客房类 客房用品 挂牌酒店客房类 一次性用品",0514-87277778,http://sainuo.net168.com/,"中国 江苏 扬州市琼花街61号"
12,1,"2018-08-23 23:21:44",挂牌,1,"2018-08-23 23:06:25",客房用品,1,"2018-08-23 23:06:25",酒店客房类,12,"2018-08-24 01:50:41","红木纹免酒店打扰牌 请即打扫 请勿打扰 酒店宾馆挂牌 指示牌",生产加工,江苏赛诺酒店用品有限公司,"建议零售价 ¥7.00 产品类别 酒店指示牌 品牌 stockwell 材质 木质 规格 237*90（mm） 工艺 平面 箱装数量 500 产地 江苏扬州 货号 201548 加工定制 是 加印LOGO 可以 品牌名称：Stockwell",8.00元/套,"江苏 扬州市","1 套",,0514-87277778,"酒店客房类 客房用品 挂牌酒店客房类 一次性用品",0514-87277778,http://sainuo.net168.com/,"中国 江苏 扬州市琼花街61号"
13,1,"2018-08-23 23:21:44",挂牌,1,"2018-08-23 23:06:25",客房用品,1,"2018-08-23 23:06:25",酒店客房类,13,"2018-08-24 01:50:41",酒店客房打扰牌，酒店打扰牌，酒店免扰牌，酒店客房免扰牌,"生产加工,招商代理",扬州天澳酒店用品有限公司,"建议零售价 ¥0.18 品牌 tior 类别 酒店一次性用品 货号 x-004 加印LOGO 可以 加工定制 是 箱装数量 2500 产品类别 打扰牌 产地 扬州 业务QQ：2224564195，手机：13365118763 扬州天澳酒店用品有限公司是在扬州七一三旅游用品厂的基础上于2012年5月成立的。扬 州天澳酒店用品有限公司位于“中国牙刷之都”“中国酒店用品之都”杭集，毗邻京通，沪陕高速杭集出口，依傍京杭大运河。扬州天澳酒店用品有限公司是一家严 格按照“中华人民共和国旅游行业标准《星级饭店客房用品质量与配备要求》”专业生产供应酒店一次性用品、宾馆一次性用品、酒店客房用品的生产型企业。我厂 产品涵盖了牙具、拖鞋、香皂、梳子、洗发液、淋浴液、护发素、润肤露、浴帽、擦鞋器、针线包、袋泡茶、圆珠笔、夹纸笔、剃须刀、棉签、指甲锉、杯垫、杯盖、火柴、洗衣袋、购物袋、托盘、垃圾桶、服务指南、调酒棒、布草、毛巾、床上用品等中高档宾馆酒店用品，并承接国内外OEM订单。 【关于“产品”】 我们的产品图片均为实物拍摄，保证和实物一样；但在不同光线下,不同的显示器下看会造成色差问题，具体颜色值可来样或告之国际PANTONE色卡号 【产品质量如何？】 答：我厂于2000年开始从事生产酒店客房用品，“Tior”品牌也刚刚推出6年时间，本着“为你用心”（Heart for you !）的原则，目的是向用于走日化专线。我厂外贸比例约占50%内销比例约50%，从订单入手，我们都认真对待，从原材料备料，加工，到清理过程，都有专业的质量监督部门从事质量监督。 【是否可以在产品上印刷客户的标志？】 答：可以！我们可以根据客户的需要，在产品外包装上面印刷客户指定的LOGO，产品外纸箱也可以印刷客户指定的内容（如：公司名称、联系方式等信息）产品LOGO分为：普通印刷、烫金烫银、压纹、电脑绣花、胶印等！ 【产品起订量？】 答：常规起订量为5000pcs，特殊产品除外! 【货款的结算支付方式？】 答：关于付款方式： 我们在保证货品质量的前提下，收取合同金额或货值的30-50%作为定金，在货物生产结束后客人需及时支付70%的余款后，我们方能安排出货；在定金或余款已安排的情况下，请买家及时通知我们，以免耽误生产和交货时间 【交货日期？】 答：正常的生产周期是10天-15天（30%预付款到日期算起）；物流时间视各地距离及物流是否直达定。 注：特殊规格产品（需重新开模的），需加上开模及试模周期. 【运输方式？】 答：可发快递或物流，常用的快递合作伙伴有：顺丰、申通、cces快递、汇通快递、圆通快递、韵达快递、天天快递等，物流合作伙伴有：通港物流、旺旺联运、如意物流、辉煌物流等其它物流；买家在收货时请确认产品质量、数量、货物是否有损坏。 【公司网站？】 官方网站： 官方店铺： 官方腾讯微博：扬州天澳酒店用品有限公司 官方新浪微博： 扬州天澳酒店用品有限公司 Yangzhou Tior Hotel Articles Co., Ltd 地址：江苏省扬州市杭集工业园区锦都C5-11 邮编：225111 联系人：王海兵 电话：0514-89883883 传真：0514-89883883 手机：13365118763 邮箱：yztior@qq.com 业务Q Q : 2224564195 业务Q Q : 2585932989",0.12元/个,"江苏 扬州市","5000 个",,0514-89883883,"酒店客房类 一次性用品",0514-89883883,http://tianao.net168.com/,"江苏 扬州市广陵区 杭集镇创业园"
14,1,"2018-08-23 23:21:44",挂牌,1,"2018-08-23 23:06:25",客房用品,1,"2018-08-23 23:06:25",酒店客房类,14,"2018-08-24 01:50:42","宾馆酒店请勿打扰 请即打扫门挂牌 双面印刷 现货供应","生产加工,招商代理",扬州市广陵区佳怡旅游用品厂,"扬州佳怡旅游用品厂专业生产经营各种酒店用品，你可先逛逛本店或和客服聊聊! 宾馆楼层牌 酒店客房门号牌 亚克力科室牌 定做标牌 指示牌 可定做各种文字，适用于宾馆、酒店、酒楼、餐厅、科室标牌 ★★★物品均100%实物拍摄,洗漱产品可提供质检报告，请放心选购★★★ 产品展示： 1号：材质锡箔金 正反面 型号：7.7mm*21.3mm 3.00元/个 2号：材质亚克力 型号：7.7mm*21.3mm 3.00元/个 号码牌 材质：亚克力 型号：6.2mm*10.mm 4.20元/个 标识牌 材质：亚克力 型号：9.8mm*9.8mm 5.00元/个 标识牌 材质：亚克力 型号：12.6mm*12.mm 5.00元/个 吸烟牌 材质：亚克力 型号：5.2mm*10.4mm 4.20元/个 温馨提示 材质：亚克力 型号：14.8mm*24.8mm 10.60元/个 温馨提示 材质：亚克力 型号：14.8mm*24.8mm 10.60元/个",3.00元/个,"江苏 扬州市","10 个",,"0514 87493103","酒店客房类 一次性用品","0514 87493103",http://jiayi.net168.com/,"中国 江苏 扬州市广陵区 杭集镇曙光路304号"
15,1,"2018-08-23 23:21:44",挂牌,1,"2018-08-23 23:06:25",客房用品,1,"2018-08-23 23:06:25",酒店客房类,15,"2018-08-24 01:50:44","现货批发 高档亚克力请勿打扰门挂牌 请即打扫吊牌","生产加工,招商代理",苍南县瑞铭标牌厂,产品介绍,1.10元/PCS,"浙江 温州市",,,0577-64582704,"酒店客房类 客房用品 挂牌酒店客房类 客房用品 提示牌酒店客房类 客房用品 客房标示卡",0577-64582704,http://ruiming.net168.com/,"浙江 温州 苍南县 中国 浙江 苍南县 金乡东门大街"
16,1,"2018-08-23 23:21:44",挂牌,1,"2018-08-23 23:06:25",客房用品,1,"2018-08-23 23:06:25",酒店客房类,16,"2018-08-24 01:50:45","厂家直销 请勿打扰告示牌提示牌 打扫房间挂牌 吊牌","生产加工,招商代理",扬州宝艾酒店用品有限公司,,5.00元/个,"江苏 扬州市","100 个",,"0514 87101018","酒店客房类 一次性用品酒店布草类 床上用品酒店客房类 客房用品","0514 87101018",http://baoai.net168.com/,江苏扬州市杭集镇锦都酒店用品城D9-02、D9-0
3415,1,"2018-08-23 23:21:44",挂牌,1,"2018-08-23 23:06:25",客房用品,1,"2018-08-23 23:06:25",酒店客房类
17,2,"2018-08-23 23:21:46",笔筒,1,"2018-08-23 23:06:25",客房用品,1,"2018-08-23 23:06:25",酒店客房类,17,"2018-08-24 01:50:48","雅皮仕 多功能创意皮革笔筒名片座 时尚商务办公文具用品收纳礼品",生产加工,深圳市雅皮仕皮艺家居用品有限公司,"品牌 雅皮仕 型号 标准 材质 皮革 规格 标准 形状 方形 适用送礼场合 生日,颁奖纪念,婚庆,广告促销,商务馈赠,周年庆典,节日,展销会,乔迁 加印LOGO 可以 加工定制 是 是否进口 否 颜色 黑色平纹,咖色平纹 深圳市雅皮仕皮艺家居用品有限公司成立于2006年，是一家集生产、设计、销售为一体的综合型家居用品公司。一路走来雅皮仕人精耕细作，借鉴并吸收深港国际化的家居设计潮流与元素，并积极植入到传统手工皮艺文化中。我们相信美是可以被复制并传承。 公司主营产品线包括：家居收纳系列，皮艺礼品系列，酒店皮具系列，皮艺办公用品系列，皮艺小家具系列，高档皮艺包装系列，皮艺软包系列。公司致力于品牌直营及加盟连锁建设，积极发展电子商务，展销和异业联盟等营销渠道；有建设性的整合销售，生产及设计资源，打造高效供应链，为广大客户提供富有竞争力的时尚皮艺产品。",面议,"广东 深圳市",,,0755-66690720,"酒店客房类 客房用品 电视节目表酒店客房类 客房用品 名片盒",0755-66690720,http://yapishi.net168.com/,"中国 广东 深圳 龙岗区 坂田金鹏工业区12栋4楼"
18,2,"2018-08-23 23:21:46",笔筒,1,"2018-08-23 23:06:25",客房用品,1,"2018-08-23 23:06:25",酒店客房类,18,"2018-08-24 01:50:53","雅皮仕 多功能创意皮革笔筒名片座 时尚商务办公文具用品收纳礼品",生产加工,深圳市雅皮仕皮艺家居用品有限公司,"品牌 雅皮仕 型号 标准 材质 皮革 规格 标准 形状 方形 适用送礼场合 生日,颁奖纪念,婚庆,广告促销,商务馈赠,周年庆典,节日,展销会,乔迁 加印LOGO 可以 加工定制 是 是否进口 否 颜色 咖啡色,黑色 深圳市雅皮仕皮艺家居用品有限公司成立于2006年，是一家集生产、设计、销售为一体的综合型家居用品公司。一路走来雅皮仕人精耕细作，借鉴并吸收深港国际化的家居设计潮流与元素，并积极植入到传统手工皮艺文化中。我们相信美是可以被复制并传承。 公司主营产品线包括：家居收纳系列，皮艺礼品系列，酒店皮具系列，皮艺办公用品系列，皮艺小家具系列，高档皮艺包装系列，皮艺软包系列。公司致力于品牌直营及加盟连锁建设，积极发展电子商务，展销和异业联盟等营销渠道；有建设性的整合销售，生产及设计资源，打造高效供应链，为广大客户提供富有竞争力的时尚皮艺产品。",面议,"广东 深圳市",,,0755-66690720,"酒店客房类 客房用品 电视节目表酒店客房类 客房用品 名片盒",0755-66690720,http://yapishi.net168.com/,"中国 广东 深圳 龙岗区 坂田金鹏工业区12栋4楼"
19,2,"2018-08-23 23:21:46",笔筒,1,"2018-08-23 23:06:25",客房用品,1,"2018-08-23 23:06:25",酒店客房类,19,"2018-08-24 01:50:54","雅皮仕 经典黑色皮艺单笔筒 韩国创意 多功能 办公 礼品 欧式",生产加工,深圳市雅皮仕皮艺家居用品有限公司,"品牌 雅皮仕 型号 标准 材质 皮革 规格 标准 形状 方形 适用送礼场合 生日,颁奖纪念,婚庆,广告促销,商务馈赠,周年庆典,节日,展销会,乔迁 加印LOGO 可以 加工定制 是 是否进口 否 颜色 黑色平纹,咖色平纹 深圳市雅皮仕皮艺家居用品有限公司成立于2006年，是一家集生产、设计、销售为一体的综合型家居用品公司。一路走来雅皮仕人精耕细作，借鉴并吸收深港国际化的家居设计潮流与元素，并积极植入到传统手工皮艺文化中。我们相信美是可以被复制并传承。 公司主营产品线包括：家居收纳系列，皮艺礼品系列，酒店皮具系列，皮艺办公用品系列，皮艺小家具系列，高档皮艺包装系列，皮艺软包系列。公司致力于品牌直营及加盟连锁建设，积极发展电子商务，展销和异业联盟等营销渠道；有建设性的整合销售，生产及设计资源，打造高效供应链，为广大客户提供富有竞争力的时尚皮艺产品。多年来我们和香格里拉，半岛酒店等集团客户建立了良好的合作关系，并已经在全国建立了包括直营在内连锁店21家。当下公司正大力强化品牌连锁建设，成长的道路上雅皮士人将始终坚持时尚、高雅、简约的设计理念，把实现客户的苛刻挑剔设计思路当做自己成长的动力和乐趣。 成长中的雅皮仕欢迎广大客户批评和建议，我们将把实现客户价值最大化当做雅皮士孜孜以求的目标。欢迎来电来厂指导和洽谈业务！",面议,"广东 深圳市",,,0755-66690720,"酒店客房类 客房用品 电视节目表酒店客房类 客房用品 名片盒",0755-66690720,http://yapishi.net168.com/,"中国 广东 深圳 龙岗区 坂田金鹏工业区12栋4楼"
20,2,"2018-08-23 23:21:46",笔筒,1,"2018-08-23 23:06:25",客房用品,1,"2018-08-23 23:06:25",酒店客房类,20,"2018-08-24 01:50:57",酒店用品水晶牙签筒/水晶笔筒浦江水晶厂家,生产加工,浦江县银荣水晶有限公司,"材质 白水晶 制作工艺 雕刻 加工定制 是 品牌 银荣水晶厂 类别 器皿 材料来源 人造 表面工艺 抛光 摆挂形式 摆饰 风格 中式 造型 植物 包装 PP袋独立包装 规格 40*40*80 净重 2.5 产地 浙江浦江 是否专利货源 否 是否进口 否 尺寸 40*40*80 纯度 k9 价格段 5-10元 是否有专利 无 礼品种类 居家日用礼品 地址：浙江省金华市浦江县水晶 TEL/FAX：0579-84222496 手机：18967451196 监督QQ: 276715285 客服QQ：242959446 相关知识：水晶分子式α-SiO2人造水晶即高铅玻璃，或称为铅晶质玻璃，即在普通玻璃(成分是二氧化硅)中加入24%的氧化铅，就会得到亮度和透明度与天然水晶类似的人造水晶。 购买须知：水晶工艺品皆全手工加工工艺品，难免会有细小瑕疵，和尺寸误差，我们会努力做到更好！一般根据客户订单需求定制，少量款式规格有现货，需要提前咨询，产品单价根据具体订单数量加工要求会有不同的变化，以实际协商为准 公司简介：本厂至2006年加工水晶至今已有多年加工经验，多次被评为浙江省水晶行业优质供应商。如今已形成相当规模的水晶一条龙加工服务，拥有独立的研发和设计部门，完善的配送和售后服务。能满足绝大部分客户的订单需求。我们的经营特点是利用先进的网络销售直接联系客户，从工厂直接下单加工完直接发货到终端客户，省去中间商，为客户节约更多的成本。 经营范围：水晶办公礼品，商务礼品，各种水晶白胚批发，饰品摆件，各种水晶模型，等可以根据您的需要定做各种高难度水晶工艺品！ 我们的宗旨：只有你想不到的，没有我们做不到的！ 物流运输：因为水晶属于易碎品，所以包装盒运输都因十分小心，我们定制了专业的安全产品礼盒配合专业的物流运输，力争送到客户手上的都是百分百完好的商品。如果因为物流运输造成的损坏我们仅双方协商后给予你满意的答复。 我们的物流方式有1，快递适合样品，数量较少的商品或者紧急需要的商品目前合作的物流公司有，圆通，申通，韵达，顺丰，天天，中通，DHL，TNT，等相对其他运输方式快递费用最贵，时间最省。 2，物流我们有完善的物流配送中心全国绝大部分县级市都能到达，根据地域和需求量不同，送货时间从1天到1星期不等，也可以送货上门和代办进仓业务，如有特殊需要可以协商解决，物流时间最慢（大部分情况）费用最低 3，大巴 我们每天有发往全国各地的长途大巴，可以通过大巴行李箱载货，一般适合数量大于快递小于物流的5箱左右商品，一般大巴士中午发货第二天上午提货近距离的则是早发晚到。大巴费用介于快递和物流之间",面议,"浙江 金华市",,,1896-7451196,"酒店客房类 客房用品 笔筒酒店客房类 客房用品 价目表酒店客房类 客房用品 烟灰缸",1896-7451196,http://yinrong.net168.com/,浙江浦江县浦阳街道翠湖路铜桥毛桥8-1号
21,2,"2018-08-23 23:21:46",笔筒,1,"2018-08-23 23:06:25",客房用品,1,"2018-08-23 23:06:25",酒店客房类,21,"2018-08-24 01:50:58","品牌厂家批发定制 办公桌面用品收纳高档PU皮革笔筒收纳盒创意",生产加工,深圳市雅美仕皮具制品有限公司,"建议零售价 ¥38.00 产品类别 桌面收纳盒 品牌 无 型号 雅美仕 材质 皮革 适用范围 文具,杂物 风格 田园 图案 格子 规格 中号 加工定制 是 加印LOGO 可以 贸易属性 内贸+外贸 箱装数量 50 专利 是 颜色 田园格纹,黑色平纹,咖啡色平纹 尺寸 12*8.5cm 是否折叠 否 适用送礼场合 生日,节日庆祝,家居,广告促销,商务馈赠,家居收纳,公关策划,节日,乔迁",面议,"广东 深圳市",,,18676708908,"酒店客房类 客房用品 笔筒酒店客房类 客房用品 纸巾盒",18676708908,http://yameishi.net168.com/,广东深圳市龙岗区坂田雪象花园新村
22,2,"2018-08-23 23:21:46",笔筒,1,"2018-08-23 23:06:25",客房用品,1,"2018-08-23 23:06:25",酒店客房类,22,"2018-08-24 01:51:00","厂家定制批发 皮革皮质办公文具多功能创意笔筒 桌面收纳盒",生产加工,深圳市雅美仕皮具制品有限公司,"建议零售价 ¥38.00 产品类别 桌面收纳盒 品牌 无 材质 皮革 适用范围 杂物,文具,手机,遥控器 风格 欧式 规格 中号 加工定制 是 加印LOGO 可以 贸易属性 内贸+外贸 箱装数量 40 专利 是 颜色 羊皮纹黑色,羊皮纹白色 适用送礼场合 广告促销,家居收纳,乔迁,家居,节日,节日庆祝,商务馈赠,公关策划,生日",面议,"广东 深圳市",,,18676708908,"酒店客房类 客房用品 笔筒酒店客房类 客房用品 纸巾盒",18676708908,http://yameishi.net168.com/,广东深圳市龙岗区坂田雪象花园新村
23,2,"2018-08-23 23:21:46",笔筒,1,"2018-08-23 23:06:25",客房用品,1,"2018-08-23 23:06:25",酒店客房类,23,"2018-08-24 01:51:01","欧式皮革旋转遥控器收纳盒 办公桌面收纳盒 创意笔筒收纳盒定做",生产加工,深圳市雅美仕皮具制品有限公司,"建议零售价 ¥78.00 产品类别 桌面收纳盒 品牌 无 型号 雅美仕 材质 皮革 适用范围 文具,杂物,遥控器,手机 风格 田园 图案 LOGO 规格 中号 加工定制 是 加印LOGO 可以 贸易属性 内贸+外贸 箱装数量 50 专利 是 颜色 黑色鳄鱼纹,红色鳄鱼纹 尺寸 14.5*宽14.5*高11.5(CM) 是否折叠 否 适用送礼场合 生日,节日庆祝,家居,广告促销,商务馈赠,家居收纳,公关策划,节日,乔迁 【宝贝名称】雅美仕 批发定制 高档时尚办公桌面用品遥控器收纳盒旋转笔筒收纳理 【宝贝尺寸】长14.5*宽14.5*高11.5(CM) 加底座高14.5CM 加提手19.5CM 【宝贝净重】0.65KG 【宝贝颜色】黑色平纹、棕色平纹、黑色鳄鱼纹、棕色鳄鱼纹、酒红色鳄鱼、白色鳄鱼纹 【宝贝材质】优质皮革+密度板 【宝贝用途】桌面杂物，手机，遥控器，化妆品，办公用品等宜家家居、办公桌面整理收纳储物 【宝贝订制】可根据客户自行提供的尺寸，材质，及颜色 ，LOGO订做，样板费用另计，也可来样订做，快递费用自付，下单后样板的费用退回，价格商议 【制 造 商】雅美仕",面议,"广东 深圳市",,,18676708908,"酒店客房类 客房用品 笔筒酒店客房类 客房用品 纸巾盒",18676708908,http://yameishi.net168.com/,广东深圳市龙岗区坂田雪象花园新村
24,2,"2018-08-23 23:21:46",笔筒,1,"2018-08-23 23:06:25",客房用品,1,"2018-08-23 23:06:25",酒店客房类,24,"2018-08-24 01:51:02","办公用品定制定做 高档皮革办公桌面收纳笔筒韩国创意欧式 多功能",生产加工,深圳市雅美仕皮具制品有限公司,"建议零售价 ¥38.00 产品类别 桌面收纳盒 品牌 无 材质 皮革 适用范围 杂物,文具,遥控器 风格 欧式 规格 中号 加工定制 是 加印LOGO 可以 贸易属性 内贸+外贸 箱装数量 40 专利 是 颜色 咖啡色平纹,黑色平纹 尺寸 8.5厘米*8.5厘米*10厘米 适用送礼场合 广告促销,家居收纳,乔迁,家居,节日,节日庆祝,商务馈赠,公关策划,生日",面议,"广东 深圳市",,,18676708908,"酒店客房类 客房用品 笔筒酒店客房类 客房用品 纸巾盒",18676708908,http://yameishi.net168.com/,广东深圳市龙岗区坂田雪象花园新村
25,2,"2018-08-23 23:21:46",笔筒,1,"2018-08-23 23:06:25",客房用品,1,"2018-08-23 23:06:25",酒店客房类,25,"2018-08-24 01:51:06","厂家定制批发桌面办公笔筒收纳 多功能创意整理收纳盒定做印logo",生产加工,深圳市雅美仕皮具制品有限公司,"建议零售价 ¥78.00 产品类别 桌面收纳盒 品牌 无 材质 皮革 适用范围 杂物,文具,手机,遥控器 风格 欧式 规格 中号 加工定制 是 加印LOGO 可以 贸易属性 内贸+外贸 专利 是 颜色 黑色平纹,咖啡色平纹 尺寸 28*10*9cm 适用送礼场合 广告促销,家居收纳,乔迁,家居,节日,节日庆祝,商务馈赠,公关策划,生日",面议,"广东 深圳市",,,18676708908,"酒店客房类 客房用品 笔筒酒店客房类 客房用品 纸巾盒",18676708908,http://yameishi.net168.com/,广东深圳市龙岗区坂田雪象花园新村
26,3,"2018-08-23 23:21:48",鞋拔,1,"2018-08-23 23:06:25",客房用品,1,"2018-08-23 23:06:25",酒店客房类,26,"2018-08-24 01:51:07",酒店一次性长鞋拔,"生产加工,经销批发,办事处",扬州鼎杰旅游用品厂,"【产品名称】 长鞋拔子 【产品材质】 普通塑料 【装箱数量】 1000把/箱 【适用人群】通用 【可否定制】 可，2000起订，如需定制，详细情况请联系在线客服 【发货方式】 江浙沪快递，其他地方物流 【售后服务】本产品无质量问题不可退货",0.60元/,"江苏 扬州市",2000,20000,0514-87498076,"酒店客房类 一次性用品 牙刷酒店客房类 一次性用品 香皂酒店客房类 一次性用品 浴帽酒店客房类 一次性用品 梳子酒店客房类 一次性用品 拖鞋",0514-87498076,http://yang1113517974.net168.com/,扬州市广陵区杭集镇车四11号
27,3,"2018-08-23 23:21:48",鞋拔,1,"2018-08-23 23:06:25",客房用品,1,"2018-08-23 23:06:25",酒店客房类,27,"2018-08-24 01:51:08",酒店一次性短鞋拔,"生产加工,经销批发,办事处",扬州鼎杰旅游用品厂,"【产品名称】 短鞋拔子 【产品材质】 普通塑料 【装箱数量】 1000把/箱 【适用人群】通用 【可否定制】 可，2000起订，如需定制，详细情况请联系在线客服 【发货方式】 江浙沪快递，其他地方物流 【售后服务】本产品无质量问题不可退货",0.13元/,"江苏 扬州市",2000,10000,0514-87498076,"酒店客房类 一次性用品 牙刷酒店客房类 一次性用品 香皂酒店客房类 一次性用品 浴帽酒店客房类 一次性用品 梳子酒店客房类 一次性用品 拖鞋",0514-87498076,http://yang1113517974.net168.com/,扬州市广陵区杭集镇车四11号
28,3,"2018-08-23 23:21:48",鞋拔,1,"2018-08-23 23:06:25",客房用品,1,"2018-08-23 23:06:25",酒店客房类,28,"2018-08-24 01:51:11",供应鞋拔，塑料鞋拔，鞋拔，鞋拔,生产加工,广陵区金世纪旅游用品厂,"建议零售价 ¥0.40 产品类别 鞋拔 材质 PS 型号 无 适合鞋型 皮鞋 样式 如图 颜色 各种颜色,其他,其他 尺寸 19.3*4CM 宾馆用品，一次性用品 生产经理：严先生，厂名：扬州金世纪旅游用品厂 网站： http://www.jsyzjsj.cn 电话：0514-87494333 13705277238 传真：0514-87494333 邮编：225111 厂址：江苏省扬州市杭集工业园兴隆路15号 备注付款方式：首付30%订金，余款发货前到帐、订金到帐后开始做货， 通常10天—15天内发货 ，特殊情况提前商议 ★★★★★★★★★★★★★以下是参考价格★★★★★★★★★★★★★★ 六合一牙具0.45 四合一牙具0.23 0.05、0.06、0.07、0.08、0.09、0.1、等价格。小蛇头 小广东 小佳洁士 桑拿牙刷 量大优惠一次性牙刷， 香皂0.04、0.05、0.06、0.08、0.1、0.12、0.13、、、、 拖鞋：无纺丝拖鞋每双0.27元起售、毛巾拖鞋每双0.68元起售；，毛巾拖鞋0.75、密丝绒拖鞋1.65、拉毛布拖鞋0.6、割绒拖鞋3.7、天鹅绒拖鞋0.6、华褔格拖鞋1.6等等、 浴帽：0.045元起售、0.06、0.08、0.1 梳子：每把0.06元起售0.08、0.1、0.12、、、 洗发液、沐浴液：袋装0.06元起售、瓶装0.18元起售； 剃须刀：每把0.12元起售； 火柴：每盒0.1元 、0.12、、、、 六合一牙具 0.45/ 0.50/ 0.58/ 0.65/ 0.80 500-600套/箱 1、 宾馆专用一次性用品现货提供，可混批，无数量限制 2、 颜色、尺寸、店徽、按照客户要求生产 3、 每个品种的各个样式可以按照客户要求生产 4、 如果你对我的产品感兴趣，请联系我得到更多的产品信息！我们可以生产各种质量的产品。因为我是直接的生产厂家，所以我相信我们的价格肯定占有优势！ 5、 为了扩大我们的业务关系、我们竭力于诚信和我们的相互信任。 1、我怎样能得到样品？ 答：我们很荣幸为您提供样品。新客户将支付快递费用，样品免费为您。这笔费用在下定单的货款中扣除！ 2、工厂怎样进行质量控制？ 答：产品质量如何？人们总是重视质量如何控制， 1）从一开始到最后一刻我们所有的原料都是尽量以环保为最终目的 2）使用熟练的员工去处理缝纫、灌装、包装过程中的每一个过程； 3）质量控制部门专门负责去检查每一个生产过程； 4）我们可以提供一些相关认证； 3、你可以在我们的货物上打印我们的标志吗？ 答：是的，我们可以在你的货物的纸盒或者大纸箱上表上你的联系方式和标志，不需支付任何费用！ 4、我可以购买你厂所有项目中的单一项目吗？ 答：是的，你可以购买我厂的单一项目，例如牙刷、梳子、香皂等中的任何一个项目； 5、货款的支付方式？ 答：由于我们的利润很低，所有不能压货款，第一次合作，货款在5000元以内，通常都是预付30%定金，在货款发货之前付清余款！货款在2万元以内，可以用货代的方式支付或者支付宝的方式支付！ 6、交货日期？ 答：正常的周期是10天内发货！物流方式可以由贵方指定 一星标准： 1. 牙具 38孔牙刷, 3克牙膏， 烫金纸盒包装 0.30 2. 香皂 15 克力士香型, 进口皂粒 烫金纸盒包装 0.20 3. 梳子 直梳,塑料方梳 烫金纸盒包装 0.20 4. 洗发液 袋装，12克,质量符合QB/T1994 0.15 5. 淋浴液 袋装，12克,质量符合QB/1994 0.15 6. 拖鞋 无纺布拖鞋2mm 底，50克面料 0.38 合计 二星标准： 牙具 中档蛇头牙刷, 铝皮3克牙膏， 彩盒包装 0.33 2 香皂 20克力士香型, 进口皂粒 0.25 3 梳子 中档方梳 彩盒包装 0.24 4 洗发液 20克 瓶装，质量符合QB/T1994 0.26 5 淋浴液 20克 瓶装，质量符合QB/1994 0.26 6 浴帽 半透明浴帽 彩盒包装 0.18 7 拖鞋 无纺布拖鞋2.5mm 底，50克面料 0.48 合计 三星标准： 1. 牙具 高档牙刷, 铝皮3克牙膏， 彩盒包装 0.35 2. 香皂 25 克力士香型, 进口皂粒 彩盒包装 0.30 3. 梳子 中档直梳,塑料方梳 彩盒包装 0.24 4. 洗发液 25克 软管装，质量符合QB/T1994 0.30 5. 淋浴液 25克 软管装，质量符合QB/1994 0.30 6. 涧肤露 25克装，质量符合QB/1994 0.58 7. 浴帽 烤边型 彩盒包装 0.20 8. 火柴 15 根 彩盒包装 0.15 9. 口杯套 已消毒 0.05 10. 剃须刀 双层剃须刀，加 5g 剃须膏 彩盒包装 0.38 11. 拖鞋 拉毛绒拖鞋，3mm 底，200克面料 1.1 12. 杯垫 吸水杯垫印Logo 5000起 0.05 13. 针线包 四线两针两扣 彩盒包装 0.18 14. 圆珠笔 铜头印Logo 5000起 0.28 15. 夹纸笔 印Logo 印Logo 0.08 16. 鞋檫 0.30 四星标准： 1 牙具 高档透明尼龙牙刷, 铝皮6克牙膏， 彩盒包装 0.38 2 香皂 35克力士香型, 进口皂粒 彩盒包装 0.40 3 梳子 高档木质方梳 彩盒包装 0.42 4 洗发液 30克 软管装，质量符合QB/T1994 0.34 5 淋浴液 30克 软管装，质量符合QB/1994 0.34 6 涧肤露 30克 软管装，质量符合QB/1994 0.34 7 护发素 30克 软管装，质量符合QB/1994 0.58 8 浴帽 高档烤边型 彩盒包装 0.20 9 火柴 16 根 彩盒包装 0.19 10 口杯套 已消毒 0.05 11 剃须刀 双层剃须刀，加 5g 剃须膏 彩盒包装 0.40 12 拖鞋 绒布拖鞋 (高档毛巾拖鞋) 金丝线绣Logo 2.80 13 护理包 一支8cm砂指锉，4根棉签，两棉球 彩盒包装 0.30 14 杯垫 吸水杯垫印Logo 5000起 0.05 15 针线包 六线两针两扣 彩盒包装 0.20 16 圆珠笔 铜头印Logo 5000起 0.28 17 夹纸笔 印Logo 印Logo 0.08 五星标准： 1 牙具 高档透明尼龙牙刷, 铝皮6克牙膏， 彩盒包装 0.38 2 香皂 35克力士香型, 进口皂粒 彩盒包装 0.40 3 梳子 高档木质方梳 彩盒包装 0.42 4 洗发液 30克 软管装，质量符合QB/T1994 0.34 5 淋浴液 30克 软管装，质量符合QB/1994 0.34 6 涧肤露 30克 软管装，质量符合QB/1994 0.34 7 护发素 30克 软管装，质量符合QB/1994 0.58 8 浴帽 高档烤边型 彩盒包装 0.20 9 火柴 16 根 彩盒包装 0.19 10 口杯套 已消毒 0.05 11 剃须刀 双层剃须刀，加 5g 剃须膏 彩盒包装 0.40 12 拖鞋 绒布拖鞋 (高档毛巾拖鞋) 金丝线绣Logo 2.80 13 护理包 一支8cm砂指锉，4根棉签，两棉球 彩盒包装 0.30 14 杯垫 吸水杯垫印Logo 5000起 0.05 15 针线包 六线两针两扣 彩盒包装 0.20 16 圆珠笔 铜头印Logo 5000起 0.28 17 夹纸笔 印Logo 印Logo 0.08 护理包：0.05、0.06、0.08。4棉签：0.024、指甲锉：0.04 四合一牙具 0.21/0.23/0.26/ 0.28/ 0.32/ 0.38/ 0.50 1000-1200套/箱",面议,"江苏 扬州市",,,0514-877273866,"酒店客房类 客房用品 鞋拔酒店客房类 客房用品 其它客房用品酒店客房类 一次性用品 纸巾酒店客房类 一次性用品 火柴酒店客房类 一次性用品 淋浴露酒店客房类 一次性用品 一次性毛巾",0514-877273866,http://jinshiji.net168.com/,江苏广陵区杭集镇工业园兴隆路15号