bank.id,bank.ts,bank.title,bank.street_address,bank.address_locality,bank.address_region,bank.postal_code,bank.atm_hour,bank.latitude,bank.longitude,bank.phone,bank.opendate,bank.atm_services,bank.languages
1,"2017-12-03 20:58:41",Anthem,"39518 N Gavilan Peak Pkwy","Anthem,",AZ,85086,"24 Hours",33.843209,-112.135677,"(623) 551-4959","2005-12-16 00:00:00","Walk-up ATM,Cardless ATM,ATM accepts deposits and credit card payments,Drive-up ATM","This ATM also provides instructions in non-English languages. English, Spanish, Chinese, Korean, French, Russian, Portuguese"
2,"2017-12-03 20:59:52","I-17 & Carefree Highway","3110 W Carefree Hwy","Phoenix,",AZ,85086,"24 Hours",33.7995,-112.12649999999,"(623) 434-2260","2003-12-17 00:00:00","Walk-up ATM,Cardless ATM,ATM accepts deposits and credit card payments,Drive-up ATM","This ATM also provides instructions in non-English languages. English, Spanish, Chinese, Korean, French, Russian, Portuguese"
3,"2017-12-03 20:59:57","I-17 & Happy Valley","2501 W Happy Valley Rd STE 46","Phoenix,",AZ,85085,"24 Hours",33.7123500000000,-112.109669,"(623) 580-7152","2005-06-20 00:00:00","Walk-up ATM,Cardless ATM,ATM accepts deposits and credit card payments,Drive-up ATM","This ATM also provides instructions in non-English languages. English, Spanish, Chinese, Korean, French, Russian, Portuguese"
4,"2017-12-03 21:00:03","Cave Creek & Olesen","34317 W Cave Creek Rd","Cave Creek,",AZ,85331,"24 Hours",33.795884,-111.965840,,,"Cardless ATM,ATM accepts deposits and credit card payments,Drive-up ATM","This ATM also provides instructions in non-English languages. English, Spanish, Chinese, Korean, French, Russian, Portuguese"
5,"2017-12-03 21:00:09","Tatum Ranch","29822 N Cave Creek Rd","Cave Creek,",AZ,85331,"24 Hours",33.7564300000000,-111.99059,"(480) 718-6856","2015-07-20 00:00:00","Walk-up ATM,Cardless ATM,ATM with Teller Assist,ATM accepts deposits and credit card payments,ATM located inside","This ATM also provides instructions in non-English languages. English, Spanish, Chinese, Korean, French, Russian, Portuguese"
6,"2017-12-03 21:00:12","67th & Happy Valley","6510 W Happy Valley Rd","Glendale,",AZ,85310,"24 Hours",33.712555,-112.202275,"(623) 537-2440","2003-12-22 00:00:00","Walk-up ATM,Cardless ATM,ATM accepts deposits and credit card payments,Drive-up ATM","This ATM also provides instructions in non-English languages. English, Spanish, Chinese, Korean, French, Russian, Portuguese"
7,"2017-12-03 21:00:17",Carefree,"37217 N Tom Darlington Dr","Carefree,",AZ,85377,"24 Hours",33.8233400000000,-111.92429,"(480) 827-6430","1952-01-01 00:00:00","Walk-up ATM,Cardless ATM,ATM accepts deposits and credit card payments","This ATM also provides instructions in non-English languages. English, Spanish, Chinese, Korean, French, Russian, Portuguese"
8,"2017-12-03 21:00:36","Lake Pleasant Towne Center","25260 N Lake Pleasant Pkwy","Peoria,",AZ,85383,"24 Hours",33.7128799999999,-112.27567,"(623) 376-2447","2007-12-21 00:00:00","Walk-up ATM,Cardless ATM,ATM accepts deposits and credit card payments,Drive-up ATM,ATM located inside","This ATM also provides instructions in non-English languages. English, Spanish, Chinese, Korean, French, Russian, Portuguese"
9,"2017-12-03 21:00:44","67th Ave & Beardsley","20239 N 67th Ave","Glendale,",AZ,85308,"24 Hours",33.668984,-112.202574,"(623) 362-3679","2006-01-23 00:00:00","Walk-up ATM,Cardless ATM,ATM accepts deposits and credit card payments,Drive-up ATM","This ATM also provides instructions in non-English languages. English, Spanish, Chinese, Korean, French, Russian, Portuguese"
10,"2017-12-03 21:00:49","Bell Road and Black Canyon","2903 W Bell Rd","Phoenix,",AZ,85053,"24 Hours",33.6397499999999,-112.119,"(602) 734-0484","2011-05-09 00:00:00","Walk-up ATM,Cardless ATM,ATM accepts deposits and credit card payments,Drive-up ATM,ATM located inside","This ATM also provides instructions in non-English languages. English, Spanish, Chinese, Korean, French, Russian, Portuguese"
11,"2017-12-03 21:06:38","43rd & Bell","4301 W Bell Rd","Glendale,",AZ,85308,"24 Hours",33.6389599999999,-112.15473,"(602) 564-8322","1974-09-30 00:00:00","Walk-up ATM,Cardless ATM,ATM accepts deposits and credit card payments,Drive-up ATM","This ATM also provides instructions in non-English languages. English, Spanish, Chinese, Korean, French, Russian, Portuguese"
12,"2017-12-03 21:06:42","Desert Ridge","21001 N Tatum Blvd STE 90","Phoenix,",AZ,85050,"24 Hours",33.67642,-111.97244,"(480) 538-4901","2001-10-22 00:00:00","Walk-up ATM,Cardless ATM,ATM accepts deposits and credit card payments,Drive-up ATM","This ATM also provides instructions in non-English languages. English, Spanish, Chinese, Korean, French, Russian, Portuguese"
13,"2017-12-03 21:06:49","7th & Bell","605 E Bell Rd","Phoenix,",AZ,85022,"24 Hours",33.6400999999999,-112.065999,"(602) 564-8336","1987-09-14 00:00:00","Walk-up ATM,Cardless ATM,ATM with Teller Assist,ATM accepts deposits and credit card payments,Drive-up ATM,ATM located inside","This ATM also provides instructions in non-English languages. English, Spanish, Chinese, Korean, French, Russian, Portuguese"
14,"2017-12-03 21:06:56","Arrowhead Towne Center - Macy's","7700 W Arrowhead Towne Ctr","Glendale,",AZ,85308,"24 Hours",33.639693,-112.227248,,,"Walk-up ATM,Cardless ATM,ATM accepts deposits and credit card payments,ATM located inside","This ATM also provides instructions in non-English languages. English, Spanish, Chinese, Korean, French, Russian, Portuguese"
15,"2017-12-03 21:07:02","32nd St & Bell","3246 E Bell Rd","Phoenix,",AZ,85032,"24 Hours",33.6407129999999,-112.012489,"(602) 569-4040","1989-06-14 00:00:00","Walk-up ATM,Cardless ATM,ATM accepts deposits and credit card payments,ATM located inside","This ATM also provides instructions in non-English languages. English, Spanish, Chinese, Korean, French, Russian, Portuguese"
16,"2017-12-03 21:07:03","83rd Ave & Bell","8258 W Bell Rd","Glendale,",AZ,85308,"24 Hours",33.6383,-112.233,"(623) 487-5864","1996-02-12 00:00:00","Walk-up ATM,Cardless ATM,ATM accepts deposits and credit card payments,Drive-up ATM","This ATM also provides instructions in non-English languages. English, Spanish, Chinese, Korean, French, Russian, Portuguese"
17,"2017-12-03 21:07:09","19th & Thunderbird","1910 W Thunderbird Rd","Phoenix,",AZ,85023,"24 Hours",33.6113199999999,-112.09987,"(602) 564-8331","1973-12-17 00:00:00","Walk-up ATM,Cardless ATM,ATM accepts deposits and credit card payments,Drive-up ATM","This ATM also provides instructions in non-English languages. English, Spanish, Chinese, Korean, French, Russian, Portuguese"
18,"2017-12-03 21:07:30","Tatum & Bell","16851 N Tatum Blvd","Phoenix,",AZ,85032,"24 Hours",33.640321,-111.977346,"(602) 569-4034","1995-04-28 00:00:00","Walk-up ATM,Cardless ATM,ATM accepts deposits and credit card payments,Drive-up ATM","This ATM also provides instructions in non-English languages. English, Spanish, Chinese, Korean, French, Russian, Portuguese"
19,"2017-12-01 01:20:02","59th & Thunderbird","5831 W Thunderbird Rd","Glendale,",AZ,85306,"24 Hours",33.61056,-112.1848,"(602) 564-8327","1984-08-27 00:00:00","Walk-up ATM,Cardless ATM,ATM accepts deposits and credit card payments,Drive-up ATM",
20,"2017-12-03 21:08:09","Pima Pinnacle Peak","8828 E Pinnacle Peak Rd","Scottsdale,",AZ,85255,"24 Hours",33.69874,-111.89013,"(602) 248-4843","1998-07-01 00:00:00","Walk-up ATM,Cardless ATM,ATM accepts deposits and credit card payments,Drive-up ATM","This ATM also provides instructions in non-English languages. English, Spanish, Chinese, Korean, French, Russian, Portuguese"
21,"2017-12-03 21:08:16","Bell & Boswell","10099 W Bell Rd","Sun City,",AZ,85351,"24 Hours",33.63801,-112.27675,"(623) 876-3121","1973-10-01 00:00:00","Walk-up ATM,Cardless ATM,ATM accepts deposits and credit card payments,Drive-up ATM,ATM located inside","This ATM also provides instructions in non-English languages. English, Spanish, Chinese, Korean, French, Russian, Portuguese"
22,"2017-12-03 21:08:22","7th St And Thunderbird Rd","675 E Thunderbird Rd","Phoenix,",AZ,85022,"24 Hours",33.607380,-112.065940,,,"Walk-up ATM,Cardless ATM,ATM accepts deposits and credit card payments","This ATM also provides instructions in non-English languages. English, Spanish, Chinese, Korean, French, Russian, Portuguese"
23,"2017-12-03 21:08:27",Grayhawk,"20595 N Hayden Rd","Scottsdale,",AZ,85255,"24 Hours",33.671581,-111.90712499999,"(480) 473-1438","2007-06-18 00:00:00","Walk-up ATM,Cardless ATM,ATM accepts deposits and credit card payments,Drive-up ATM,ATM located inside","This ATM also provides instructions in non-English languages. English, Spanish, Chinese, Korean, French, Russian, Portuguese"
24,"2017-12-03 21:08:30","Lowes 1117 West Peoria","8515 W Thunderbird Rd","Peoria,",AZ,85381,"24 Hours",33.609814,-112.242726,,,"Cardless ATM,ATM accepts deposits and credit card payments,Drive-up ATM","This ATM also provides instructions in non-English languages. English, Spanish, Chinese, Korean, French, Russian, Portuguese"
25,"2017-12-03 21:09:39",Metrocenter,"10459 N 28th Dr","Phoenix,",AZ,85051,"24 Hours",33.58185,-112.1215,"(602) 674-4901","1963-01-01 00:00:00","Walk-up ATM,Cardless ATM,ATM accepts deposits and credit card payments,Drive-up ATM","This ATM also provides instructions in non-English languages. English, Spanish, Chinese, Korean, French, Russian, Portuguese"
26,"2017-12-03 21:09:45","RH Johnson Boulevard","19022 N R H Johnson Blvd","Sun City West,",AZ,85375,"24 Hours",33.6564219999999,-112.350988,"(623) 975-3602","1929-01-01 00:00:00","Walk-up ATM,Cardless ATM,ATM accepts deposits and credit card payments,Drive-up ATM","This ATM also provides instructions in non-English languages. English, Spanish, Chinese, Korean, French, Russian, Portuguese"
27,"2017-12-03 21:09:46","Scottsdale Promenade","16431 N Scottsdale Rd","Scottsdale,",AZ,85254,"24 Hours",33.6367389999999,-111.924785,"(480) 367-2590","2003-03-03 00:00:00","Walk-up ATM,Cardless ATM,ATM accepts deposits and credit card payments,Drive-up ATM","This ATM also provides instructions in non-English languages. English, Spanish, Chinese, Korean, French, Russian, Portuguese"
28,"2017-12-03 21:10:51","Paradise Valley/Tatum","13008 N Tatum Blvd","Phoenix,",AZ,85032,"24 Hours",33.60528,-111.97806,"(602) 569-4029","1980-12-01 00:00:00","Walk-up ATM,Cardless ATM,ATM accepts deposits and credit card payments,Drive-up ATM","This ATM also provides instructions in non-English languages. English, Spanish, Chinese, Korean, French, Russian, Portuguese"
29,"2017-12-03 21:10:56","Metrocenter Mall - Robinsons Ul","9617 Metro Pkwy W","Phoenix,",AZ,85051,"24 Hours",33.572952,-112.12412,,,"Walk-up ATM,Cardless ATM,ATM accepts deposits and credit card payments,ATM located inside","This ATM also provides instructions in non-English languages. English, Spanish, Chinese, Korean, French, Russian, Portuguese"
30,"2017-12-03 21:11:06","Kierland Commons","15034 N Scottsdale Rd","Scottsdale,",AZ,85254,"24 Hours",33.623855,-111.925750,,,"Walk-up ATM,Cardless ATM,ATM accepts deposits and credit card payments","This ATM also provides instructions in non-English languages. English, Spanish, Chinese, Korean, French, Russian, Portuguese"
31,"2017-12-03 21:11:11","Bell & Grand","13702 W Bell Rd","Surprise,",AZ,85374,"24 Hours",33.6389799999999,-112.351433,"(623) 556-4544","2001-04-23 00:00:00","Walk-up ATM,Cardless ATM,ATM accepts deposits and credit card payments,Drive-up ATM","This ATM also provides instructions in non-English languages. English, Spanish, Chinese, Korean, French, Russian, Portuguese"
32,"2017-12-03 21:11:17",Kierland,"14636 N Scottsdale Rd STE 125","Scottsdale,",AZ,85254,"24 Hours",33.6196800000000,-111.9273,"(480) 567-7036","2017-10-30 00:00:00","Walk-up ATM,Cardless ATM,ATM accepts deposits and credit card payments,ATM located inside","This ATM also provides instructions in non-English languages. English, Spanish, Chinese, Korean, French, Russian, Portuguese"
33,"2017-12-03 21:11:20","Pinnacle At Kierland","14648 N Scottsdale Rd","Scottsdale,",AZ,85254,"24 Hours",33.62031,-111.925816,,,"Walk-up ATM,Cardless ATM,ATM accepts deposits and credit card payments","This ATM also provides instructions in non-English languages. English, Spanish, Chinese, Korean, French, Russian, Portuguese"
34,"2017-12-03 21:11:24","Sun City Grand","10743 Grand Ave","Sun City,",AZ,85351,"24 Hours",33.6030099999999,-112.29148,"(623) 876-3132","1989-06-14 00:00:00","Walk-up ATM,Cardless ATM,ATM accepts deposits and credit card payments,Drive-up ATM","This ATM also provides instructions in non-English languages. English, Spanish, Chinese, Korean, French, Russian, Portuguese"
35,"2017-12-03 21:11:31","43rd & Dunlap","4303 W Olive Ave","Glendale,",AZ,85302,"24 Hours",33.5674909999999,-112.151655,"(623) 915-6721","1972-10-02 00:00:00","Walk-up ATM,Cardless ATM,ATM accepts deposits and credit card payments,Drive-up ATM,ATM located inside","This ATM also provides instructions in non-English languages. English, Spanish, Chinese, Korean, French, Russian, Portuguese"
36,"2017-12-03 21:11:38","7th & Hatcher","9325 N 7th St","Phoenix,",AZ,85020,"24 Hours",33.57067,-112.06502999999,"(602) 674-4922","1975-03-31 00:00:00","Walk-up ATM,Cardless ATM,ATM accepts deposits and credit card payments,Drive-up ATM","This ATM also provides instructions in non-English languages. English, Spanish, Chinese, Korean, French, Russian, Portuguese"
37,"2017-12-03 21:11:45","Tatum and Shea","4647 E Shea Blvd","Phoenix,",AZ,85028,"24 Hours",33.5824599999999,-111.98036999999,"(480) 612-6632","2010-09-22 00:00:00","Walk-up ATM,Cardless ATM,ATM accepts deposits and credit card payments,Drive-up ATM,ATM located inside","This ATM also provides instructions in non-English languages. English, Spanish, Chinese, Korean, French, Russian, Portuguese"
38,"2017-12-03 21:12:51","Paradise Village Gateway","10637 N Tatum Blvd","Phoenix,",AZ,85254,"24 Hours",33.582946,-111.977381,,,"Walk-up ATM,Cardless ATM,ATM accepts deposits and credit card payments","This ATM also provides instructions in non-English languages. English, Spanish, Chinese, Korean, French, Russian, Portuguese"
39,"2017-12-03 21:14:01","Raintree/Loop 101","8750 E Raintree Dr","Scottsdale,",AZ,85260,"24 Hours",33.6186999999999,-111.89243,"(480) 365-7280","2003-07-28 00:00:00","Walk-up ATM,Cardless ATM,ATM accepts deposits and credit card payments,Drive-up ATM","This ATM also provides instructions in non-English languages. English, Spanish, Chinese, Korean, French, Russian, Portuguese"
40,"2017-12-03 21:14:09","Bell and Thompson Peak","10110 E Bell Rd","Scottsdale,",AZ,85260,"24 Hours",33.6409009999999,-111.86135899999,"(480) 502-7633","2007-12-03 00:00:00","Walk-up ATM,Cardless ATM,ATM accepts deposits and credit card payments,Drive-up ATM,ATM located inside","This ATM also provides instructions in non-English languages. English, Spanish, Chinese, Korean, French, Russian, Portuguese"
41,"2017-12-03 21:14:34","Surprise Crossing","13780 W Waddell Rd","Surprise,",AZ,85379,"24 Hours",33.60961,-112.35871,"(623) 544-4524","2005-06-27 00:00:00","Walk-up ATM,Cardless ATM,ATM accepts deposits and credit card payments,Drive-up ATM","This ATM also provides instructions in non-English languages. English, Spanish, Chinese, Korean, French, Russian, Portuguese"
42,"2017-12-03 21:14:42","16th & Morten","7579 N 16th St","Phoenix,",AZ,85020,"24 Hours",33.54701,-112.04752,"(602) 674-4918","1980-10-06 00:00:00","Walk-up ATM,Cardless ATM,ATM accepts deposits and credit card payments,Drive-up ATM","This ATM also provides instructions in non-English languages. English, Spanish, Chinese, Korean, French, Russian, Portuguese"
43,"2017-12-03 21:15:06","69th & Shea","6929 E Shea Blvd","Scottsdale,",AZ,85254,"24 Hours",33.5822599999999,-111.93147,"(480) 367-2504","1995-05-12 00:00:00","Walk-up ATM,Cardless ATM,ATM accepts deposits and credit card payments,Drive-up ATM","This ATM also provides instructions in non-English languages. English, Spanish, Chinese, Korean, French, Russian, Portuguese"
44,"2017-12-03 21:15:15","19th & Glendale","1815 W Glendale Ave","Phoenix,",AZ,85021,"24 Hours",33.5384099999999,-112.09775,"(602) 973-7201","1989-06-14 00:00:00","Walk-up ATM,Cardless ATM,ATM accepts deposits and credit card payments,ATM located inside","This ATM also provides instructions in non-English languages. English, Spanish, Chinese, Korean, French, Russian, Portuguese"
45,"2017-12-03 21:15:18",Glendale,"5800 W Glenn Dr","Glendale,",AZ,85301,"24 Hours",33.54005,-112.18385,"(623) 915-6705","1960-02-08 00:00:00","Walk-up ATM,Cardless ATM,ATM accepts deposits and credit card payments,Drive-up ATM,ATM located inside","This ATM also provides instructions in non-English languages. English, Spanish, Chinese, Korean, French, Russian, Portuguese"
46,"2017-12-03 21:15:27","Peoria Crossing","9260 W Northern Ave","Glendale,",AZ,85305,"24 Hours",33.5518599999999,-112.25917,"(623) 877-7962","2003-06-23 00:00:00","Walk-up ATM,Cardless ATM,ATM accepts deposits and credit card payments,Drive-up ATM","This ATM also provides instructions in non-English languages. English, Spanish, Chinese, Korean, French, Russian, Portuguese"
47,"2017-12-03 21:15:35","Squaw Peak Plaza","1619 E Glendale","Phoenix,",AZ,85016,"24 Hours",33.538063,-112.046263,,,"Walk-up ATM,Cardless ATM,ATM accepts deposits and credit card payments","This ATM also provides instructions in non-English languages. English, Spanish, Chinese, Korean, French, Russian, Portuguese"
48,"2017-12-03 21:15:39","Bell and Loop 303","16517 W Bell Rd","Surprise,",AZ,85374,"24 Hours",33.6383,-112.416,"(623) 546-6441","2008-08-13 00:00:00","Walk-up ATM,Cardless ATM,ATM accepts deposits and credit card payments,Drive-up ATM,ATM located inside","This ATM also provides instructions in non-English languages. English, Spanish, Chinese, Korean, French, Russian, Portuguese"
49,"2017-12-03 21:15:45","Phoenix Spectrum - Main Entrance","1645-2 W Bethanyhome","Phoenix,",AZ,85015,"24 Hours",33.523994,-112.094294,,,"Walk-up ATM,Cardless ATM,ATM accepts deposits and credit card payments","This ATM also provides instructions in non-English languages. English, Spanish, Chinese, Korean, French, Russian, Portuguese"
50,"2017-12-03 21:15:50","Spectrum Mall Drive Up","5825 N 19th Ave","Phoenix,",AZ,85015,"24 Hours",33.523289,-112.099286,,,"Cardless ATM,ATM accepts deposits and credit card payments,Drive-up ATM","This ATM also provides instructions in non-English languages. English, Spanish, Chinese, Korean, French, Russian, Portuguese"
51,"2017-12-03 21:15:58","Apache Trail & Idaho Road","185 W Apache Tr","Apache Junction,",AZ,85120,"24 Hours",33.413120,-111.548867,,,"Walk-up ATM,Cardless ATM,ATM accepts deposits and credit card payments","This ATM also provides instructions in non-English languages. English, Spanish, Chinese, Korean, French, Russian, Portuguese"
52,"2017-12-03 21:16:17","Apache Junction","3160 W Apache Trl","Apache Junction,",AZ,85120,"24 Hours",33.415818,-111.58017599999,"(480) 827-6761","1963-01-01 00:00:00","Walk-up ATM,Cardless ATM,ATM accepts deposits and credit card payments,Drive-up ATM","This ATM also provides instructions in non-English languages. English, Spanish, Chinese, Korean, French, Russian, Portuguese"
53,"2017-12-03 21:16:28","Mountain Vista Medical Cntr - Emrgncy Rm","1301 S Crismon Rd","Mesa,",AZ,85209,"24 Hours",33.391343,-111.615295,,,"Walk-up ATM,Cardless ATM,ATM cash withdrawals only (deposits not accepted),ATM located inside","This ATM also provides instructions in non-English languages. English, Spanish, Chinese, Korean, French, Russian, Portuguese"
54,"2017-12-03 21:16:35","Signal Butte and Guadalupe","10748 E Guadalupe Rd","Mesa,",AZ,85212,"24 Hours",33.3647800000000,-111.60145,"(480) 567-7037","2017-11-06 00:00:00","Walk-up ATM,Cardless ATM,ATM accepts deposits and credit card payments,Drive-up ATM,ATM located inside","This ATM also provides instructions in non-English languages. English, Spanish, Chinese, Korean, French, Russian, Portuguese"
55,"2017-12-03 21:16:39","Broadway Ellsworth","435 S Ellsworth Rd","Mesa,",AZ,85208,Limited,33.40632,-111.63032,"(480) 357-3021",,"Walk-up ATM,Cardless ATM,ATM accepts deposits and credit card payments,ATM located inside","This ATM also provides instructions in non-English languages. English, Spanish, Chinese, Korean, French, Russian, Portuguese"
56,"2017-12-03 21:16:50","Superstition Springs","1210 S Power Rd","Mesa,",AZ,85206,"24 Hours",33.3934,-111.68496,"(480) 218-5148","1989-06-14 00:00:00","Walk-up ATM,Cardless ATM,ATM accepts deposits and credit card payments,Drive-up ATM","This ATM also provides instructions in non-English languages. English, Spanish, Chinese, Korean, French, Russian, Portuguese"
57,"2017-12-03 21:16:54","Ridgeview Plaza","2846 N Power Rd","Mesa,",AZ,85215,"24 Hours",33.468040,-111.685100,,,"Cardless ATM,ATM accepts deposits and credit card payments,Drive-up ATM","This ATM also provides instructions in non-English languages. English, Spanish, Chinese, Korean, French, Russian, Portuguese"
58,"2017-12-03 21:17:10",Recker/McKellips,"5807 E McKellips Rd","Mesa,",AZ,85215,"24 Hours",33.4516399999999,-111.70543,"(480) 827-6816","1998-03-16 00:00:00","Walk-up ATM,Cardless ATM,ATM accepts deposits and credit card payments,Drive-up ATM","This ATM also provides instructions in non-English languages. English, Spanish, Chinese, Korean, French, Russian, Portuguese"
59,"2017-12-03 21:17:12","Power & Ray","5114 S Power Rd","Mesa,",AZ,85212,"24 Hours",33.322101,-111.687594,"(480) 279-0628","2005-04-18 00:00:00","Walk-up ATM,Cardless ATM,ATM accepts deposits and credit card payments,Drive-up ATM","This ATM also provides instructions in non-English languages. English, Spanish, Chinese, Korean, French, Russian, Portuguese"
60,"2017-12-03 21:17:21",Broadway/Greenfield,"4343 E Broadway Rd","Mesa,",AZ,85206,"24 Hours",33.408,-111.73779999999,"(480) 218-5162","1989-06-14 00:00:00","Walk-up ATM,Cardless ATM,ATM accepts deposits and credit card payments,Drive-up ATM","This ATM also provides instructions in non-English languages. English, Spanish, Chinese, Korean, French, Russian, Portuguese"
61,"2017-12-03 21:17:31","Higley & Elliot","49 S Higley Rd","Gilbert,",AZ,85296,Limited,33.3493599999999,-111.720802,"(480) 539-2951","2004-12-16 00:00:00","Walk-up ATM,ATM accepts deposits and credit card payments,Drive-up ATM","This ATM also provides instructions in non-English languages. English, Spanish, Chinese, Korean, French, Russian, Portuguese"
62,"2017-12-03 21:17:37","Rittenhouse and Ocotillo","21004 E Ocotillo Rd","Queen Creek,",AZ,85142,"24 Hours",33.249,-111.63,"(480) 987-2355","2008-07-25 00:00:00","Walk-up ATM,Cardless ATM,ATM accepts deposits and credit card payments,Drive-up ATM,ATM located inside","This ATM also provides instructions in non-English languages. English, Spanish, Chinese, Korean, French, Russian, Portuguese"
63,"2017-12-03 21:17:41","Val Vista & Elliot","1571 E Elliot Rd","Gilbert,",AZ,85234,"24 Hours",33.349777,-111.75621,"(480) 539-5016","2000-10-23 00:00:00","Walk-up ATM,Cardless ATM,ATM accepts deposits and credit card payments,Drive-up ATM","This ATM also provides instructions in non-English languages. English, Spanish, Chinese, Korean, French, Russian, Portuguese"
64,"2017-12-03 21:17:47","Power & Queen Creek","8463 S Power Rd","Queen Creek,",AZ,85142,"24 Hours",33.2652369999999,-111.68553,"(480) 988-6900","2003-11-10 00:00:00","Walk-up ATM,Cardless ATM,ATM accepts deposits and credit card payments,Drive-up ATM","This ATM also provides instructions in non-English languages. English, Spanish, Chinese, Korean, French, Russian, Portuguese"