movie_image.id,movie_image.ts,movie_image.source_content_type,movie_image.hash_file_content,movie_image.size,movie_image.path,movie_image.title,movie_image.access,movie.id,movie.ts,movie.title,movie.format,movie.genre,movie.rating,movie.consumer_advice,movie.release_date,movie.description,movie.model,movie.sku
1,"2018-03-21 21:08:04",image/jpeg,6a493666a158880f3ac935aa5e20d1086e5e768c,24152,/6a/49/36/66/6a493666a158880f3ac935aa5e20d1086e5e768c.jpg,,https://songer.datasn.com/data/api/v1/u_4db7936df78dfe468fc2/movies/by_table/movie_image_access/6a/49/36/66/6a493666a158880f3ac935aa5e20d1086e5e768c.jpg,1,"2018-03-21 02:58:10","Black Panther",DVD,Action,,,,"Hero. Legend. King. Marvel Studios’ “Black Panther” follows T’Challa who, after the death of his father, the King of Wakanda, returns home to the isolated, technologically advanced African nation to succeed to the throne and take his rightful place as kin",E30990,603840
2,"2018-03-21 21:08:05",image/jpeg,7350f62a4d44192b537173f24d43de7a8528c771,24328,/73/50/f6/2a/7350f62a4d44192b537173f24d43de7a8528c771.jpg,,https://songer.datasn.com/data/api/v1/u_4db7936df78dfe468fc2/movies/by_table/movie_image_access/73/50/f6/2a/7350f62a4d44192b537173f24d43de7a8528c771.jpg,2,"2018-03-21 02:58:12","Black Panther",Blu-Ray,Action,,,,"Hero. Legend. King. Marvel Studios’ “Black Panther” follows T’Challa who, after the death of his father, the King of Wakanda, returns home to the isolated, technologically advanced African nation to succeed to the throne and take his rightful place as kin",R30990,603841
3,"2018-03-21 21:08:10",image/jpeg,53527879a32c3d900ae268147c9dabd9d21b50ad,24438,/53/52/78/79/53527879a32c3d900ae268147c9dabd9d21b50ad.jpg,,https://songer.datasn.com/data/api/v1/u_4db7936df78dfe468fc2/movies/by_table/movie_image_access/53/52/78/79/53527879a32c3d900ae268147c9dabd9d21b50ad.jpg,3,"2018-03-21 02:58:14","Black Panther","3D Blu-Ray/ Blu-Ray",Action,,,,"Hero. Legend. King. Marvel Studios’ “Black Panther” follows T’Challa who, after the death of his father, the King of Wakanda, returns home to the isolated, technologically advanced African nation to succeed to the throne and take his rightful place as kin",S30990,603843
4,"2018-03-21 21:08:11",image/jpeg,04cd68d1ff5653db6110207f89f03de41ab39a70,24470,/04/cd/68/d1/04cd68d1ff5653db6110207f89f03de41ab39a70.jpg,,https://songer.datasn.com/data/api/v1/u_4db7936df78dfe468fc2/movies/by_table/movie_image_access/04/cd/68/d1/04cd68d1ff5653db6110207f89f03de41ab39a70.jpg,4,"2018-03-21 02:58:18","Black Panther","4K Ultra HD/ Blu-Ray",Action,,,,"Hero. Legend. King. Marvel Studios’ “Black Panther” follows T’Challa who, after the death of his father, the King of Wakanda, returns home to the isolated, technologically advanced African nation to succeed to the throne and take his rightful place as kin",K30990,603844
5,"2018-03-21 21:08:14",image/jpeg,199525de52203796d73c03c69158c5a5d538f05a,15227,/19/95/25/de/199525de52203796d73c03c69158c5a5d538f05a.jpg,,https://songer.datasn.com/data/api/v1/u_4db7936df78dfe468fc2/movies/by_table/movie_image_access/19/95/25/de/199525de52203796d73c03c69158c5a5d538f05a.jpg,5,"2018-03-21 02:58:22","Molly's Game",DVD,Drama,,,,"Deal With Her. MOLLY'S GAME is based on the true story of Molly Bloom, an Olympic-class skier who ran the world's most exclusive high-stakes poker game for a decade before being arrested in the middle of the night by 17 FBI agents wielding automatic weapo",82253SDG,603857
6,"2018-03-21 21:08:18",image/jpeg,bc1b478c0c12280e15448e0ed481c09efdfdc4e5,13754,/bc/1b/47/8c/bc1b478c0c12280e15448e0ed481c09efdfdc4e5.jpg,,https://songer.datasn.com/data/api/v1/u_4db7936df78dfe468fc2/movies/by_table/movie_image_access/bc/1b/47/8c/bc1b478c0c12280e15448e0ed481c09efdfdc4e5.jpg,6,"2018-03-21 02:58:26","Three Billboards Outside Ebbing, Missouri",DVD,Drama,,,,"THREE BILLBOARDS OUTSIDE EBBING, MISSOURI is a darkly comedic drama from Academy Award® winner Martin McDonagh (IN BRUGES). After months have passed without a culprit in her daughter’s murder case, Mildred Hayes (Academy Award® winner Frances McDormand) m",80220SDG,603855
7,"2018-03-21 21:08:22",image/jpeg,d3df3f4b174b56dea14d19449b4dabd16b251ac7,15330,/d3/df/3f/4b/d3df3f4b174b56dea14d19449b4dabd16b251ac7.jpg,,https://songer.datasn.com/data/api/v1/u_4db7936df78dfe468fc2/movies/by_table/movie_image_access/d3/df/3f/4b/d3df3f4b174b56dea14d19449b4dabd16b251ac7.jpg,7,"2018-03-21 02:58:27","Three Billboards Outside Ebbing, Missouri",Blu-Ray,Drama,,,,"THREE BILLBOARDS OUTSIDE EBBING, MISSOURI is a darkly comedic drama from Academy Award® winner Martin McDonagh (IN BRUGES). After months have passed without a culprit in her daughter’s murder case, Mildred Hayes (Academy Award® winner Frances McDormand) m",80220SBG,603856
8,"2018-03-21 21:08:26",image/jpeg,7a0c77cba0742de6a533ff5eeae2cce3e9d0fba5,16971,/7a/0c/77/cb/7a0c77cba0742de6a533ff5eeae2cce3e9d0fba5.jpg,,https://songer.datasn.com/data/api/v1/u_4db7936df78dfe468fc2/movies/by_table/movie_image_access/7a/0c/77/cb/7a0c77cba0742de6a533ff5eeae2cce3e9d0fba5.jpg,8,"2018-03-21 02:58:32","Insidious: The Last Key",Blu-Ray,Horror,,,09/05/18,"The creative minds behind the hit Insidious trilogy return for Insidious: The Last Key.  In the supernatural thriller, which welcomes back franchise standout Lin Shaye as Dr. Elise Rainier, the brilliant parapsychologist faces her most fearsome and person",BDH7275,603213
9,"2018-03-21 21:08:27",image/jpeg,45207a84cdd203183445217c8444a813867de480,16917,/45/20/7a/84/45207a84cdd203183445217c8444a813867de480.jpg,,https://songer.datasn.com/data/api/v1/u_4db7936df78dfe468fc2/movies/by_table/movie_image_access/45/20/7a/84/45207a84cdd203183445217c8444a813867de480.jpg,9,"2018-03-21 02:58:32",Breathe,DVD,Drama,,,,"An inspiration love story For his directorial debut, Andy Serkis brings to life the inspiring true love story between Robin and Diana Cavendish (Academy Award® nominee Andrew Garfield, Golden Globe® winner Claire Foy), an adventurous couple who refuse to ",DJ4370,548314
10,"2018-03-21 21:08:29",image/jpeg,53c415fe4ec580176d958ab34459981978024300,19244,/53/c4/15/fe/53c415fe4ec580176d958ab34459981978024300.jpg,,https://songer.datasn.com/data/api/v1/u_4db7936df78dfe468fc2/movies/by_table/movie_image_access/53/c4/15/fe/53c415fe4ec580176d958ab34459981978024300.jpg,10,"2018-03-21 02:58:32",Breathe,Blu-Ray,Drama,,,,"An inspiration love story For his directorial debut, Andy Serkis brings to life the inspiring true love story between Robin and Diana Cavendish (Academy Award® nominee Andrew Garfield, Golden Globe® winner Claire Foy), an adventurous couple who refuse to ",BDJ4370,548310
11,"2018-03-21 21:08:34",image/jpeg,03c6edbd70009e8fb96eca34e136dd4ed7a093b0,20058,/03/c6/ed/bd/03c6edbd70009e8fb96eca34e136dd4ed7a093b0.jpg,,https://songer.datasn.com/data/api/v1/u_4db7936df78dfe468fc2/movies/by_table/movie_image_access/03/c6/ed/bd/03c6edbd70009e8fb96eca34e136dd4ed7a093b0.jpg,11,"2018-03-21 02:58:33","Commuter, The","Blu-Ray/ Ultraviolet",Action,,,,"His Life Is On the Line In this action-packed thriller, Liam Neeson plays an insurance salesman, Michael, on his daily commute home, which quickly becomes anything but routine. After being contacted by a mysterious stranger, Michael is forced to uncover t",BDJ4349,569800
12,"2018-03-21 21:08:38",image/jpeg,3b2ca9344014cb2cb0d9e5270b20feba30fafb12,17283,/3b/2c/a9/34/3b2ca9344014cb2cb0d9e5270b20feba30fafb12.jpg,,https://songer.datasn.com/data/api/v1/u_4db7936df78dfe468fc2/movies/by_table/movie_image_access/3b/2c/a9/34/3b2ca9344014cb2cb0d9e5270b20feba30fafb12.jpg,12,"2018-03-21 02:58:33","Commuter, The",DVD,Action,,,,"His Life Is On the Line In this action-packed thriller, Liam Neeson plays an insurance salesman, Michael, on his daily commute home, which quickly becomes anything but routine. After being contacted by a mysterious stranger, Michael is forced to uncover t",DJ4349,569810
13,"2018-03-21 21:08:42",image/jpeg,829f7db5cf68606a9f6a2f27a5e4f5b10d0e6b50,13321,/82/9f/7d/b5/829f7db5cf68606a9f6a2f27a5e4f5b10d0e6b50.jpg,,https://songer.datasn.com/data/api/v1/u_4db7936df78dfe468fc2/movies/by_table/movie_image_access/82/9f/7d/b5/829f7db5cf68606a9f6a2f27a5e4f5b10d0e6b50.jpg,13,"2018-03-21 02:58:36","I, Tonya",DVD,Comedy,,,,"Based on the unbelievable but true events, I, TONYA is a darkly comedic tale of American figure skater, Tonya Harding, and one of the most sensational scandals in sports history. Though Harding was the first American woman to complete a triple axel in com",R-126168-9,326641
14,"2018-03-21 21:08:45",image/jpeg,69da88bba125d38a231b292790ad2f6edb342aa9,16327,/69/da/88/bb/69da88bba125d38a231b292790ad2f6edb342aa9.jpg,,https://songer.datasn.com/data/api/v1/u_4db7936df78dfe468fc2/movies/by_table/movie_image_access/69/da/88/bb/69da88bba125d38a231b292790ad2f6edb342aa9.jpg,14,"2018-03-21 02:58:40","I, Tonya",Blu-Ray,Comedy,,,,"Based on the unbelievable but true events, I, TONYA is a darkly comedic tale of American figure skater, Tonya Harding, and one of the most sensational scandals in sports history. Though Harding was the first American woman to complete a triple axel in com",R-126720-8,326645
15,"2018-03-21 21:08:50",image/jpeg,bc76a7f9105efd362b0569736047b73a67ab1357,14714,/bc/76/a7/f9/bc76a7f9105efd362b0569736047b73a67ab1357.jpg,,https://songer.datasn.com/data/api/v1/u_4db7936df78dfe468fc2/movies/by_table/movie_image_access/bc/76/a7/f9/bc76a7f9105efd362b0569736047b73a67ab1357.jpg,15,"2018-03-21 02:58:43","Phantom Thread",Blu-Ray,Drama,,,09/05/18,"Set in the glamour of 1950s post-war London, renowned dressmaker Reynolds Woodcock (Daniel Day-Lewis) and his sister Cyril (Lesley Manville) are at the center of British fashion, dressing royalty, movie stars, heiresses, socialites, debutants, and dames w",BDJ6163,326686
16,"2018-03-21 21:08:52",image/jpeg,64bf5b84fa7ad595989a26d1a1d9affac09ce0fd,12491,/64/bf/5b/84/64bf5b84fa7ad595989a26d1a1d9affac09ce0fd.jpg,,https://songer.datasn.com/data/api/v1/u_4db7936df78dfe468fc2/movies/by_table/movie_image_access/64/bf/5b/84/64bf5b84fa7ad595989a26d1a1d9affac09ce0fd.jpg,16,"2018-03-21 02:58:46","Phantom Thread",DVD,Drama,,,09/05/18,"Set in the glamour of 1950s post-war London, renowned dressmaker Reynolds Woodcock (Daniel Day-Lewis) and his sister Cyril (Lesley Manville) are at the center of British fashion, dressing royalty, movie stars, heiresses, socialites, debutants, and dames w",DJ6163,326682
17,"2018-03-21 21:08:56",image/jpeg,738b48ba9a11d695174886572cac91f79fa72fc1,14152,/73/8b/48/ba/738b48ba9a11d695174886572cac91f79fa72fc1.jpg,,https://songer.datasn.com/data/api/v1/u_4db7936df78dfe468fc2/movies/by_table/movie_image_access/73/8b/48/ba/738b48ba9a11d695174886572cac91f79fa72fc1.jpg,17,"2018-03-21 02:58:50","Insidious: The Last Key",DVD,Horror,,,09/05/18,"The creative minds behind the hit Insidious trilogy return for Insidious: The Last Key.  In the supernatural thriller, which welcomes back franchise standout Lin Shaye as Dr. Elise Rainier, the brilliant parapsychologist faces her most fearsome and person",DH7275,603209
18,"2018-03-21 21:08:58",image/jpeg,db9fe6a94068d61bc283e3882e66c4f56ae1f6ab,12424,/db/9f/e6/a9/db9fe6a94068d61bc283e3882e66c4f56ae1f6ab.jpg,,https://songer.datasn.com/data/api/v1/u_4db7936df78dfe468fc2/movies/by_table/movie_image_access/db/9f/e6/a9/db9fe6a94068d61bc283e3882e66c4f56ae1f6ab.jpg,18,"2018-03-21 02:58:54","Shape Of Water, The",DVD,Drama,MA15+,"Strong themes, violence and a sex scene",,"A Fairy Tale for Troubled TimesFrom master story teller, Guillermo del Toro, comes THE SHAPE OF WATER - an other-worldly fable, set against the backdrop of Cold War era America circa 1962.  In the hidden high-security government laboratory where she works",83301SDG,603851
19,"2018-03-21 21:09:01",image/jpeg,19b12288d572570cb8fc7201363d1b5cc40130e0,16050,/19/b1/22/88/19b12288d572570cb8fc7201363d1b5cc40130e0.jpg,,https://songer.datasn.com/data/api/v1/u_4db7936df78dfe468fc2/movies/by_table/movie_image_access/19/b1/22/88/19b12288d572570cb8fc7201363d1b5cc40130e0.jpg,19,"2018-03-21 02:58:57","Shape Of Water, The","4K Ultra HD/ Blu-Ray/ Digital",Drama,MA15+,"Strong themes, violence and a sex scene",,"A Fairy Tale for Troubled TimesFrom master story teller, Guillermo del Toro, comes THE SHAPE OF WATER - an other-worldly fable, set against the backdrop of Cold War era America circa 1962.  In the hidden high-security government laboratory where she works",95862SBG,603853
20,"2018-03-21 21:09:05",image/jpeg,7879a32b0d5c388442067081b03f951f0afd6ddc,13712,/78/79/a3/2b/7879a32b0d5c388442067081b03f951f0afd6ddc.jpg,,https://songer.datasn.com/data/api/v1/u_4db7936df78dfe468fc2/movies/by_table/movie_image_access/78/79/a3/2b/7879a32b0d5c388442067081b03f951f0afd6ddc.jpg,20,"2018-03-21 02:59:00","Shape Of Water, The",Blu-Ray,Drama,MA15+,"Strong themes, violence and a sex scene",,"A Fairy Tale for Troubled TimesFrom master story teller, Guillermo del Toro, comes THE SHAPE OF WATER - an other-worldly fable, set against the backdrop of Cold War era America circa 1962.  In the hidden high-security government laboratory where she works",603852,603852
21,"2018-03-21 21:09:07",image/jpeg,2f893576cbee395ccdb350e4d8f1b23adc713744,20745,/2f/89/35/76/2f893576cbee395ccdb350e4d8f1b23adc713744.jpg,,https://songer.datasn.com/data/api/v1/u_4db7936df78dfe468fc2/movies/by_table/movie_image_access/2f/89/35/76/2f893576cbee395ccdb350e4d8f1b23adc713744.jpg,21,"2018-03-21 02:59:02","Greatest Showman, The",DVD,Musical,PG,"Mild themes",02/05/18,"Hugh Jackman leads an all-star cast in this bold and original musical filled with infectious show stopping performances that will bring you to your feet time and time again. Inspired by the story of P.T. Barnum (Jackman) and celebrating the birth of show ",80160SDG,603190
22,"2018-03-21 21:09:08",image/jpeg,bf2d4fef71788660f07c5989fc9dd852eaac658e,21792,/bf/2d/4f/ef/bf2d4fef71788660f07c5989fc9dd852eaac658e.jpg,,https://songer.datasn.com/data/api/v1/u_4db7936df78dfe468fc2/movies/by_table/movie_image_access/bf/2d/4f/ef/bf2d4fef71788660f07c5989fc9dd852eaac658e.jpg,22,"2018-03-21 02:59:06","Greatest Showman, The","4K Ultra HD/ Blu-Ray/ Digital",Musical,PG,"Mild themes",02/05/18,"Hugh Jackman leads an all-star cast in this bold and original musical filled with infectious show stopping performances that will bring you to your feet time and time again. Inspired by the story of P.T. Barnum (Jackman) and celebrating the birth of show ",95856SBG,603198
23,"2018-03-21 21:09:10",image/jpeg,5038b20c3aebfbcccc88b3bb1e9fe5d6f5051ca5,16417,/50/38/b2/0c/5038b20c3aebfbcccc88b3bb1e9fe5d6f5051ca5.jpg,,https://songer.datasn.com/data/api/v1/u_4db7936df78dfe468fc2/movies/by_table/movie_image_access/50/38/b2/0c/5038b20c3aebfbcccc88b3bb1e9fe5d6f5051ca5.jpg,23,"2018-03-21 02:59:07","Snap Shot",Blu-Ray,Horror,M,"Mature themes, violence and nudity",25/04/18,"It started with a glamour shot and ended with a Murder. The remains of a body are removed from a fire at a photographer’s studio. In flashback, successful model Madeleine (Chantal Contouri) introduces her friend Angela (Sigrid Thornton) to leading adverti",GDF025,337389
24,"2018-03-21 21:09:14",image/jpeg,d7b94aa795af2eb371c0033ae21a77f8c85aaabe,23529,/d7/b9/4a/a7/d7b94aa795af2eb371c0033ae21a77f8c85aaabe.jpg,,https://songer.datasn.com/data/api/v1/u_4db7936df78dfe468fc2/movies/by_table/movie_image_access/d7/b9/4a/a7/d7b94aa795af2eb371c0033ae21a77f8c85aaabe.jpg,24,"2018-03-21 02:59:09","Killing Gunther",DVD,Action,MA15+,"Strong violence",25/04/18,"They're Out to Change the Killing Business A group of eccentric assassins are fed up with Gunther, the world's greatest hitman, and decide to kill him, but their plan turns into a series of bungled encounters as Gunther seems to always be one step ahead.",MMA9258,603792
25,"2018-03-21 21:09:16",image/jpeg,9d3c178738d76c3f909144f13c390ee690062646,16855,/9d/3c/17/87/9d3c178738d76c3f909144f13c390ee690062646.jpg,,https://songer.datasn.com/data/api/v1/u_4db7936df78dfe468fc2/movies/by_table/movie_image_access/9d/3c/17/87/9d3c178738d76c3f909144f13c390ee690062646.jpg,25,"2018-03-21 02:59:13","Take Every Wave: The Life Of Laird Hamilton",DVD,Documentary,M,"Coarse language",25/04/18,"The Life of a Big Wave Surfing Legend This is the remarkable story of an American icon who changed the sport of big wave surfing forever. Transcending the surf genre, this in-depth portrait of a hard-charging athlete explores the fear, courage and ambitio",MMA9253,603791
26,"2018-03-21 21:09:21",image/jpeg,bbed7f1b8dd12db0dadc5df00cf95e8e3bd04470,21471,/bb/ed/7f/1b/bbed7f1b8dd12db0dadc5df00cf95e8e3bd04470.jpg,,https://songer.datasn.com/data/api/v1/u_4db7936df78dfe468fc2/movies/by_table/movie_image_access/bb/ed/7f/1b/bbed7f1b8dd12db0dadc5df00cf95e8e3bd04470.jpg,26,"2018-03-21 02:59:17","Swinging Safari",Blu-Ray,Comedy,M,"Mature themes, sex scenes and coarse language",25/04/18,"1970s Australia: A 200-ton blue whale washes up on a local beach and the kids think it's the biggest thing that's ever happened in their lives. Behind closed doors, the Mums and Dads of this quiet suburban cul-de-sac celebrate in their own special way, by",86726SBG,606984
27,"2018-03-21 21:09:23",image/jpeg,fe48e68a2e20914003c9fd52f2a7dcc4a2f79d89,17723,/fe/48/e6/8a/fe48e68a2e20914003c9fd52f2a7dcc4a2f79d89.jpg,,https://songer.datasn.com/data/api/v1/u_4db7936df78dfe468fc2/movies/by_table/movie_image_access/fe/48/e6/8a/fe48e68a2e20914003c9fd52f2a7dcc4a2f79d89.jpg,27,"2018-03-21 02:59:20","Post, The",DVD,Drama,M,"Coarse language",25/04/18,"OSCAR® Winners Steven Spielberg, Meryl Streep and Tom Hanks* team for the first time in this thrilling film based on a true story. Determined to uphold the nation’s civil liberties, Katharine Graham (Streep), publisher of The Washington Post, and hard-nos",86460SDG,607013
28,"2018-03-21 21:09:26",image/jpeg,4f663b7d219169230c55527ad60e028188144dce,20598,/4f/66/3b/7d/4f663b7d219169230c55527ad60e028188144dce.jpg,,https://songer.datasn.com/data/api/v1/u_4db7936df78dfe468fc2/movies/by_table/movie_image_access/4f/66/3b/7d/4f663b7d219169230c55527ad60e028188144dce.jpg,28,"2018-03-21 02:59:21","Swinging Safari",DVD,Comedy,M,"Mature themes, sex scenes and coarse language",25/04/18,"1970s Australia: A 200-ton blue whale washes up on a local beach and the kids think it's the biggest thing that's ever happened in their lives. Behind closed doors, the Mums and Dads of this quiet suburban cul-de-sac celebrate in their own special way, by",86726SDG,606980
29,"2018-03-21 21:09:29",image/jpeg,00c48144bc52989f3d683f3522ed9ec89ae8c5dd,19644,/00/c4/81/44/00c48144bc52989f3d683f3522ed9ec89ae8c5dd.jpg,,https://songer.datasn.com/data/api/v1/u_4db7936df78dfe468fc2/movies/by_table/movie_image_access/00/c4/81/44/00c48144bc52989f3d683f3522ed9ec89ae8c5dd.jpg,29,"2018-03-21 02:59:24","Post, The",Blu-Ray,Drama,M,"Coarse language",25/04/18,"OSCAR® Winners Steven Spielberg, Meryl Streep and Tom Hanks* team for the first time in this thrilling film based on a true story. Determined to uphold the nation’s civil liberties, Katharine Graham (Streep), publisher of The Washington Post, and hard-nos",86460SBG,607017
30,"2018-03-21 21:09:29",image/jpeg,602f76933c6211d17357dc0aa1d4e35cccd0356d,19601,/60/2f/76/93/602f76933c6211d17357dc0aa1d4e35cccd0356d.jpg,,https://songer.datasn.com/data/api/v1/u_4db7936df78dfe468fc2/movies/by_table/movie_image_access/60/2f/76/93/602f76933c6211d17357dc0aa1d4e35cccd0356d.jpg,59,"2018-03-21 02:59:27","Maze Runner: The Death Cure",DVD,Adventure,M,"Science fiction themes, violence and coarse language",25/04/18,"The End Will Be WCKD Thomas (Dylan O’Brien) leads his group of escaped Gladers on their final mission. To save their friends, they must break into the legendary Last City, a WCKD-controlled labyrinth that may turn out to be the deadliest maze of all! Any ",67900SDG,606966
31,"2018-03-21 21:09:29",image/jpeg,2cb20a0f09055573d62a999ec170a71a6f298115,21409,/2c/b2/0a/0f/2cb20a0f09055573d62a999ec170a71a6f298115.jpg,,https://songer.datasn.com/data/api/v1/u_4db7936df78dfe468fc2/movies/by_table/movie_image_access/2c/b2/0a/0f/2cb20a0f09055573d62a999ec170a71a6f298115.jpg,60,"2018-03-21 02:59:32","Maze Runner: The Death Cure","4K Ultra HD/ Blu-Ray/ Digital",Adventure,M,"Science fiction themes, violence and coarse language",25/04/18,"The End Will Be WCKD Thomas (Dylan O’Brien) leads his group of escaped Gladers on their final mission. To save their friends, they must break into the legendary Last City, a WCKD-controlled labyrinth that may turn out to be the deadliest maze of all! Any ",95828SBG,606975
32,"2018-03-21 21:09:30",image/jpeg,97eb3a294284bf4ebd472b164c0c84048e3b3a0a,19703,/97/eb/3a/29/97eb3a294284bf4ebd472b164c0c84048e3b3a0a.jpg,,https://songer.datasn.com/data/api/v1/u_4db7936df78dfe468fc2/movies/by_table/movie_image_access/97/eb/3a/29/97eb3a294284bf4ebd472b164c0c84048e3b3a0a.jpg,61,"2018-03-21 02:59:34","Maze Runner Trilogy","3 DVD",Adventure,M,"Science fiction themes, violence, sustained threat and coarse language",25/04/18,"The Maze RunnerIn this heart-pounding thriller based on the best-selling novel, Thomas (Dylan OʼBrien of MTVʼs Teen Wolf ) wakes up trapped in a massive, ever-changing maze with a group of boys who have no memory of the outside world. Facing dangerous obs",86700SDG,606987
33,"2018-03-21 21:09:33",image/jpeg,114febd06a6b2ed9c2ea3c59cf31e2ca085a8dba,21583,/11/4f/eb/d0/114febd06a6b2ed9c2ea3c59cf31e2ca085a8dba.jpg,,https://songer.datasn.com/data/api/v1/u_4db7936df78dfe468fc2/movies/by_table/movie_image_access/11/4f/eb/d0/114febd06a6b2ed9c2ea3c59cf31e2ca085a8dba.jpg,62,"2018-03-21 02:59:37","Maze Runner Trilogy","3 Blu-Ray",Adventure,M,"Science fiction themes, violence, sustained threat and coarse language",25/04/18,"The Maze RunnerIn this heart-pounding thriller based on the best-selling novel, Thomas (Dylan OʼBrien of MTVʼs Teen Wolf ) wakes up trapped in a massive, ever-changing maze with a group of boys who have no memory of the outside world. Facing dangerous obs",86700SBG,606991
34,"2018-03-21 21:09:33",image/jpeg,3673d62da60e78d0537ec93a290dac446238632f,22092,/36/73/d6/2d/3673d62da60e78d0537ec93a290dac446238632f.jpg,,https://songer.datasn.com/data/api/v1/u_4db7936df78dfe468fc2/movies/by_table/movie_image_access/36/73/d6/2d/3673d62da60e78d0537ec93a290dac446238632f.jpg,63,"2018-03-21 02:59:37","Jungle Bunch, The",DVD,Childrens,G,"Very mild themes, animated violence and coarse language",18/04/18,"The fun and lovable gang, THE JUNGLE BUNCH are all set to leap from television to their full-length feature! This ragtag and mismatched group of unlikely heroes, led by Maurice, the Great Tiger-striped penguin warrior, is set to face their biggest challen",85245SDG,607005
35,"2018-03-21 21:09:34",image/jpeg,74d1674e2f4c6fc2136373d46fbeada331c8c51f,22425,/74/d1/67/4e/74d1674e2f4c6fc2136373d46fbeada331c8c51f.jpg,,https://songer.datasn.com/data/api/v1/u_4db7936df78dfe468fc2/movies/by_table/movie_image_access/74/d1/67/4e/74d1674e2f4c6fc2136373d46fbeada331c8c51f.jpg,64,"2018-03-21 02:59:40","Suicide Squad: Hell To Pay",Blu-Ray,Action,,,18/04/18,"It’s batter up at Belle Reve and that can only mean that Amanda Waller, the penitentiary’s cold and calculating warden, has a mission that only the damned will take on. It’s time to unleash Task Force X again, stacked with seasoned vets such as Deadshot, ",R-124502-8,603703
36,"2018-03-21 21:09:35",image/jpeg,b3bfb618d2d900019cc0c70d26bb9c6e53cbc827,22872,/b3/bf/b6/18/b3bfb618d2d900019cc0c70d26bb9c6e53cbc827.jpg,,https://songer.datasn.com/data/api/v1/u_4db7936df78dfe468fc2/movies/by_table/movie_image_access/b3/bf/b6/18/b3bfb618d2d900019cc0c70d26bb9c6e53cbc827.jpg,65,"2018-03-21 02:59:42","Suicide Squad: Hell To Pay","4K Ultra HD/ Blu-Ray",Action,,,18/04/18,"It’s batter up at Belle Reve and that can only mean that Amanda Waller, the penitentiary’s cold and calculating warden, has a mission that only the damned will take on. It’s time to unleash Task Force X again, stacked with seasoned vets such as Deadshot, ",R-126898-8,603702