image.id,image.ts,baobao.id,baobao.ts,baobao.title,baobao.jiage,baobao.xiaoliang,baobao.gongneng,baobao.chandi,baobao.jiandai_chicun,baobao.yanse,baobao.neibu_jiegou,baobao.wujin_caizhi,baobao.wujin_yanse,baobao.chicun,baobao.kaihe_fangshi,baobao.kuanshi,baobao.fushu_jiandai,baobao.caizhi,baobao.shiyong_renqun,baobao.pinpai
1,"2018-08-03 01:32:58",1,"2018-08-03 01:32:58","Michael Kors/迈克·科尔斯牛皮革材质经典logo装饰女士手提单肩包",￥2405,,手提/单肩/斜挎,越南,112,黑色,拉链暗袋,,,112,,横款,,牛皮,女士,迈克·科尔斯
2,"2018-08-03 01:32:58",1,"2018-08-03 01:32:58","Michael Kors/迈克·科尔斯牛皮革材质经典logo装饰女士手提单肩包",￥2405,,手提/单肩/斜挎,越南,112,黑色,拉链暗袋,,,112,,横款,,牛皮,女士,迈克·科尔斯
3,"2018-08-03 01:32:58",1,"2018-08-03 01:32:58","Michael Kors/迈克·科尔斯牛皮革材质经典logo装饰女士手提单肩包",￥2405,,手提/单肩/斜挎,越南,112,黑色,拉链暗袋,,,112,,横款,,牛皮,女士,迈克·科尔斯
4,"2018-08-03 01:32:58",1,"2018-08-03 01:32:58","Michael Kors/迈克·科尔斯牛皮革材质经典logo装饰女士手提单肩包",￥2405,,手提/单肩/斜挎,越南,112,黑色,拉链暗袋,,,112,,横款,,牛皮,女士,迈克·科尔斯
5,"2018-08-03 01:32:58",1,"2018-08-03 01:32:58","Michael Kors/迈克·科尔斯牛皮革材质经典logo装饰女士手提单肩包",￥2405,,手提/单肩/斜挎,越南,112,黑色,拉链暗袋,,,112,,横款,,牛皮,女士,迈克·科尔斯
6,"2018-08-03 01:32:59",2,"2018-08-03 01:32:59","Michael Kors/迈克·科尔斯 Mercer系列 MK荔枝纹锁头单肩斜挎包 黑色",￥1816,27件,单肩包,印尼（温馨提示：由于生产批次不同，产地会有所不同。）,75-110cm,黑色,拉链暗袋,其他,金色,75-110cm,拉链开合,横款,有,其他,女士,迈克·科尔斯
7,"2018-08-03 01:32:59",2,"2018-08-03 01:32:59","Michael Kors/迈克·科尔斯 Mercer系列 MK荔枝纹锁头单肩斜挎包 黑色",￥1816,27件,单肩包,印尼（温馨提示：由于生产批次不同，产地会有所不同。）,75-110cm,黑色,拉链暗袋,其他,金色,75-110cm,拉链开合,横款,有,其他,女士,迈克·科尔斯
8,"2018-08-03 01:32:59",2,"2018-08-03 01:32:59","Michael Kors/迈克·科尔斯 Mercer系列 MK荔枝纹锁头单肩斜挎包 黑色",￥1816,27件,单肩包,印尼（温馨提示：由于生产批次不同，产地会有所不同。）,75-110cm,黑色,拉链暗袋,其他,金色,75-110cm,拉链开合,横款,有,其他,女士,迈克·科尔斯
9,"2018-08-03 01:32:59",2,"2018-08-03 01:32:59","Michael Kors/迈克·科尔斯 Mercer系列 MK荔枝纹锁头单肩斜挎包 黑色",￥1816,27件,单肩包,印尼（温馨提示：由于生产批次不同，产地会有所不同。）,75-110cm,黑色,拉链暗袋,其他,金色,75-110cm,拉链开合,横款,有,其他,女士,迈克·科尔斯
10,"2018-08-03 01:32:59",2,"2018-08-03 01:32:59","Michael Kors/迈克·科尔斯 Mercer系列 MK荔枝纹锁头单肩斜挎包 黑色",￥1816,27件,单肩包,印尼（温馨提示：由于生产批次不同，产地会有所不同。）,75-110cm,黑色,拉链暗袋,其他,金色,75-110cm,拉链开合,横款,有,其他,女士,迈克·科尔斯
11,"2018-08-03 01:33:01",3,"2018-08-03 01:33:01","Michael Kors/迈克·科尔斯 MK女士牛皮单肩斜挎笑脸包30T3GLMM2L",￥1975,,斜挎包,中国，越南，印尼等（因批次不同，产地可能会不同）,可调节,多色,Logo纹织布内里，一个拉链袋,其他,其它,可调节,拉链开合,横款,有,其他,女士,迈克·科尔斯
12,"2018-08-03 01:33:01",3,"2018-08-03 01:33:01","Michael Kors/迈克·科尔斯 MK女士牛皮单肩斜挎笑脸包30T3GLMM2L",￥1975,,斜挎包,中国，越南，印尼等（因批次不同，产地可能会不同）,可调节,多色,Logo纹织布内里，一个拉链袋,其他,其它,可调节,拉链开合,横款,有,其他,女士,迈克·科尔斯
13,"2018-08-03 01:33:01",3,"2018-08-03 01:33:01","Michael Kors/迈克·科尔斯 MK女士牛皮单肩斜挎笑脸包30T3GLMM2L",￥1975,,斜挎包,中国，越南，印尼等（因批次不同，产地可能会不同）,可调节,多色,Logo纹织布内里，一个拉链袋,其他,其它,可调节,拉链开合,横款,有,其他,女士,迈克·科尔斯
14,"2018-08-03 01:33:01",3,"2018-08-03 01:33:01","Michael Kors/迈克·科尔斯 MK女士牛皮单肩斜挎笑脸包30T3GLMM2L",￥1975,,斜挎包,中国，越南，印尼等（因批次不同，产地可能会不同）,可调节,多色,Logo纹织布内里，一个拉链袋,其他,其它,可调节,拉链开合,横款,有,其他,女士,迈克·科尔斯
15,"2018-08-03 01:33:01",3,"2018-08-03 01:33:01","Michael Kors/迈克·科尔斯 MK女士牛皮单肩斜挎笑脸包30T3GLMM2L",￥1975,,斜挎包,中国，越南，印尼等（因批次不同，产地可能会不同）,可调节,多色,Logo纹织布内里，一个拉链袋,其他,其它,可调节,拉链开合,横款,有,其他,女士,迈克·科尔斯
16,"2018-08-03 01:33:01",4,"2018-08-03 01:33:01","Michael Kors/迈克·科尔斯女士皮质黑色手提包30F6SM9T3L BLACK",￥2998,,,德国、意大利、孟加拉、中国等,,黑色,"敞口开合 1拉链隔层 1暗拉",,,32*25*14,直接开合,,,皮质,女士,迈克·科尔斯
17,"2018-08-03 01:33:01",4,"2018-08-03 01:33:01","Michael Kors/迈克·科尔斯女士皮质黑色手提包30F6SM9T3L BLACK",￥2998,,,德国、意大利、孟加拉、中国等,,黑色,"敞口开合 1拉链隔层 1暗拉",,,32*25*14,直接开合,,,皮质,女士,迈克·科尔斯
18,"2018-08-03 01:33:01",4,"2018-08-03 01:33:01","Michael Kors/迈克·科尔斯女士皮质黑色手提包30F6SM9T3L BLACK",￥2998,,,德国、意大利、孟加拉、中国等,,黑色,"敞口开合 1拉链隔层 1暗拉",,,32*25*14,直接开合,,,皮质,女士,迈克·科尔斯
19,"2018-08-03 01:33:01",4,"2018-08-03 01:33:01","Michael Kors/迈克·科尔斯女士皮质黑色手提包30F6SM9T3L BLACK",￥2998,,,德国、意大利、孟加拉、中国等,,黑色,"敞口开合 1拉链隔层 1暗拉",,,32*25*14,直接开合,,,皮质,女士,迈克·科尔斯
20,"2018-08-03 01:33:01",4,"2018-08-03 01:33:01","Michael Kors/迈克·科尔斯女士皮质黑色手提包30F6SM9T3L BLACK",￥2998,,,德国、意大利、孟加拉、中国等,,黑色,"敞口开合 1拉链隔层 1暗拉",,,32*25*14,直接开合,,,皮质,女士,迈克·科尔斯
21,"2018-08-03 01:33:04",5,"2018-08-03 01:33:04","Michael Kors/迈克·科尔斯MERCER系列粉色牛皮中号女士手拎包单肩包 30F6GM9M2L SOFT PINK",￥1763,,,德国、意大利、孟加拉、中国等,,粉色,敞口开合，中间1个拉链隔层，两侧敞口口袋，外置吊坠装饰。,,,22*11*18,直接开合,,,牛皮,女士,迈克·科尔斯
22,"2018-08-03 01:33:04",5,"2018-08-03 01:33:04","Michael Kors/迈克·科尔斯MERCER系列粉色牛皮中号女士手拎包单肩包 30F6GM9M2L SOFT PINK",￥1763,,,德国、意大利、孟加拉、中国等,,粉色,敞口开合，中间1个拉链隔层，两侧敞口口袋，外置吊坠装饰。,,,22*11*18,直接开合,,,牛皮,女士,迈克·科尔斯
23,"2018-08-03 01:33:04",5,"2018-08-03 01:33:04","Michael Kors/迈克·科尔斯MERCER系列粉色牛皮中号女士手拎包单肩包 30F6GM9M2L SOFT PINK",￥1763,,,德国、意大利、孟加拉、中国等,,粉色,敞口开合，中间1个拉链隔层，两侧敞口口袋，外置吊坠装饰。,,,22*11*18,直接开合,,,牛皮,女士,迈克·科尔斯
24,"2018-08-03 01:33:04",5,"2018-08-03 01:33:04","Michael Kors/迈克·科尔斯MERCER系列粉色牛皮中号女士手拎包单肩包 30F6GM9M2L SOFT PINK",￥1763,,,德国、意大利、孟加拉、中国等,,粉色,敞口开合，中间1个拉链隔层，两侧敞口口袋，外置吊坠装饰。,,,22*11*18,直接开合,,,牛皮,女士,迈克·科尔斯
25,"2018-08-03 01:33:04",5,"2018-08-03 01:33:04","Michael Kors/迈克·科尔斯MERCER系列粉色牛皮中号女士手拎包单肩包 30F6GM9M2L SOFT PINK",￥1763,,,德国、意大利、孟加拉、中国等,,粉色,敞口开合，中间1个拉链隔层，两侧敞口口袋，外置吊坠装饰。,,,22*11*18,直接开合,,,牛皮,女士,迈克·科尔斯
26,"2018-08-03 01:33:06",6,"2018-08-03 01:33:06","【2018春夏】Michael Kors/迈克·科尔斯 羊皮单肩包女士MK SLOAN",￥3261,,,中国,,黑色,,,,"27长x19高x8宽 （cm）",,,,羊皮,女士,迈克·科尔斯
27,"2018-08-03 01:33:06",6,"2018-08-03 01:33:06","【2018春夏】Michael Kors/迈克·科尔斯 羊皮单肩包女士MK SLOAN",￥3261,,,中国,,黑色,,,,"27长x19高x8宽 （cm）",,,,羊皮,女士,迈克·科尔斯
28,"2018-08-03 01:33:06",6,"2018-08-03 01:33:06","【2018春夏】Michael Kors/迈克·科尔斯 羊皮单肩包女士MK SLOAN",￥3261,,,中国,,黑色,,,,"27长x19高x8宽 （cm）",,,,羊皮,女士,迈克·科尔斯
29,"2018-08-03 01:33:06",6,"2018-08-03 01:33:06","【2018春夏】Michael Kors/迈克·科尔斯 羊皮单肩包女士MK SLOAN",￥3261,,,中国,,黑色,,,,"27长x19高x8宽 （cm）",,,,羊皮,女士,迈克·科尔斯
30,"2018-08-03 01:33:06",6,"2018-08-03 01:33:06","【2018春夏】Michael Kors/迈克·科尔斯 羊皮单肩包女士MK SLOAN",￥3261,,,中国,,黑色,,,,"27长x19高x8宽 （cm）",,,,羊皮,女士,迈克·科尔斯
31,"2018-08-03 01:33:10",7,"2018-08-03 01:33:10","Michael Kors/迈克·科尔斯 WHITNEY系列女士黑色牛皮大号单肩包 30T8GXIL3L BLACK",￥3069,,,德国、意大利、孟加拉、中国等,,黑色,扣翻盖开合，内置1个拉链隔层，2个主袋，1个贴袋，1个拉链贴袋，外置1个吸扣贴袋,,,24*8*18,翻盖开合,,,牛皮,女士,迈克·科尔斯
32,"2018-08-03 01:33:10",7,"2018-08-03 01:33:10","Michael Kors/迈克·科尔斯 WHITNEY系列女士黑色牛皮大号单肩包 30T8GXIL3L BLACK",￥3069,,,德国、意大利、孟加拉、中国等,,黑色,扣翻盖开合，内置1个拉链隔层，2个主袋，1个贴袋，1个拉链贴袋，外置1个吸扣贴袋,,,24*8*18,翻盖开合,,,牛皮,女士,迈克·科尔斯
33,"2018-08-03 01:33:10",7,"2018-08-03 01:33:10","Michael Kors/迈克·科尔斯 WHITNEY系列女士黑色牛皮大号单肩包 30T8GXIL3L BLACK",￥3069,,,德国、意大利、孟加拉、中国等,,黑色,扣翻盖开合，内置1个拉链隔层，2个主袋，1个贴袋，1个拉链贴袋，外置1个吸扣贴袋,,,24*8*18,翻盖开合,,,牛皮,女士,迈克·科尔斯
34,"2018-08-03 01:33:10",7,"2018-08-03 01:33:10","Michael Kors/迈克·科尔斯 WHITNEY系列女士黑色牛皮大号单肩包 30T8GXIL3L BLACK",￥3069,,,德国、意大利、孟加拉、中国等,,黑色,扣翻盖开合，内置1个拉链隔层，2个主袋，1个贴袋，1个拉链贴袋，外置1个吸扣贴袋,,,24*8*18,翻盖开合,,,牛皮,女士,迈克·科尔斯
35,"2018-08-03 01:33:10",7,"2018-08-03 01:33:10","Michael Kors/迈克·科尔斯 WHITNEY系列女士黑色牛皮大号单肩包 30T8GXIL3L BLACK",￥3069,,,德国、意大利、孟加拉、中国等,,黑色,扣翻盖开合，内置1个拉链隔层，2个主袋，1个贴袋，1个拉链贴袋，外置1个吸扣贴袋,,,24*8*18,翻盖开合,,,牛皮,女士,迈克·科尔斯
36,"2018-08-03 01:33:14",8,"2018-08-03 01:33:14","【Designer Bags】【18秋冬】 Michael Kors/迈克·科尔斯 女士 单肩包 时尚 通勤包 3328欧洲假期，8月2号之后的订单发货延迟至8月27号",￥1973,,,意大利、西班牙、越南等，批次不同产地不同,,,,,,7*6*18*10cm,,,,,,迈克·科尔斯
37,"2018-08-03 01:33:14",8,"2018-08-03 01:33:14","【Designer Bags】【18秋冬】 Michael Kors/迈克·科尔斯 女士 单肩包 时尚 通勤包 3328欧洲假期，8月2号之后的订单发货延迟至8月27号",￥1973,,,意大利、西班牙、越南等，批次不同产地不同,,,,,,7*6*18*10cm,,,,,,迈克·科尔斯
38,"2018-08-03 01:33:14",8,"2018-08-03 01:33:14","【Designer Bags】【18秋冬】 Michael Kors/迈克·科尔斯 女士 单肩包 时尚 通勤包 3328欧洲假期，8月2号之后的订单发货延迟至8月27号",￥1973,,,意大利、西班牙、越南等，批次不同产地不同,,,,,,7*6*18*10cm,,,,,,迈克·科尔斯
39,"2018-08-03 01:33:14",9,"2018-08-03 01:33:14","【包税】Michael Kors 迈克·科尔斯 JADE系列 【18新品】女士粉红色皮革花朵配饰金色链条单肩斜挎包",￥2687,,,美国（不同批次产地可能有所不同，请以实物为准）,肩带长约110cm,粉红色,,合金,,肩带长约110cm,,,,合金,女士,迈克·科尔斯
40,"2018-08-03 01:33:14",9,"2018-08-03 01:33:14","【包税】Michael Kors 迈克·科尔斯 JADE系列 【18新品】女士粉红色皮革花朵配饰金色链条单肩斜挎包",￥2687,,,美国（不同批次产地可能有所不同，请以实物为准）,肩带长约110cm,粉红色,,合金,,肩带长约110cm,,,,合金,女士,迈克·科尔斯
41,"2018-08-03 01:33:14",9,"2018-08-03 01:33:14","【包税】Michael Kors 迈克·科尔斯 JADE系列 【18新品】女士粉红色皮革花朵配饰金色链条单肩斜挎包",￥2687,,,美国（不同批次产地可能有所不同，请以实物为准）,肩带长约110cm,粉红色,,合金,,肩带长约110cm,,,,合金,女士,迈克·科尔斯
42,"2018-08-03 01:33:14",9,"2018-08-03 01:33:14","【包税】Michael Kors 迈克·科尔斯 JADE系列 【18新品】女士粉红色皮革花朵配饰金色链条单肩斜挎包",￥2687,,,美国（不同批次产地可能有所不同，请以实物为准）,肩带长约110cm,粉红色,,合金,,肩带长约110cm,,,,合金,女士,迈克·科尔斯
43,"2018-08-03 01:33:16",10,"2018-08-03 01:33:16","【包税】迈克.科尔斯Michael Kors MK 纯皮 MERCER 系列 时尚简约小锁头手提单肩斜挎包 蓝色 30F6SM9M2L蓝色",￥1591,53件,手提单肩斜挎包,印尼（由于生产批次不同，产地会有所不同）,75-110cm,蓝色,夹层拉链袋,其他,银色,75-110cm,直接开合,横款,有,其他,女士,迈克·科尔斯
44,"2018-08-03 01:33:16",10,"2018-08-03 01:33:16","【包税】迈克.科尔斯Michael Kors MK 纯皮 MERCER 系列 时尚简约小锁头手提单肩斜挎包 蓝色 30F6SM9M2L蓝色",￥1591,53件,手提单肩斜挎包,印尼（由于生产批次不同，产地会有所不同）,75-110cm,蓝色,夹层拉链袋,其他,银色,75-110cm,直接开合,横款,有,其他,女士,迈克·科尔斯
45,"2018-08-03 01:33:20",11,"2018-08-03 01:33:20","【包税】迈克.科尔斯Michael Kors MK 纯皮 MERCER 系列 时尚简约小锁头手提单肩斜挎包 小号 白色白色",￥1701,41件,单肩包,印尼,75-110cm,白色,拉链暗带,其他,金色,75-110cm,拉链开合,横款,有,其他,女士,迈克·科尔斯
46,"2018-08-03 01:33:20",11,"2018-08-03 01:33:20","【包税】迈克.科尔斯Michael Kors MK 纯皮 MERCER 系列 时尚简约小锁头手提单肩斜挎包 小号 白色白色",￥1701,41件,单肩包,印尼,75-110cm,白色,拉链暗带,其他,金色,75-110cm,拉链开合,横款,有,其他,女士,迈克·科尔斯
47,"2018-08-03 01:33:20",11,"2018-08-03 01:33:20","【包税】迈克.科尔斯Michael Kors MK 纯皮 MERCER 系列 时尚简约小锁头手提单肩斜挎包 小号 白色白色",￥1701,41件,单肩包,印尼,75-110cm,白色,拉链暗带,其他,金色,75-110cm,拉链开合,横款,有,其他,女士,迈克·科尔斯
48,"2018-08-03 01:33:24",12,"2018-08-03 01:33:24","【Designer Bags】【18秋冬】 Michael Kors/迈克·科尔斯 女士 单肩包 时尚 链条包 3328欧洲假期，8月2号之后的订单发货延迟至8月27号",￥1557,,,意大利、西班牙、越南等，批次不同产地不同,,,,,,16*16*6cm,,,,,,迈克·科尔斯
49,"2018-08-03 01:33:24",12,"2018-08-03 01:33:24","【Designer Bags】【18秋冬】 Michael Kors/迈克·科尔斯 女士 单肩包 时尚 链条包 3328欧洲假期，8月2号之后的订单发货延迟至8月27号",￥1557,,,意大利、西班牙、越南等，批次不同产地不同,,,,,,16*16*6cm,,,,,,迈克·科尔斯
50,"2018-08-03 01:33:24",12,"2018-08-03 01:33:24","【Designer Bags】【18秋冬】 Michael Kors/迈克·科尔斯 女士 单肩包 时尚 链条包 3328欧洲假期，8月2号之后的订单发货延迟至8月27号",￥1557,,,意大利、西班牙、越南等，批次不同产地不同,,,,,,16*16*6cm,,,,,,迈克·科尔斯
51,"2018-08-03 01:33:25",13,"2018-08-03 01:33:25","【包税】Michael Kors 迈克.科尔斯 Mercer系列 女士中号珍珠灰牛皮手提单肩斜挎锁头包",￥1494,30件,,美国(不同批次产地可能有所不同，请以实物为准),"肩带长约 131cm",珍珠灰,,合金,,"肩带长约 131cm",,,,合金,女士,迈克·科尔斯
52,"2018-08-03 01:33:25",13,"2018-08-03 01:33:25","【包税】Michael Kors 迈克.科尔斯 Mercer系列 女士中号珍珠灰牛皮手提单肩斜挎锁头包",￥1494,30件,,美国(不同批次产地可能有所不同，请以实物为准),"肩带长约 131cm",珍珠灰,,合金,,"肩带长约 131cm",,,,合金,女士,迈克·科尔斯
53,"2018-08-03 01:33:25",13,"2018-08-03 01:33:25","【包税】Michael Kors 迈克.科尔斯 Mercer系列 女士中号珍珠灰牛皮手提单肩斜挎锁头包",￥1494,30件,,美国(不同批次产地可能有所不同，请以实物为准),"肩带长约 131cm",珍珠灰,,合金,,"肩带长约 131cm",,,,合金,女士,迈克·科尔斯
54,"2018-08-03 01:33:25",13,"2018-08-03 01:33:25","【包税】Michael Kors 迈克.科尔斯 Mercer系列 女士中号珍珠灰牛皮手提单肩斜挎锁头包",￥1494,30件,,美国(不同批次产地可能有所不同，请以实物为准),"肩带长约 131cm",珍珠灰,,合金,,"肩带长约 131cm",,,,合金,女士,迈克·科尔斯
55,"2018-08-03 01:33:25",13,"2018-08-03 01:33:25","【包税】Michael Kors 迈克.科尔斯 Mercer系列 女士中号珍珠灰牛皮手提单肩斜挎锁头包",￥1494,30件,,美国(不同批次产地可能有所不同，请以实物为准),"肩带长约 131cm",珍珠灰,,合金,,"肩带长约 131cm",,,,合金,女士,迈克·科尔斯
56,"2018-08-03 01:33:29",14,"2018-08-03 01:33:29","迈克.科尔斯/Michael Kors MERCER系列 女士纯皮 时尚手提单肩锁头包",￥1668,30件,单肩包,印尼,75-110cm,灰色,拉链暗袋,其他,银色,75-110cm,拉链开合,横款,有,其他,女士,迈克·科尔斯
57,"2018-08-03 01:33:29",14,"2018-08-03 01:33:29","迈克.科尔斯/Michael Kors MERCER系列 女士纯皮 时尚手提单肩锁头包",￥1668,30件,单肩包,印尼,75-110cm,灰色,拉链暗袋,其他,银色,75-110cm,拉链开合,横款,有,其他,女士,迈克·科尔斯
58,"2018-08-03 01:33:29",14,"2018-08-03 01:33:29","迈克.科尔斯/Michael Kors MERCER系列 女士纯皮 时尚手提单肩锁头包",￥1668,30件,单肩包,印尼,75-110cm,灰色,拉链暗袋,其他,银色,75-110cm,拉链开合,横款,有,其他,女士,迈克·科尔斯
59,"2018-08-03 01:33:31",15,"2018-08-03 01:33:31","【包税】迈克.科尔斯Michael Kors MK 纯皮 MERCER 系列 时尚简约小锁头手提单肩斜挎包 嫩粉色小号其他",￥1745,28件,单肩包,印尼,75-110cm,嫩粉色,拉链暗带,其他,,75-110cm,拉链开合,,有,其他,女士,迈克·科尔斯
60,"2018-08-03 01:33:31",15,"2018-08-03 01:33:31","【包税】迈克.科尔斯Michael Kors MK 纯皮 MERCER 系列 时尚简约小锁头手提单肩斜挎包 嫩粉色小号其他",￥1745,28件,单肩包,印尼,75-110cm,嫩粉色,拉链暗带,其他,,75-110cm,拉链开合,,有,其他,女士,迈克·科尔斯
61,"2018-08-03 01:33:31",15,"2018-08-03 01:33:31","【包税】迈克.科尔斯Michael Kors MK 纯皮 MERCER 系列 时尚简约小锁头手提单肩斜挎包 嫩粉色小号其他",￥1745,28件,单肩包,印尼,75-110cm,嫩粉色,拉链暗带,其他,,75-110cm,拉链开合,,有,其他,女士,迈克·科尔斯
62,"2018-08-03 01:33:35",16,"2018-08-03 01:33:35","【包税】迈克.科尔斯Michael Kors MK 纯皮 MERCER系列 简约大气时尚版型 单肩包斜挎包锁头包 嫩粉色 大号其他 其他",￥2031,21件,单肩包,印尼,75-110cm,嫩粉色,拉链暗袋,其他,金色,75-110cm,拉链开合,横款,有,其他,女士,迈克·科尔斯
63,"2018-08-03 01:33:35",16,"2018-08-03 01:33:35","【包税】迈克.科尔斯Michael Kors MK 纯皮 MERCER系列 简约大气时尚版型 单肩包斜挎包锁头包 嫩粉色 大号其他 其他",￥2031,21件,单肩包,印尼,75-110cm,嫩粉色,拉链暗袋,其他,金色,75-110cm,拉链开合,横款,有,其他,女士,迈克·科尔斯
64,"2018-08-03 01:33:35",16,"2018-08-03 01:33:35","【包税】迈克.科尔斯Michael Kors MK 纯皮 MERCER系列 简约大气时尚版型 单肩包斜挎包锁头包 嫩粉色 大号其他 其他",￥2031,21件,单肩包,印尼,75-110cm,嫩粉色,拉链暗袋,其他,金色,75-110cm,拉链开合,横款,有,其他,女士,迈克·科尔斯
65,"2018-08-03 01:33:35",16,"2018-08-03 01:33:35","【包税】迈克.科尔斯Michael Kors MK 纯皮 MERCER系列 简约大气时尚版型 单肩包斜挎包锁头包 嫩粉色 大号其他 其他",￥2031,21件,单肩包,印尼,75-110cm,嫩粉色,拉链暗袋,其他,金色,75-110cm,拉链开合,横款,有,其他,女士,迈克·科尔斯
66,"2018-08-03 01:33:35",16,"2018-08-03 01:33:35","【包税】迈克.科尔斯Michael Kors MK 纯皮 MERCER系列 简约大气时尚版型 单肩包斜挎包锁头包 嫩粉色 大号其他 其他",￥2031,21件,单肩包,印尼,75-110cm,嫩粉色,拉链暗袋,其他,金色,75-110cm,拉链开合,横款,有,其他,女士,迈克·科尔斯
67,"2018-08-03 01:33:36",17,"2018-08-03 01:33:36","Michael Kors/迈克·科尔斯 MK女士Saffiano皮革单肩包30H4SBFT6L",￥1177,16件,,中国，越南，印尼等,,多色,拉链开合，外贴袋4个，内贴袋4个，拉链袋1个,其他,其它,长：27.5cm，高：25cm，厚：13cm，提手高：23cm,拉链开合,中款,有,其他,女士,迈克·科尔斯
68,"2018-08-03 01:33:36",17,"2018-08-03 01:33:36","Michael Kors/迈克·科尔斯 MK女士Saffiano皮革单肩包30H4SBFT6L",￥1177,16件,,中国，越南，印尼等,,多色,拉链开合，外贴袋4个，内贴袋4个，拉链袋1个,其他,其它,长：27.5cm，高：25cm，厚：13cm，提手高：23cm,拉链开合,中款,有,其他,女士,迈克·科尔斯
69,"2018-08-03 01:33:36",17,"2018-08-03 01:33:36","Michael Kors/迈克·科尔斯 MK女士Saffiano皮革单肩包30H4SBFT6L",￥1177,16件,,中国，越南，印尼等,,多色,拉链开合，外贴袋4个，内贴袋4个，拉链袋1个,其他,其它,长：27.5cm，高：25cm，厚：13cm，提手高：23cm,拉链开合,中款,有,其他,女士,迈克·科尔斯
70,"2018-08-03 01:33:36",17,"2018-08-03 01:33:36","Michael Kors/迈克·科尔斯 MK女士Saffiano皮革单肩包30H4SBFT6L",￥1177,16件,,中国，越南，印尼等,,多色,拉链开合，外贴袋4个，内贴袋4个，拉链袋1个,其他,其它,长：27.5cm，高：25cm，厚：13cm，提手高：23cm,拉链开合,中款,有,其他,女士,迈克·科尔斯
71,"2018-08-03 01:33:36",18,"2018-08-03 01:33:36","【包税】迈克.科尔斯/Michael Kors MK 皮质 MERCER 系列女士时尚简约锁头 手提单肩斜挎包 30S7SM9T3L 灰色黑色拼接 大号",￥2196,20件,手提单肩斜挎包,印尼（由于生产批次不同，产地会有所不同）,75-110cm,灰色黑色拼接,夹层拉链袋,其他,银色,75-110cm,直接开合,横款,有,其他,女士,迈克·科尔斯
72,"2018-08-03 01:33:36",18,"2018-08-03 01:33:36","【包税】迈克.科尔斯/Michael Kors MK 皮质 MERCER 系列女士时尚简约锁头 手提单肩斜挎包 30S7SM9T3L 灰色黑色拼接 大号",￥2196,20件,手提单肩斜挎包,印尼（由于生产批次不同，产地会有所不同）,75-110cm,灰色黑色拼接,夹层拉链袋,其他,银色,75-110cm,直接开合,横款,有,其他,女士,迈克·科尔斯
73,"2018-08-03 01:33:36",18,"2018-08-03 01:33:36","【包税】迈克.科尔斯/Michael Kors MK 皮质 MERCER 系列女士时尚简约锁头 手提单肩斜挎包 30S7SM9T3L 灰色黑色拼接 大号",￥2196,20件,手提单肩斜挎包,印尼（由于生产批次不同，产地会有所不同）,75-110cm,灰色黑色拼接,夹层拉链袋,其他,银色,75-110cm,直接开合,横款,有,其他,女士,迈克·科尔斯
74,"2018-08-03 01:33:37",19,"2018-08-03 01:33:37","【包税】Michael Kors迈克.科尔斯 MK新款女士 TINA系列 皮质单肩斜挎包 樱花粉银铆钉 小号",￥1205,18件,单肩斜挎包,印尼（由于生产批次不同，产地会有所不同）,75-110cm,樱花粉,,其他,银色,75-110cm,锁扣开合,横款,有,其他,女士,迈克·科尔斯
75,"2018-08-03 01:33:37",19,"2018-08-03 01:33:37","【包税】Michael Kors迈克.科尔斯 MK新款女士 TINA系列 皮质单肩斜挎包 樱花粉银铆钉 小号",￥1205,18件,单肩斜挎包,印尼（由于生产批次不同，产地会有所不同）,75-110cm,樱花粉,,其他,银色,75-110cm,锁扣开合,横款,有,其他,女士,迈克·科尔斯
76,"2018-08-03 01:33:37",19,"2018-08-03 01:33:37","【包税】Michael Kors迈克.科尔斯 MK新款女士 TINA系列 皮质单肩斜挎包 樱花粉银铆钉 小号",￥1205,18件,单肩斜挎包,印尼（由于生产批次不同，产地会有所不同）,75-110cm,樱花粉,,其他,银色,75-110cm,锁扣开合,横款,有,其他,女士,迈克·科尔斯
77,"2018-08-03 01:33:38",20,"2018-08-03 01:33:38","Michael Kors/迈克·科尔斯 MK 皮质 Sloan系列简约链条菱格锁扣包 嫩粉色 其他",￥2047,17件,单肩包,印尼（由于生产批次不同，产地会有所不同）,75-110cm,嫩粉色,夹层拉链袋,其他,金色,75-110cm,锁扣开合,横款,有,其他,女士,迈克·科尔斯
78,"2018-08-03 01:33:38",20,"2018-08-03 01:33:38","Michael Kors/迈克·科尔斯 MK 皮质 Sloan系列简约链条菱格锁扣包 嫩粉色 其他",￥2047,17件,单肩包,印尼（由于生产批次不同，产地会有所不同）,75-110cm,嫩粉色,夹层拉链袋,其他,金色,75-110cm,锁扣开合,横款,有,其他,女士,迈克·科尔斯
79,"2018-08-03 01:33:38",20,"2018-08-03 01:33:38","Michael Kors/迈克·科尔斯 MK 皮质 Sloan系列简约链条菱格锁扣包 嫩粉色 其他",￥2047,17件,单肩包,印尼（由于生产批次不同，产地会有所不同）,75-110cm,嫩粉色,夹层拉链袋,其他,金色,75-110cm,锁扣开合,横款,有,其他,女士,迈克·科尔斯
80,"2018-08-03 01:33:39",21,"2018-08-03 01:33:39","Michael Kors/迈克·科尔斯 女士单肩包 35S8ST4C5T 180417",￥1091,15件,单肩,"中国大陆等(不同批次产地可能不同,请以实物为准)",,"黑色 粉色",多功能袋,,,长:17cm高:13cm宽:6cm,锁扣开合,横款,,皮质,女士,迈克·科尔斯
81,"2018-08-03 01:33:39",21,"2018-08-03 01:33:39","Michael Kors/迈克·科尔斯 女士单肩包 35S8ST4C5T 180417",￥1091,15件,单肩,"中国大陆等(不同批次产地可能不同,请以实物为准)",,"黑色 粉色",多功能袋,,,长:17cm高:13cm宽:6cm,锁扣开合,横款,,皮质,女士,迈克·科尔斯
82,"2018-08-03 01:33:39",21,"2018-08-03 01:33:39","Michael Kors/迈克·科尔斯 女士单肩包 35S8ST4C5T 180417",￥1091,15件,单肩,"中国大陆等(不同批次产地可能不同,请以实物为准)",,"黑色 粉色",多功能袋,,,长:17cm高:13cm宽:6cm,锁扣开合,横款,,皮质,女士,迈克·科尔斯
83,"2018-08-03 01:33:39",21,"2018-08-03 01:33:39","Michael Kors/迈克·科尔斯 女士单肩包 35S8ST4C5T 180417",￥1091,15件,单肩,"中国大陆等(不同批次产地可能不同,请以实物为准)",,"黑色 粉色",多功能袋,,,长:17cm高:13cm宽:6cm,锁扣开合,横款,,皮质,女士,迈克·科尔斯
84,"2018-08-03 01:33:39",21,"2018-08-03 01:33:39","Michael Kors/迈克·科尔斯 女士单肩包 35S8ST4C5T 180417",￥1091,15件,单肩,"中国大陆等(不同批次产地可能不同,请以实物为准)",,"黑色 粉色",多功能袋,,,长:17cm高:13cm宽:6cm,锁扣开合,横款,,皮质,女士,迈克·科尔斯
85,"2018-08-03 01:33:39",22,"2018-08-03 01:33:39","【包税】MK 迈克·科尔斯 (MICHAEL KORS) SLOAN EDITOR 单肩包 黑色黑色 黑色",￥2031,15件,单肩包,印尼,75-110cm,黑色,拉链暗带,其他,金色,75-110cm,按扣开合,横款,有,其他,女士,迈克·科尔斯
86,"2018-08-03 01:33:39",22,"2018-08-03 01:33:39","【包税】MK 迈克·科尔斯 (MICHAEL KORS) SLOAN EDITOR 单肩包 黑色黑色 黑色",￥2031,15件,单肩包,印尼,75-110cm,黑色,拉链暗带,其他,金色,75-110cm,按扣开合,横款,有,其他,女士,迈克·科尔斯
87,"2018-08-03 01:33:39",22,"2018-08-03 01:33:39","【包税】MK 迈克·科尔斯 (MICHAEL KORS) SLOAN EDITOR 单肩包 黑色黑色 黑色",￥2031,15件,单肩包,印尼,75-110cm,黑色,拉链暗带,其他,金色,75-110cm,按扣开合,横款,有,其他,女士,迈克·科尔斯
88,"2018-08-03 01:33:39",22,"2018-08-03 01:33:39","【包税】MK 迈克·科尔斯 (MICHAEL KORS) SLOAN EDITOR 单肩包 黑色黑色 黑色",￥2031,15件,单肩包,印尼,75-110cm,黑色,拉链暗带,其他,金色,75-110cm,按扣开合,横款,有,其他,女士,迈克·科尔斯
89,"2018-08-03 01:33:44",23,"2018-08-03 01:33:44","【包税】Michael Kors/迈克·科尔斯 女士单肩手提包 35T8GKGS1L",￥1360,14件,单肩/手提,中国大陆等（不同批次产地可能不同，请以实物为准）,,黑色，粉色，白色，玫粉色,多功能袋,,,长25cm*高19cm*宽8cm,磁扣开合,横款,,皮质,女士,迈克·科尔斯
90,"2018-08-03 01:33:44",23,"2018-08-03 01:33:44","【包税】Michael Kors/迈克·科尔斯 女士单肩手提包 35T8GKGS1L",￥1360,14件,单肩/手提,中国大陆等（不同批次产地可能不同，请以实物为准）,,黑色，粉色，白色，玫粉色,多功能袋,,,长25cm*高19cm*宽8cm,磁扣开合,横款,,皮质,女士,迈克·科尔斯
91,"2018-08-03 01:33:44",23,"2018-08-03 01:33:44","【包税】Michael Kors/迈克·科尔斯 女士单肩手提包 35T8GKGS1L",￥1360,14件,单肩/手提,中国大陆等（不同批次产地可能不同，请以实物为准）,,黑色，粉色，白色，玫粉色,多功能袋,,,长25cm*高19cm*宽8cm,磁扣开合,横款,,皮质,女士,迈克·科尔斯
92,"2018-08-03 01:33:44",23,"2018-08-03 01:33:44","【包税】Michael Kors/迈克·科尔斯 女士单肩手提包 35T8GKGS1L",￥1360,14件,单肩/手提,中国大陆等（不同批次产地可能不同，请以实物为准）,,黑色，粉色，白色，玫粉色,多功能袋,,,长25cm*高19cm*宽8cm,磁扣开合,横款,,皮质,女士,迈克·科尔斯
93,"2018-08-03 01:33:44",23,"2018-08-03 01:33:44","【包税】Michael Kors/迈克·科尔斯 女士单肩手提包 35T8GKGS1L",￥1360,14件,单肩/手提,中国大陆等（不同批次产地可能不同，请以实物为准）,,黑色，粉色，白色，玫粉色,多功能袋,,,长25cm*高19cm*宽8cm,磁扣开合,横款,,皮质,女士,迈克·科尔斯
94,"2018-08-03 01:33:48",24,"2018-08-03 01:33:48","【包税】迈克.科尔斯/Michael Kors MK 皮质MERCER 系列 女士时尚简约小锁头手提单肩斜挎包 30S7SM9M2L 灰白黑色拼色",￥1704,14件,手提单肩斜跨包,印尼（由于生产批次不同，产地会有所不同）,75-110cm,灰白黑色拼色,夹层拉链袋,其他,银色,75-110cm,直接开合,横款,有,其他,女士,迈克·科尔斯
95,"2018-08-03 01:33:48",24,"2018-08-03 01:33:48","【包税】迈克.科尔斯/Michael Kors MK 皮质MERCER 系列 女士时尚简约小锁头手提单肩斜挎包 30S7SM9M2L 灰白黑色拼色",￥1704,14件,手提单肩斜跨包,印尼（由于生产批次不同，产地会有所不同）,75-110cm,灰白黑色拼色,夹层拉链袋,其他,银色,75-110cm,直接开合,横款,有,其他,女士,迈克·科尔斯
96,"2018-08-03 01:33:50",25,"2018-08-03 01:33:50","【包税】迈克.科尔斯/Michael Kors MK 皮质SLOAN系列 女士手拎单肩包 30T8GSLS2V 蓝色藏蓝色拼色",￥1866,13件,手拎单肩包,印尼(由于生产批次不同，产地会有所不同）,75-110cm,蓝色藏蓝色拼色,拉链暗袋,其他,金色,75-110cm,锁扣开合,横款,有,其他,女士,迈克·科尔斯
97,"2018-08-03 01:33:50",25,"2018-08-03 01:33:50","【包税】迈克.科尔斯/Michael Kors MK 皮质SLOAN系列 女士手拎单肩包 30T8GSLS2V 蓝色藏蓝色拼色",￥1866,13件,手拎单肩包,印尼(由于生产批次不同，产地会有所不同）,75-110cm,蓝色藏蓝色拼色,拉链暗袋,其他,金色,75-110cm,锁扣开合,横款,有,其他,女士,迈克·科尔斯
98,"2018-08-03 01:33:50",25,"2018-08-03 01:33:50","【包税】迈克.科尔斯/Michael Kors MK 皮质SLOAN系列 女士手拎单肩包 30T8GSLS2V 蓝色藏蓝色拼色",￥1866,13件,手拎单肩包,印尼(由于生产批次不同，产地会有所不同）,75-110cm,蓝色藏蓝色拼色,拉链暗袋,其他,金色,75-110cm,锁扣开合,横款,有,其他,女士,迈克·科尔斯
99,"2018-08-03 01:33:54",26,"2018-08-03 01:33:54","【包税】MICHAEL KORS 迈克·科尔斯 Sloan系列 女士黑色羊皮格纹链条单肩斜挎包",￥2135,12件,,美国（不同批次产地可能有所不同，请以实物为准）,肩带约100cm,黑色,,合金,,肩带约100cm,,,,合金,女士,迈克·科尔斯
100,"2018-08-03 01:33:54",26,"2018-08-03 01:33:54","【包税】MICHAEL KORS 迈克·科尔斯 Sloan系列 女士黑色羊皮格纹链条单肩斜挎包",￥2135,12件,,美国（不同批次产地可能有所不同，请以实物为准）,肩带约100cm,黑色,,合金,,肩带约100cm,,,,合金,女士,迈克·科尔斯
