image.id,image.ts,qiche_peijian.id,qiche_peijian.ts,qiche_peijian.title,qiche_peijian.lianxiren,qiche_peijian.lianxi_dianhua,qiche_peijian.suozai_diqu,qiche_peijian.qiye_leixing,qiche_peijian.gongzuo_shijian,qiche_peijian.qidingliang,qiche_peijian.xinghao,qiche_peijian.pinpai,qiche_peijian.shiyong,qiche_peijian.yuyan,qiche_peijian.chanpin_xinghao,qiche_peijian.chanpin_mingcheng,qiche_peijian.yongliang,qiche_peijian.baozhuang_shuliang,qiche_peijian.zhuji_yingyong,qiche_peijian.chanpin_maozhong,qiche_peijian.guige,qiche_peijian.chandi_pinpai,qiche_peijian.shiyong_jixing,qiche_peijian.shangjia,qiche_peijian.dizhi
157,"2018-08-16 01:37:20",20,"2018-08-16 01:37:20","5366559 5366559康明斯电磁阀开关B系列发动机总成熄火",郑亮,0719-8476888,湖北十堰,贸易,"早 8:00 - 晚 18:00",1,5366559,"发动机品牌 - 康明斯",6BT,"English Русский",5366559,5366559康明斯电磁阀开关B系列发动机总成熄火器断油电磁阀,0,0,"发动机 - 康明斯",(kg),(mm),"发动机品牌 - 康明斯",6BT,十堰汉康动力设备有限公司,13797866018
158,"2018-08-16 01:37:20",20,"2018-08-16 01:37:20","5366559 5366559康明斯电磁阀开关B系列发动机总成熄火",郑亮,0719-8476888,湖北十堰,贸易,"早 8:00 - 晚 18:00",1,5366559,"发动机品牌 - 康明斯",6BT,"English Русский",5366559,5366559康明斯电磁阀开关B系列发动机总成熄火器断油电磁阀,0,0,"发动机 - 康明斯",(kg),(mm),"发动机品牌 - 康明斯",6BT,十堰汉康动力设备有限公司,13797866018
159,"2018-08-16 01:37:20",20,"2018-08-16 01:37:20","5366559 5366559康明斯电磁阀开关B系列发动机总成熄火",郑亮,0719-8476888,湖北十堰,贸易,"早 8:00 - 晚 18:00",1,5366559,"发动机品牌 - 康明斯",6BT,"English Русский",5366559,5366559康明斯电磁阀开关B系列发动机总成熄火器断油电磁阀,0,0,"发动机 - 康明斯",(kg),(mm),"发动机品牌 - 康明斯",6BT,十堰汉康动力设备有限公司,13797866018
160,"2018-08-16 01:37:20",20,"2018-08-16 01:37:20","5366559 5366559康明斯电磁阀开关B系列发动机总成熄火",郑亮,0719-8476888,湖北十堰,贸易,"早 8:00 - 晚 18:00",1,5366559,"发动机品牌 - 康明斯",6BT,"English Русский",5366559,5366559康明斯电磁阀开关B系列发动机总成熄火器断油电磁阀,0,0,"发动机 - 康明斯",(kg),(mm),"发动机品牌 - 康明斯",6BT,十堰汉康动力设备有限公司,13797866018
161,"2018-08-16 01:37:25",21,"2018-08-16 01:37:25","C3928797 康明斯气缸体总成 东风EQ180-20发动机",何勇,0719-8368258,湖北十堰,贸易,"早 8:00 - 晚 18:00","1 / 台",C3928797,"动力系统 - 康明斯",4BT/6BT,"English Русский",C3928797,"康明斯气缸体总成 东风EQ180-20发动机",1,1,"发动机 - 康明斯",(kg),(mm),"动力系统 - 康明斯",4BT/6BT,QP120官方旗舰店,18971928816
162,"2018-08-16 01:37:25",21,"2018-08-16 01:37:25","C3928797 康明斯气缸体总成 东风EQ180-20发动机",何勇,0719-8368258,湖北十堰,贸易,"早 8:00 - 晚 18:00","1 / 台",C3928797,"动力系统 - 康明斯",4BT/6BT,"English Русский",C3928797,"康明斯气缸体总成 东风EQ180-20发动机",1,1,"发动机 - 康明斯",(kg),(mm),"动力系统 - 康明斯",4BT/6BT,QP120官方旗舰店,18971928816
163,"2018-08-16 01:37:25",21,"2018-08-16 01:37:25","C3928797 康明斯气缸体总成 东风EQ180-20发动机",何勇,0719-8368258,湖北十堰,贸易,"早 8:00 - 晚 18:00","1 / 台",C3928797,"动力系统 - 康明斯",4BT/6BT,"English Русский",C3928797,"康明斯气缸体总成 东风EQ180-20发动机",1,1,"发动机 - 康明斯",(kg),(mm),"动力系统 - 康明斯",4BT/6BT,QP120官方旗舰店,18971928816
164,"2018-08-16 01:37:25",21,"2018-08-16 01:37:25","C3928797 康明斯气缸体总成 东风EQ180-20发动机",何勇,0719-8368258,湖北十堰,贸易,"早 8:00 - 晚 18:00","1 / 台",C3928797,"动力系统 - 康明斯",4BT/6BT,"English Русский",C3928797,"康明斯气缸体总成 东风EQ180-20发动机",1,1,"发动机 - 康明斯",(kg),(mm),"动力系统 - 康明斯",4BT/6BT,QP120官方旗舰店,18971928816
165,"2018-08-16 01:37:25",21,"2018-08-16 01:37:25","C3928797 康明斯气缸体总成 东风EQ180-20发动机",何勇,0719-8368258,湖北十堰,贸易,"早 8:00 - 晚 18:00","1 / 台",C3928797,"动力系统 - 康明斯",4BT/6BT,"English Русский",C3928797,"康明斯气缸体总成 东风EQ180-20发动机",1,1,"发动机 - 康明斯",(kg),(mm),"动力系统 - 康明斯",4BT/6BT,QP120官方旗舰店,18971928816
166,"2018-08-16 01:37:25",21,"2018-08-16 01:37:25","C3928797 康明斯气缸体总成 东风EQ180-20发动机",何勇,0719-8368258,湖北十堰,贸易,"早 8:00 - 晚 18:00","1 / 台",C3928797,"动力系统 - 康明斯",4BT/6BT,"English Русский",C3928797,"康明斯气缸体总成 东风EQ180-20发动机",1,1,"发动机 - 康明斯",(kg),(mm),"动力系统 - 康明斯",4BT/6BT,QP120官方旗舰店,18971928816
167,"2018-08-16 01:37:29",22,"2018-08-16 01:37:29","F3000-1002170 气缸体",何勇,0719-8368258,湖北十堰,贸易,"早 8:00 - 晚 18:00","1 / 件",F3000-1002170,"动力系统 - 玉柴",YC4F90,"English Русский",F3000-1002170,气缸体,1,1,"发动机 - 玉柴发动机","89.00 (kg)",(mm),"动力系统 - 玉柴",YC4F90,QP120官方旗舰店,18971928816
168,"2018-08-16 01:37:29",22,"2018-08-16 01:37:29","F3000-1002170 气缸体",何勇,0719-8368258,湖北十堰,贸易,"早 8:00 - 晚 18:00","1 / 件",F3000-1002170,"动力系统 - 玉柴",YC4F90,"English Русский",F3000-1002170,气缸体,1,1,"发动机 - 玉柴发动机","89.00 (kg)",(mm),"动力系统 - 玉柴",YC4F90,QP120官方旗舰店,18971928816
169,"2018-08-16 01:37:29",22,"2018-08-16 01:37:29","F3000-1002170 气缸体",何勇,0719-8368258,湖北十堰,贸易,"早 8:00 - 晚 18:00","1 / 件",F3000-1002170,"动力系统 - 玉柴",YC4F90,"English Русский",F3000-1002170,气缸体,1,1,"发动机 - 玉柴发动机","89.00 (kg)",(mm),"动力系统 - 玉柴",YC4F90,QP120官方旗舰店,18971928816
170,"2018-08-16 01:37:29",22,"2018-08-16 01:37:29","F3000-1002170 气缸体",何勇,0719-8368258,湖北十堰,贸易,"早 8:00 - 晚 18:00","1 / 件",F3000-1002170,"动力系统 - 玉柴",YC4F90,"English Русский",F3000-1002170,气缸体,1,1,"发动机 - 玉柴发动机","89.00 (kg)",(mm),"动力系统 - 玉柴",YC4F90,QP120官方旗舰店,18971928816
171,"2018-08-16 01:37:29",22,"2018-08-16 01:37:29","F3000-1002170 气缸体",何勇,0719-8368258,湖北十堰,贸易,"早 8:00 - 晚 18:00","1 / 件",F3000-1002170,"动力系统 - 玉柴",YC4F90,"English Русский",F3000-1002170,气缸体,1,1,"发动机 - 玉柴发动机","89.00 (kg)",(mm),"动力系统 - 玉柴",YC4F90,QP120官方旗舰店,18971928816
172,"2018-08-16 01:37:29",22,"2018-08-16 01:37:29","F3000-1002170 气缸体",何勇,0719-8368258,湖北十堰,贸易,"早 8:00 - 晚 18:00","1 / 件",F3000-1002170,"动力系统 - 玉柴",YC4F90,"English Русский",F3000-1002170,气缸体,1,1,"发动机 - 玉柴发动机","89.00 (kg)",(mm),"动力系统 - 玉柴",YC4F90,QP120官方旗舰店,18971928816
173,"2018-08-16 01:37:29",22,"2018-08-16 01:37:29","F3000-1002170 气缸体",何勇,0719-8368258,湖北十堰,贸易,"早 8:00 - 晚 18:00","1 / 件",F3000-1002170,"动力系统 - 玉柴",YC4F90,"English Русский",F3000-1002170,气缸体,1,1,"发动机 - 玉柴发动机","89.00 (kg)",(mm),"动力系统 - 玉柴",YC4F90,QP120官方旗舰店,18971928816
174,"2018-08-16 01:37:34",23,"2018-08-16 01:37:34","MK100-1002106ASF5 东风大力神YC6M玉柴发动机气缸套",吕德荣,18772931815,湖北十堰,贸易,"早 8:00 - 晚 18:00","1 / 组",MK100-1002106ASF5,"发动机配件 - 玉柴",玉柴,"English Русский",MK100-1002106ASF5,东风大力神YC6M玉柴发动机气缸套,0,0,"发动机 - 玉柴发动机","3.80 (kg)",(mm),"发动机配件 - 玉柴",玉柴,十堰市港峰工贸有限公司,13339855539
175,"2018-08-16 01:37:34",23,"2018-08-16 01:37:34","MK100-1002106ASF5 东风大力神YC6M玉柴发动机气缸套",吕德荣,18772931815,湖北十堰,贸易,"早 8:00 - 晚 18:00","1 / 组",MK100-1002106ASF5,"发动机配件 - 玉柴",玉柴,"English Русский",MK100-1002106ASF5,东风大力神YC6M玉柴发动机气缸套,0,0,"发动机 - 玉柴发动机","3.80 (kg)",(mm),"发动机配件 - 玉柴",玉柴,十堰市港峰工贸有限公司,13339855539
176,"2018-08-16 01:37:34",23,"2018-08-16 01:37:34","MK100-1002106ASF5 东风大力神YC6M玉柴发动机气缸套",吕德荣,18772931815,湖北十堰,贸易,"早 8:00 - 晚 18:00","1 / 组",MK100-1002106ASF5,"发动机配件 - 玉柴",玉柴,"English Русский",MK100-1002106ASF5,东风大力神YC6M玉柴发动机气缸套,0,0,"发动机 - 玉柴发动机","3.80 (kg)",(mm),"发动机配件 - 玉柴",玉柴,十堰市港峰工贸有限公司,13339855539
177,"2018-08-16 01:37:39",24,"2018-08-16 01:37:39","4946152 4946152",陶女士,0719-8287136,湖北十堰,贸易,"早 8:00 - 晚 18:00",1,4946152,,,"English Русский",4946152,4946152,0,0,,(kg),(mm),,,十堰广联贸易有限公司,15972569822
178,"2018-08-16 01:37:39",24,"2018-08-16 01:37:39","4946152 4946152",陶女士,0719-8287136,湖北十堰,贸易,"早 8:00 - 晚 18:00",1,4946152,,,"English Русский",4946152,4946152,0,0,,(kg),(mm),,,十堰广联贸易有限公司,15972569822
179,"2018-08-16 01:37:43",25,"2018-08-16 01:37:43","M1300-1002106 东风大力神YC6M玉柴发动机缸体气缸套",吕德荣,18772931815,湖北十堰,贸易,"早 8:00 - 晚 18:00","1 / 组",M1300-1002106,"发动机配件 - 玉柴",玉柴,"English Русский",M1300-1002106,东风大力神YC6M玉柴发动机缸体气缸套,0,0,"发动机 - 玉柴发动机",(kg),(mm),"发动机配件 - 玉柴",玉柴,十堰市港峰工贸有限公司,13339855539
180,"2018-08-16 01:37:43",25,"2018-08-16 01:37:43","M1300-1002106 东风大力神YC6M玉柴发动机缸体气缸套",吕德荣,18772931815,湖北十堰,贸易,"早 8:00 - 晚 18:00","1 / 组",M1300-1002106,"发动机配件 - 玉柴",玉柴,"English Русский",M1300-1002106,东风大力神YC6M玉柴发动机缸体气缸套,0,0,"发动机 - 玉柴发动机",(kg),(mm),"发动机配件 - 玉柴",玉柴,十堰市港峰工贸有限公司,13339855539
181,"2018-08-16 01:37:43",25,"2018-08-16 01:37:43","M1300-1002106 东风大力神YC6M玉柴发动机缸体气缸套",吕德荣,18772931815,湖北十堰,贸易,"早 8:00 - 晚 18:00","1 / 组",M1300-1002106,"发动机配件 - 玉柴",玉柴,"English Русский",M1300-1002106,东风大力神YC6M玉柴发动机缸体气缸套,0,0,"发动机 - 玉柴发动机",(kg),(mm),"发动机配件 - 玉柴",玉柴,十堰市港峰工贸有限公司,13339855539
182,"2018-08-16 01:37:43",25,"2018-08-16 01:37:43","M1300-1002106 东风大力神YC6M玉柴发动机缸体气缸套",吕德荣,18772931815,湖北十堰,贸易,"早 8:00 - 晚 18:00","1 / 组",M1300-1002106,"发动机配件 - 玉柴",玉柴,"English Русский",M1300-1002106,东风大力神YC6M玉柴发动机缸体气缸套,0,0,"发动机 - 玉柴发动机",(kg),(mm),"发动机配件 - 玉柴",玉柴,十堰市港峰工贸有限公司,13339855539
183,"2018-08-16 01:37:45",26,"2018-08-16 01:37:45","L3000-1002106 L3000-1002106气缸套玉柴天然气发动机配",陶女士,0719-8287136,湖北十堰,贸易,"早 8:00 - 晚 18:00",1,L3000-1002106,,,"English Русский",L3000-1002106,L3000-1002106气缸套玉柴天然气发动机配件,0,0,,(kg),(mm),,,十堰广联贸易有限公司,15972569822
184,"2018-08-16 01:37:45",26,"2018-08-16 01:37:45","L3000-1002106 L3000-1002106气缸套玉柴天然气发动机配",陶女士,0719-8287136,湖北十堰,贸易,"早 8:00 - 晚 18:00",1,L3000-1002106,,,"English Русский",L3000-1002106,L3000-1002106气缸套玉柴天然气发动机配件,0,0,,(kg),(mm),,,十堰广联贸易有限公司,15972569822
185,"2018-08-16 01:37:50",27,"2018-08-16 01:37:50","M1300-1002106 玉柴发动机YC6M340 气缸套 东风大力神",何勇,0719-8368258,湖北十堰,贸易,"早 8:00 - 晚 18:00","1 / 件",M1300-1002106,"动力系统 - 玉柴","YC6M YC6MK","English Русский",M1300-1002106,"玉柴发动机YC6M340 气缸套 东风大力神",1,1,"发动机 - 玉柴发动机",(kg),(mm),"动力系统 - 玉柴","YC6M YC6MK",QP120官方旗舰店,18971928816
186,"2018-08-16 01:37:52",28,"2018-08-16 01:37:52","MK100-1002106ASF5 东风大力神玉柴发动机YC6M 340 气缸套",何勇,0719-8368258,湖北十堰,贸易,"早 8:00 - 晚 18:00","1 / 件",MK100-1002106ASF5,"动力系统 - 玉柴","YC6M YC6MK","English Русский",MK100-1002106ASF5,"东风大力神玉柴发动机YC6M 340 气缸套",6,6,"发动机 - 玉柴发动机","3.80 (kg)",(mm),"动力系统 - 玉柴","YC6M YC6MK",QP120官方旗舰店,18971928816
187,"2018-08-16 01:37:57",29,"2018-08-16 01:37:57","3801826 3055099 康明斯发动机NT855气缸套组件",何勇,0719-8368258,湖北十堰,贸易,"早 8:00 - 晚 18:00","1 / 套",3801826,"动力系统 - 康明斯","4BT/6BT NT855/N14","English Русский",3801826,"3055099 康明斯发动机NT855气缸套组件",6,1,"发动机 - 康明斯","8.50 (kg)",(mm),"动力系统 - 康明斯","4BT/6BT NT855/N14",QP120官方旗舰店,18971928816
188,"2018-08-16 01:37:57",30,"2018-08-16 01:37:57","3022157 3022157重庆康明斯K19发动机汽缸套",陶女士,0719-8287136,湖北十堰,贸易,"早 8:00 - 晚 18:00",1,3022157,,,"English Русский",3022157,3022157重庆康明斯K19发动机汽缸套,0,0,,(kg),(mm),,,十堰广联贸易有限公司,15972569822
189,"2018-08-16 01:37:57",30,"2018-08-16 01:37:57","3022157 3022157重庆康明斯K19发动机汽缸套",陶女士,0719-8287136,湖北十堰,贸易,"早 8:00 - 晚 18:00",1,3022157,,,"English Русский",3022157,3022157重庆康明斯K19发动机汽缸套,0,0,,(kg),(mm),,,十堰广联贸易有限公司,15972569822
190,"2018-08-16 01:38:01",31,"2018-08-16 01:38:01","530-1005014A 主轴瓦组件",何勇,0719-8368258,湖北十堰,贸易,"早 8:00 - 晚 18:00","1 / 组",530-1005014A,"动力系统 - 玉柴",YC4E140,"English Русский",530-1005014A,主轴瓦组件,1,1,"发动机 - 玉柴发动机",(kg),(mm),"动力系统 - 玉柴",YC4E140,QP120官方旗舰店,18971928816
191,"2018-08-16 01:38:01",31,"2018-08-16 01:38:01","530-1005014A 主轴瓦组件",何勇,0719-8368258,湖北十堰,贸易,"早 8:00 - 晚 18:00","1 / 组",530-1005014A,"动力系统 - 玉柴",YC4E140,"English Русский",530-1005014A,主轴瓦组件,1,1,"发动机 - 玉柴发动机",(kg),(mm),"动力系统 - 玉柴",YC4E140,QP120官方旗舰店,18971928816
192,"2018-08-16 01:38:01",31,"2018-08-16 01:38:01","530-1005014A 主轴瓦组件",何勇,0719-8368258,湖北十堰,贸易,"早 8:00 - 晚 18:00","1 / 组",530-1005014A,"动力系统 - 玉柴",YC4E140,"English Русский",530-1005014A,主轴瓦组件,1,1,"发动机 - 玉柴发动机",(kg),(mm),"动力系统 - 玉柴",YC4E140,QP120官方旗舰店,18971928816
193,"2018-08-16 01:38:06",32,"2018-08-16 01:38:06","F7000-1005007 曲轴止推片 玉柴发动机",何勇,0719-8368258,湖北十堰,贸易,"早 8:00 - 晚 18:00","1 / 件",F7000-1005007,"动力系统 - 玉柴",YC4F90,"English Русский",F7000-1005007,"曲轴止推片 玉柴发动机",4,4,"发动机 - 玉柴发动机","0.095 (kg)",(mm),"动力系统 - 玉柴",YC4F90,QP120官方旗舰店,18971928816
194,"2018-08-16 01:38:06",32,"2018-08-16 01:38:06","F7000-1005007 曲轴止推片 玉柴发动机",何勇,0719-8368258,湖北十堰,贸易,"早 8:00 - 晚 18:00","1 / 件",F7000-1005007,"动力系统 - 玉柴",YC4F90,"English Русский",F7000-1005007,"曲轴止推片 玉柴发动机",4,4,"发动机 - 玉柴发动机","0.095 (kg)",(mm),"动力系统 - 玉柴",YC4F90,QP120官方旗舰店,18971928816
195,"2018-08-16 01:38:06",32,"2018-08-16 01:38:06","F7000-1005007 曲轴止推片 玉柴发动机",何勇,0719-8368258,湖北十堰,贸易,"早 8:00 - 晚 18:00","1 / 件",F7000-1005007,"动力系统 - 玉柴",YC4F90,"English Русский",F7000-1005007,"曲轴止推片 玉柴发动机",4,4,"发动机 - 玉柴发动机","0.095 (kg)",(mm),"动力系统 - 玉柴",YC4F90,QP120官方旗舰店,18971928816
196,"2018-08-16 01:38:06",32,"2018-08-16 01:38:06","F7000-1005007 曲轴止推片 玉柴发动机",何勇,0719-8368258,湖北十堰,贸易,"早 8:00 - 晚 18:00","1 / 件",F7000-1005007,"动力系统 - 玉柴",YC4F90,"English Русский",F7000-1005007,"曲轴止推片 玉柴发动机",4,4,"发动机 - 玉柴发动机","0.095 (kg)",(mm),"动力系统 - 玉柴",YC4F90,QP120官方旗舰店,18971928816
197,"2018-08-16 01:38:07",33,"2018-08-16 01:38:07","F3000-1005001C 曲轴",何勇,0719-8368258,湖北十堰,贸易,"早 8:00 - 晚 18:00","1 / 件",F3000-1005001C,"动力系统 - 玉柴",YC4F90,"English Русский",F3000-1005001C,曲轴,1,1,"发动机 - 玉柴发动机","31.50 (kg)",(mm),"动力系统 - 玉柴",YC4F90,QP120官方旗舰店,18971928816
198,"2018-08-16 01:38:07",33,"2018-08-16 01:38:07","F3000-1005001C 曲轴",何勇,0719-8368258,湖北十堰,贸易,"早 8:00 - 晚 18:00","1 / 件",F3000-1005001C,"动力系统 - 玉柴",YC4F90,"English Русский",F3000-1005001C,曲轴,1,1,"发动机 - 玉柴发动机","31.50 (kg)",(mm),"动力系统 - 玉柴",YC4F90,QP120官方旗舰店,18971928816
199,"2018-08-16 01:38:07",33,"2018-08-16 01:38:07","F3000-1005001C 曲轴",何勇,0719-8368258,湖北十堰,贸易,"早 8:00 - 晚 18:00","1 / 件",F3000-1005001C,"动力系统 - 玉柴",YC4F90,"English Русский",F3000-1005001C,曲轴,1,1,"发动机 - 玉柴发动机","31.50 (kg)",(mm),"动力系统 - 玉柴",YC4F90,QP120官方旗舰店,18971928816
200,"2018-08-16 01:38:07",33,"2018-08-16 01:38:07","F3000-1005001C 曲轴",何勇,0719-8368258,湖北十堰,贸易,"早 8:00 - 晚 18:00","1 / 件",F3000-1005001C,"动力系统 - 玉柴",YC4F90,"English Русский",F3000-1005001C,曲轴,1,1,"发动机 - 玉柴发动机","31.50 (kg)",(mm),"动力系统 - 玉柴",YC4F90,QP120官方旗舰店,18971928816
201,"2018-08-16 01:38:08",34,"2018-08-16 01:38:08","F7000-1005005A 主轴瓦组件",何勇,0719-8368258,湖北十堰,贸易,"早 8:00 - 晚 18:00","1 / 套",F7000-1005005A,"动力系统 - 玉柴",YC4F90,"English Русский",F7000-1005005A,主轴瓦组件,1,1,"发动机 - 玉柴发动机","0.51 (kg)",(mm),"动力系统 - 玉柴",YC4F90,QP120官方旗舰店,18971928816
202,"2018-08-16 01:38:08",34,"2018-08-16 01:38:08","F7000-1005005A 主轴瓦组件",何勇,0719-8368258,湖北十堰,贸易,"早 8:00 - 晚 18:00","1 / 套",F7000-1005005A,"动力系统 - 玉柴",YC4F90,"English Русский",F7000-1005005A,主轴瓦组件,1,1,"发动机 - 玉柴发动机","0.51 (kg)",(mm),"动力系统 - 玉柴",YC4F90,QP120官方旗舰店,18971928816
203,"2018-08-16 01:38:08",34,"2018-08-16 01:38:08","F7000-1005005A 主轴瓦组件",何勇,0719-8368258,湖北十堰,贸易,"早 8:00 - 晚 18:00","1 / 套",F7000-1005005A,"动力系统 - 玉柴",YC4F90,"English Русский",F7000-1005005A,主轴瓦组件,1,1,"发动机 - 玉柴发动机","0.51 (kg)",(mm),"动力系统 - 玉柴",YC4F90,QP120官方旗舰店,18971928816
204,"2018-08-16 01:38:09",35,"2018-08-16 01:38:09","F3400-1005140B 扭振减振器",何勇,0719-8368258,湖北十堰,贸易,"早 8:00 - 晚 18:00","1 / 件",F3400-1005140B,"动力系统 - 玉柴",YC4F90,"English Русский",F3400-1005140B,扭振减振器,1,1,"发动机 - 玉柴发动机","2.155 (kg)",(mm),"动力系统 - 玉柴",YC4F90,QP120官方旗舰店,18971928816
205,"2018-08-16 01:38:09",35,"2018-08-16 01:38:09","F3400-1005140B 扭振减振器",何勇,0719-8368258,湖北十堰,贸易,"早 8:00 - 晚 18:00","1 / 件",F3400-1005140B,"动力系统 - 玉柴",YC4F90,"English Русский",F3400-1005140B,扭振减振器,1,1,"发动机 - 玉柴发动机","2.155 (kg)",(mm),"动力系统 - 玉柴",YC4F90,QP120官方旗舰店,18971928816
206,"2018-08-16 01:38:09",35,"2018-08-16 01:38:09","F3400-1005140B 扭振减振器",何勇,0719-8368258,湖北十堰,贸易,"早 8:00 - 晚 18:00","1 / 件",F3400-1005140B,"动力系统 - 玉柴",YC4F90,"English Русский",F3400-1005140B,扭振减振器,1,1,"发动机 - 玉柴发动机","2.155 (kg)",(mm),"动力系统 - 玉柴",YC4F90,QP120官方旗舰店,18971928816
207,"2018-08-16 01:38:09",35,"2018-08-16 01:38:09","F3400-1005140B 扭振减振器",何勇,0719-8368258,湖北十堰,贸易,"早 8:00 - 晚 18:00","1 / 件",F3400-1005140B,"动力系统 - 玉柴",YC4F90,"English Русский",F3400-1005140B,扭振减振器,1,1,"发动机 - 玉柴发动机","2.155 (kg)",(mm),"动力系统 - 玉柴",YC4F90,QP120官方旗舰店,18971928816
208,"2018-08-16 01:38:13",36,"2018-08-16 01:38:13","YC209-C055080PR 油封",何勇,0719-8368258,湖北十堰,贸易,"早 8:00 - 晚 18:00","1 / 件",YC209-C055080PR,"动力系统 - 玉柴",YC4F90,"English Русский",YC209-C055080PR,油封,1,1,"发动机 - 玉柴发动机","0.045 (kg)",(mm),"动力系统 - 玉柴",YC4F90,QP120官方旗舰店,18971928816
209,"2018-08-16 01:38:13",36,"2018-08-16 01:38:13","YC209-C055080PR 油封",何勇,0719-8368258,湖北十堰,贸易,"早 8:00 - 晚 18:00","1 / 件",YC209-C055080PR,"动力系统 - 玉柴",YC4F90,"English Русский",YC209-C055080PR,油封,1,1,"发动机 - 玉柴发动机","0.045 (kg)",(mm),"动力系统 - 玉柴",YC4F90,QP120官方旗舰店,18971928816
210,"2018-08-16 01:38:13",36,"2018-08-16 01:38:13","YC209-C055080PR 油封",何勇,0719-8368258,湖北十堰,贸易,"早 8:00 - 晚 18:00","1 / 件",YC209-C055080PR,"动力系统 - 玉柴",YC4F90,"English Русский",YC209-C055080PR,油封,1,1,"发动机 - 玉柴发动机","0.045 (kg)",(mm),"动力系统 - 玉柴",YC4F90,QP120官方旗舰店,18971928816
211,"2018-08-16 01:38:13",36,"2018-08-16 01:38:13","YC209-C055080PR 油封",何勇,0719-8368258,湖北十堰,贸易,"早 8:00 - 晚 18:00","1 / 件",YC209-C055080PR,"动力系统 - 玉柴",YC4F90,"English Русский",YC209-C055080PR,油封,1,1,"发动机 - 玉柴发动机","0.045 (kg)",(mm),"动力系统 - 玉柴",YC4F90,QP120官方旗舰店,18971928816
212,"2018-08-16 01:38:17",37,"2018-08-16 01:38:17","YC209-C090110PL 油封",何勇,0719-8368258,湖北十堰,贸易,"早 8:00 - 晚 18:00","1 / 件",YC209-C090110PL,"动力系统 - 玉柴",YC4F90,"English Русский",YC209-C090110PL,油封,1,10,"发动机 - 玉柴发动机","0.06 (kg)",(mm),"动力系统 - 玉柴",YC4F90,QP120官方旗舰店,18971928816
213,"2018-08-16 01:38:17",37,"2018-08-16 01:38:17","YC209-C090110PL 油封",何勇,0719-8368258,湖北十堰,贸易,"早 8:00 - 晚 18:00","1 / 件",YC209-C090110PL,"动力系统 - 玉柴",YC4F90,"English Русский",YC209-C090110PL,油封,1,10,"发动机 - 玉柴发动机","0.06 (kg)",(mm),"动力系统 - 玉柴",YC4F90,QP120官方旗舰店,18971928816
214,"2018-08-16 01:38:17",37,"2018-08-16 01:38:17","YC209-C090110PL 油封",何勇,0719-8368258,湖北十堰,贸易,"早 8:00 - 晚 18:00","1 / 件",YC209-C090110PL,"动力系统 - 玉柴",YC4F90,"English Русский",YC209-C090110PL,油封,1,10,"发动机 - 玉柴发动机","0.06 (kg)",(mm),"动力系统 - 玉柴",YC4F90,QP120官方旗舰店,18971928816
215,"2018-08-16 01:38:17",37,"2018-08-16 01:38:17","YC209-C090110PL 油封",何勇,0719-8368258,湖北十堰,贸易,"早 8:00 - 晚 18:00","1 / 件",YC209-C090110PL,"动力系统 - 玉柴",YC4F90,"English Русский",YC209-C090110PL,油封,1,10,"发动机 - 玉柴发动机","0.06 (kg)",(mm),"动力系统 - 玉柴",YC4F90,QP120官方旗舰店,18971928816
216,"2018-08-16 01:38:17",37,"2018-08-16 01:38:17","YC209-C090110PL 油封",何勇,0719-8368258,湖北十堰,贸易,"早 8:00 - 晚 18:00","1 / 件",YC209-C090110PL,"动力系统 - 玉柴",YC4F90,"English Русский",YC209-C090110PL,油封,1,10,"发动机 - 玉柴发动机","0.06 (kg)",(mm),"动力系统 - 玉柴",YC4F90,QP120官方旗舰店,18971928816
217,"2018-08-16 01:38:22",38,"2018-08-16 01:38:22","10C-05020-B 曲轴",何勇,0719-8368258,湖北十堰,贸易,"早 8:00 - 晚 18:00","1 / 件",10C-05020-B,"整车配件 - 东风商用",EQ140,"English Русский",10C-05020-B,曲轴,1,1,"发动机 - 东风发动机",(kg),(mm),"整车配件 - 东风商用",EQ140,QP120官方旗舰店,18971928816
218,"2018-08-16 01:38:25",39,"2018-08-16 01:38:25","F500A-1802191 [F500A-1802191]陕西法士特十二档九档",陶女士,0719-8287136,湖北十堰,贸易,"早 8:00 - 晚 18:00",1,F500A-1802191,,,"English Русский",F500A-1802191,[F500A-1802191]陕西法士特十二档九档八档一轴盖取力器油封,0,0,,(kg),(mm),,,十堰广联贸易有限公司,15972569822
219,"2018-08-16 01:38:25",39,"2018-08-16 01:38:25","F500A-1802191 [F500A-1802191]陕西法士特十二档九档",陶女士,0719-8287136,湖北十堰,贸易,"早 8:00 - 晚 18:00",1,F500A-1802191,,,"English Русский",F500A-1802191,[F500A-1802191]陕西法士特十二档九档八档一轴盖取力器油封,0,0,,(kg),(mm),,,十堰广联贸易有限公司,15972569822
220,"2018-08-16 01:38:27",40,"2018-08-16 01:38:27","C3968562】 【C3968562】东风原厂纯正配件6L曲轴前油封",陶女士,0719-8287136,湖北十堰,贸易,"早 8:00 - 晚 18:00",1,C3968562】,,,"English Русский",C3968562】,【C3968562】东风原厂纯正配件6L曲轴前油封,0,0,,(kg),(mm),,,十堰广联贸易有限公司,15972569822
221,"2018-08-16 01:38:30",41,"2018-08-16 01:38:30","D0200-9000200A 玉柴发动机精品组件四配套",何勇,0719-8368258,湖北十堰,贸易,"早 8:00 - 晚 18:00","1 / 套",D0200-9000200A,"动力系统 - 玉柴",YC4D130,"English Русский",D0200-9000200A,玉柴发动机精品组件四配套,1,1,"发动机 - 玉柴发动机",(kg),(mm),"动力系统 - 玉柴",YC4D130,QP120官方旗舰店,18971928816
222,"2018-08-16 01:38:30",41,"2018-08-16 01:38:30","D0200-9000200A 玉柴发动机精品组件四配套",何勇,0719-8368258,湖北十堰,贸易,"早 8:00 - 晚 18:00","1 / 套",D0200-9000200A,"动力系统 - 玉柴",YC4D130,"English Русский",D0200-9000200A,玉柴发动机精品组件四配套,1,1,"发动机 - 玉柴发动机",(kg),(mm),"动力系统 - 玉柴",YC4D130,QP120官方旗舰店,18971928816
223,"2018-08-16 01:38:33",42,"2018-08-16 01:38:33","E0200-9000200B 玉柴发动机四缸发动机四配套活塞精品组件",何勇,0719-8368258,湖北十堰,贸易,"早 8:00 - 晚 18:00","1 / 组",E0200-9000200B,"动力系统 - 玉柴",YC4E140,"English Русский",E0200-9000200B,玉柴发动机四缸发动机四配套活塞精品组件,0,0,发动机,(kg),(mm),"动力系统 - 玉柴",YC4E140,QP120官方旗舰店,18971928816
224,"2018-08-16 01:38:33",42,"2018-08-16 01:38:33","E0200-9000200B 玉柴发动机四缸发动机四配套活塞精品组件",何勇,0719-8368258,湖北十堰,贸易,"早 8:00 - 晚 18:00","1 / 组",E0200-9000200B,"动力系统 - 玉柴",YC4E140,"English Русский",E0200-9000200B,玉柴发动机四缸发动机四配套活塞精品组件,0,0,发动机,(kg),(mm),"动力系统 - 玉柴",YC4E140,QP120官方旗舰店,18971928816
225,"2018-08-16 01:38:33",42,"2018-08-16 01:38:33","E0200-9000200B 玉柴发动机四缸发动机四配套活塞精品组件",何勇,0719-8368258,湖北十堰,贸易,"早 8:00 - 晚 18:00","1 / 组",E0200-9000200B,"动力系统 - 玉柴",YC4E140,"English Русский",E0200-9000200B,玉柴发动机四缸发动机四配套活塞精品组件,0,0,发动机,(kg),(mm),"动力系统 - 玉柴",YC4E140,QP120官方旗舰店,18971928816
226,"2018-08-16 01:38:35",43,"2018-08-16 01:38:35","E0400-1004001A 活塞",何勇,0719-8368258,湖北十堰,贸易,"早 8:00 - 晚 18:00","1 / 件",E0400-1004001A,"动力系统 - 玉柴",YC4E140,"English Русский",E0400-1004001A,活塞,1,1,"发动机 - 玉柴发动机","1.415 (kg)",(mm),"动力系统 - 玉柴",YC4E140,QP120官方旗舰店,18971928816
227,"2018-08-16 01:38:35",43,"2018-08-16 01:38:35","E0400-1004001A 活塞",何勇,0719-8368258,湖北十堰,贸易,"早 8:00 - 晚 18:00","1 / 件",E0400-1004001A,"动力系统 - 玉柴",YC4E140,"English Русский",E0400-1004001A,活塞,1,1,"发动机 - 玉柴发动机","1.415 (kg)",(mm),"动力系统 - 玉柴",YC4E140,QP120官方旗舰店,18971928816
228,"2018-08-16 01:38:35",43,"2018-08-16 01:38:35","E0400-1004001A 活塞",何勇,0719-8368258,湖北十堰,贸易,"早 8:00 - 晚 18:00","1 / 件",E0400-1004001A,"动力系统 - 玉柴",YC4E140,"English Русский",E0400-1004001A,活塞,1,1,"发动机 - 玉柴发动机","1.415 (kg)",(mm),"动力系统 - 玉柴",YC4E140,QP120官方旗舰店,18971928816
229,"2018-08-16 01:38:36",44,"2018-08-16 01:38:36","C5255975 活塞",魏笑妃,0719-8311433,湖北十堰,贸易,"早 8:00 - 晚 18:00","1 / 个",C5255975,发动机,,"English Русский",C5255975,活塞,1,1,"发动机 - 康明斯",(kg),(mm),发动机,,湖北京汉动力科技有限公司,13972463247
230,"2018-08-16 01:38:36",44,"2018-08-16 01:38:36","C5255975 活塞",魏笑妃,0719-8311433,湖北十堰,贸易,"早 8:00 - 晚 18:00","1 / 个",C5255975,发动机,,"English Русский",C5255975,活塞,1,1,"发动机 - 康明斯",(kg),(mm),发动机,,湖北京汉动力科技有限公司,13972463247
231,"2018-08-16 01:38:36",44,"2018-08-16 01:38:36","C5255975 活塞",魏笑妃,0719-8311433,湖北十堰,贸易,"早 8:00 - 晚 18:00","1 / 个",C5255975,发动机,,"English Русский",C5255975,活塞,1,1,"发动机 - 康明斯",(kg),(mm),发动机,,湖北京汉动力科技有限公司,13972463247
232,"2018-08-16 01:38:36",44,"2018-08-16 01:38:36","C5255975 活塞",魏笑妃,0719-8311433,湖北十堰,贸易,"早 8:00 - 晚 18:00","1 / 个",C5255975,发动机,,"English Русский",C5255975,活塞,1,1,"发动机 - 康明斯",(kg),(mm),发动机,,湖北京汉动力科技有限公司,13972463247
233,"2018-08-16 01:38:36",44,"2018-08-16 01:38:36","C5255975 活塞",魏笑妃,0719-8311433,湖北十堰,贸易,"早 8:00 - 晚 18:00","1 / 个",C5255975,发动机,,"English Русский",C5255975,活塞,1,1,"发动机 - 康明斯",(kg),(mm),发动机,,湖北京汉动力科技有限公司,13972463247
234,"2018-08-16 01:38:36",44,"2018-08-16 01:38:36","C5255975 活塞",魏笑妃,0719-8311433,湖北十堰,贸易,"早 8:00 - 晚 18:00","1 / 个",C5255975,发动机,,"English Русский",C5255975,活塞,1,1,"发动机 - 康明斯",(kg),(mm),发动机,,湖北京汉动力科技有限公司,13972463247
235,"2018-08-16 01:38:36",44,"2018-08-16 01:38:36","C5255975 活塞",魏笑妃,0719-8311433,湖北十堰,贸易,"早 8:00 - 晚 18:00","1 / 个",C5255975,发动机,,"English Русский",C5255975,活塞,1,1,"发动机 - 康明斯",(kg),(mm),发动机,,湖北京汉动力科技有限公司,13972463247
236,"2018-08-16 01:38:36",44,"2018-08-16 01:38:36","C5255975 活塞",魏笑妃,0719-8311433,湖北十堰,贸易,"早 8:00 - 晚 18:00","1 / 个",C5255975,发动机,,"English Русский",C5255975,活塞,1,1,"发动机 - 康明斯",(kg),(mm),发动机,,湖北京汉动力科技有限公司,13972463247
237,"2018-08-16 01:38:36",44,"2018-08-16 01:38:36","C5255975 活塞",魏笑妃,0719-8311433,湖北十堰,贸易,"早 8:00 - 晚 18:00","1 / 个",C5255975,发动机,,"English Русский",C5255975,活塞,1,1,"发动机 - 康明斯",(kg),(mm),发动机,,湖北京汉动力科技有限公司,13972463247
238,"2018-08-16 01:38:41",45,"2018-08-16 01:38:41","C4974985 活塞压缩环",魏笑妃,0719-8311433,湖北十堰,贸易,"早 8:00 - 晚 18:00","1 / 件",C4974985,"发动机 - 康明斯",,"English Русский",C4974985,活塞压缩环,1,1,"发动机 - 康明斯",(kg),(mm),"发动机 - 康明斯",,湖北京汉动力科技有限公司,13972463247
239,"2018-08-16 01:38:41",45,"2018-08-16 01:38:41","C4974985 活塞压缩环",魏笑妃,0719-8311433,湖北十堰,贸易,"早 8:00 - 晚 18:00","1 / 件",C4974985,"发动机 - 康明斯",,"English Русский",C4974985,活塞压缩环,1,1,"发动机 - 康明斯",(kg),(mm),"发动机 - 康明斯",,湖北京汉动力科技有限公司,13972463247
240,"2018-08-16 01:38:41",45,"2018-08-16 01:38:41","C4974985 活塞压缩环",魏笑妃,0719-8311433,湖北十堰,贸易,"早 8:00 - 晚 18:00","1 / 件",C4974985,"发动机 - 康明斯",,"English Русский",C4974985,活塞压缩环,1,1,"发动机 - 康明斯",(kg),(mm),"发动机 - 康明斯",,湖北京汉动力科技有限公司,13972463247
241,"2018-08-16 01:38:43",46,"2018-08-16 01:38:43","C4959949 活塞压缩环",魏笑妃,0719-8311433,湖北十堰,贸易,"早 8:00 - 晚 18:00","1 / 个",C4959949,"发动机 - 发动机",,"English Русский",C4959949,活塞压缩环,1,1,"发动机 - 康明斯",(kg),(mm),"发动机 - 发动机",,湖北京汉动力科技有限公司,13972463247
242,"2018-08-16 01:38:43",46,"2018-08-16 01:38:43","C4959949 活塞压缩环",魏笑妃,0719-8311433,湖北十堰,贸易,"早 8:00 - 晚 18:00","1 / 个",C4959949,"发动机 - 发动机",,"English Русский",C4959949,活塞压缩环,1,1,"发动机 - 康明斯",(kg),(mm),"发动机 - 发动机",,湖北京汉动力科技有限公司,13972463247
243,"2018-08-16 01:38:43",46,"2018-08-16 01:38:43","C4959949 活塞压缩环",魏笑妃,0719-8311433,湖北十堰,贸易,"早 8:00 - 晚 18:00","1 / 个",C4959949,"发动机 - 发动机",,"English Русский",C4959949,活塞压缩环,1,1,"发动机 - 康明斯",(kg),(mm),"发动机 - 发动机",,湖北京汉动力科技有限公司,13972463247