qipei_image.id,qipei_image.ts,qipei_image.source_content_type,qipei_image.hash_file_content,qipei_image.size,qipei_image.path,qipei_image.title,qipei_image.access,image.id,image.ts,qiche_peijian.id,qiche_peijian.ts,qiche_peijian.title,qiche_peijian.lianxiren,qiche_peijian.lianxi_dianhua,qiche_peijian.suozai_diqu,qiche_peijian.qiye_leixing,qiche_peijian.gongzuo_shijian,qiche_peijian.qidingliang,qiche_peijian.xinghao,qiche_peijian.pinpai,qiche_peijian.shiyong,qiche_peijian.yuyan,qiche_peijian.chanpin_xinghao,qiche_peijian.chanpin_mingcheng,qiche_peijian.yongliang,qiche_peijian.baozhuang_shuliang,qiche_peijian.zhuji_yingyong,qiche_peijian.chanpin_maozhong,qiche_peijian.guige,qiche_peijian.chandi_pinpai,qiche_peijian.shiyong_jixing,qiche_peijian.shangjia,qiche_peijian.dizhi
101,"2018-10-11 02:35:18",image/jpeg,19f95d936d0a58ab1cc610553cb010aabfc43fb4,46799,/19/f9/5d/93/19f95d936d0a58ab1cc610553cb010aabfc43fb4.jpg,,https://songer.datasn.com/data/api/v1/u_4db7936df78dfe468fc2/qiche_peijian_daquan_5/by_table/qipei_image_access/19/f9/5d/93/19f95d936d0a58ab1cc610553cb010aabfc43fb4.jpg,166,"2018-08-16 01:37:25",21,"2018-08-16 01:37:25","C3928797 康明斯气缸体总成 东风EQ180-20发动机",何勇,0719-8368258,湖北十堰,贸易,"早 8:00 - 晚 18:00","1 / 台",C3928797,"动力系统 - 康明斯",4BT/6BT,"English Русский",C3928797,"康明斯气缸体总成 东风EQ180-20发动机",1,1,"发动机 - 康明斯",(kg),(mm),"动力系统 - 康明斯",4BT/6BT,QP120官方旗舰店,18971928816
102,"2018-10-11 02:35:19",image/jpeg,2dc49968d2002e8429540891bfa0f0142e033a2a,63205,/2d/c4/99/68/2dc49968d2002e8429540891bfa0f0142e033a2a.jpg,,https://songer.datasn.com/data/api/v1/u_4db7936df78dfe468fc2/qiche_peijian_daquan_5/by_table/qipei_image_access/2d/c4/99/68/2dc49968d2002e8429540891bfa0f0142e033a2a.jpg,167,"2018-08-16 01:37:29",22,"2018-08-16 01:37:29","F3000-1002170 气缸体",何勇,0719-8368258,湖北十堰,贸易,"早 8:00 - 晚 18:00","1 / 件",F3000-1002170,"动力系统 - 玉柴",YC4F90,"English Русский",F3000-1002170,气缸体,1,1,"发动机 - 玉柴发动机","89.00 (kg)",(mm),"动力系统 - 玉柴",YC4F90,QP120官方旗舰店,18971928816
103,"2018-10-11 02:35:19",image/jpeg,e0dbefaa8e3d519695ead38c8528c66034c4e1fd,53430,/e0/db/ef/aa/e0dbefaa8e3d519695ead38c8528c66034c4e1fd.jpg,,https://songer.datasn.com/data/api/v1/u_4db7936df78dfe468fc2/qiche_peijian_daquan_5/by_table/qipei_image_access/e0/db/ef/aa/e0dbefaa8e3d519695ead38c8528c66034c4e1fd.jpg,168,"2018-08-16 01:37:29",22,"2018-08-16 01:37:29","F3000-1002170 气缸体",何勇,0719-8368258,湖北十堰,贸易,"早 8:00 - 晚 18:00","1 / 件",F3000-1002170,"动力系统 - 玉柴",YC4F90,"English Русский",F3000-1002170,气缸体,1,1,"发动机 - 玉柴发动机","89.00 (kg)",(mm),"动力系统 - 玉柴",YC4F90,QP120官方旗舰店,18971928816
104,"2018-10-11 02:35:19",image/jpeg,ce60d70d310d625ab961102123a4a652e82d6cf7,76697,/ce/60/d7/0d/ce60d70d310d625ab961102123a4a652e82d6cf7.jpg,,https://songer.datasn.com/data/api/v1/u_4db7936df78dfe468fc2/qiche_peijian_daquan_5/by_table/qipei_image_access/ce/60/d7/0d/ce60d70d310d625ab961102123a4a652e82d6cf7.jpg,169,"2018-08-16 01:37:29",22,"2018-08-16 01:37:29","F3000-1002170 气缸体",何勇,0719-8368258,湖北十堰,贸易,"早 8:00 - 晚 18:00","1 / 件",F3000-1002170,"动力系统 - 玉柴",YC4F90,"English Русский",F3000-1002170,气缸体,1,1,"发动机 - 玉柴发动机","89.00 (kg)",(mm),"动力系统 - 玉柴",YC4F90,QP120官方旗舰店,18971928816
105,"2018-10-11 02:35:21",image/jpeg,e0f2ca0377e719d9680103ac8abd7a3e135c2be5,67387,/e0/f2/ca/03/e0f2ca0377e719d9680103ac8abd7a3e135c2be5.jpg,,https://songer.datasn.com/data/api/v1/u_4db7936df78dfe468fc2/qiche_peijian_daquan_5/by_table/qipei_image_access/e0/f2/ca/03/e0f2ca0377e719d9680103ac8abd7a3e135c2be5.jpg,170,"2018-08-16 01:37:29",22,"2018-08-16 01:37:29","F3000-1002170 气缸体",何勇,0719-8368258,湖北十堰,贸易,"早 8:00 - 晚 18:00","1 / 件",F3000-1002170,"动力系统 - 玉柴",YC4F90,"English Русский",F3000-1002170,气缸体,1,1,"发动机 - 玉柴发动机","89.00 (kg)",(mm),"动力系统 - 玉柴",YC4F90,QP120官方旗舰店,18971928816
106,"2018-10-11 02:35:22",image/jpeg,90f08856d078de57ae7353a98a812c0f230b421c,68718,/90/f0/88/56/90f08856d078de57ae7353a98a812c0f230b421c.jpg,,https://songer.datasn.com/data/api/v1/u_4db7936df78dfe468fc2/qiche_peijian_daquan_5/by_table/qipei_image_access/90/f0/88/56/90f08856d078de57ae7353a98a812c0f230b421c.jpg,171,"2018-08-16 01:37:29",22,"2018-08-16 01:37:29","F3000-1002170 气缸体",何勇,0719-8368258,湖北十堰,贸易,"早 8:00 - 晚 18:00","1 / 件",F3000-1002170,"动力系统 - 玉柴",YC4F90,"English Русский",F3000-1002170,气缸体,1,1,"发动机 - 玉柴发动机","89.00 (kg)",(mm),"动力系统 - 玉柴",YC4F90,QP120官方旗舰店,18971928816
107,"2018-10-11 02:35:23",image/jpeg,740ad19d08ed0dd8efec6f717cf38de26fa71290,56950,/74/0a/d1/9d/740ad19d08ed0dd8efec6f717cf38de26fa71290.jpg,,https://songer.datasn.com/data/api/v1/u_4db7936df78dfe468fc2/qiche_peijian_daquan_5/by_table/qipei_image_access/74/0a/d1/9d/740ad19d08ed0dd8efec6f717cf38de26fa71290.jpg,172,"2018-08-16 01:37:29",22,"2018-08-16 01:37:29","F3000-1002170 气缸体",何勇,0719-8368258,湖北十堰,贸易,"早 8:00 - 晚 18:00","1 / 件",F3000-1002170,"动力系统 - 玉柴",YC4F90,"English Русский",F3000-1002170,气缸体,1,1,"发动机 - 玉柴发动机","89.00 (kg)",(mm),"动力系统 - 玉柴",YC4F90,QP120官方旗舰店,18971928816
108,"2018-10-11 02:35:26",image/jpeg,2efaa9e8df4a95dc1615218656cf95bdbdca7aa0,71961,/2e/fa/a9/e8/2efaa9e8df4a95dc1615218656cf95bdbdca7aa0.jpg,,https://songer.datasn.com/data/api/v1/u_4db7936df78dfe468fc2/qiche_peijian_daquan_5/by_table/qipei_image_access/2e/fa/a9/e8/2efaa9e8df4a95dc1615218656cf95bdbdca7aa0.jpg,173,"2018-08-16 01:37:29",22,"2018-08-16 01:37:29","F3000-1002170 气缸体",何勇,0719-8368258,湖北十堰,贸易,"早 8:00 - 晚 18:00","1 / 件",F3000-1002170,"动力系统 - 玉柴",YC4F90,"English Русский",F3000-1002170,气缸体,1,1,"发动机 - 玉柴发动机","89.00 (kg)",(mm),"动力系统 - 玉柴",YC4F90,QP120官方旗舰店,18971928816
109,"2018-10-11 02:35:31",image/jpeg,84e2cb46156c14c90b3d18cd346b350d8b314761,44676,/84/e2/cb/46/84e2cb46156c14c90b3d18cd346b350d8b314761.jpg,,https://songer.datasn.com/data/api/v1/u_4db7936df78dfe468fc2/qiche_peijian_daquan_5/by_table/qipei_image_access/84/e2/cb/46/84e2cb46156c14c90b3d18cd346b350d8b314761.jpg,174,"2018-08-16 01:37:34",23,"2018-08-16 01:37:34","MK100-1002106ASF5 东风大力神YC6M玉柴发动机气缸套",吕德荣,18772931815,湖北十堰,贸易,"早 8:00 - 晚 18:00","1 / 组",MK100-1002106ASF5,"发动机配件 - 玉柴",玉柴,"English Русский",MK100-1002106ASF5,东风大力神YC6M玉柴发动机气缸套,0,0,"发动机 - 玉柴发动机","3.80 (kg)",(mm),"发动机配件 - 玉柴",玉柴,十堰市港峰工贸有限公司,13339855539
110,"2018-10-11 02:35:34",image/jpeg,c38142b8149fa50798ee1a7fab2e4db3b7fd471d,51645,/c3/81/42/b8/c38142b8149fa50798ee1a7fab2e4db3b7fd471d.jpg,,https://songer.datasn.com/data/api/v1/u_4db7936df78dfe468fc2/qiche_peijian_daquan_5/by_table/qipei_image_access/c3/81/42/b8/c38142b8149fa50798ee1a7fab2e4db3b7fd471d.jpg,175,"2018-08-16 01:37:34",23,"2018-08-16 01:37:34","MK100-1002106ASF5 东风大力神YC6M玉柴发动机气缸套",吕德荣,18772931815,湖北十堰,贸易,"早 8:00 - 晚 18:00","1 / 组",MK100-1002106ASF5,"发动机配件 - 玉柴",玉柴,"English Русский",MK100-1002106ASF5,东风大力神YC6M玉柴发动机气缸套,0,0,"发动机 - 玉柴发动机","3.80 (kg)",(mm),"发动机配件 - 玉柴",玉柴,十堰市港峰工贸有限公司,13339855539
111,"2018-10-11 02:35:37",image/jpeg,d0d051b6b6896d2ebe70d083718ca3a8a7965c7f,53871,/d0/d0/51/b6/d0d051b6b6896d2ebe70d083718ca3a8a7965c7f.jpg,,https://songer.datasn.com/data/api/v1/u_4db7936df78dfe468fc2/qiche_peijian_daquan_5/by_table/qipei_image_access/d0/d0/51/b6/d0d051b6b6896d2ebe70d083718ca3a8a7965c7f.jpg,176,"2018-08-16 01:37:34",23,"2018-08-16 01:37:34","MK100-1002106ASF5 东风大力神YC6M玉柴发动机气缸套",吕德荣,18772931815,湖北十堰,贸易,"早 8:00 - 晚 18:00","1 / 组",MK100-1002106ASF5,"发动机配件 - 玉柴",玉柴,"English Русский",MK100-1002106ASF5,东风大力神YC6M玉柴发动机气缸套,0,0,"发动机 - 玉柴发动机","3.80 (kg)",(mm),"发动机配件 - 玉柴",玉柴,十堰市港峰工贸有限公司,13339855539
112,"2018-10-11 02:35:40",image/jpeg,40ad2251013fa272498d8408c6a67257171bb2df,18314,/40/ad/22/51/40ad2251013fa272498d8408c6a67257171bb2df.jpg,,https://songer.datasn.com/data/api/v1/u_4db7936df78dfe468fc2/qiche_peijian_daquan_5/by_table/qipei_image_access/40/ad/22/51/40ad2251013fa272498d8408c6a67257171bb2df.jpg,177,"2018-08-16 01:37:39",24,"2018-08-16 01:37:39","4946152 4946152",陶女士,0719-8287136,湖北十堰,贸易,"早 8:00 - 晚 18:00",1,4946152,,,"English Русский",4946152,4946152,0,0,,(kg),(mm),,,十堰广联贸易有限公司,15972569822
113,"2018-10-11 02:35:40",image/jpeg,6fb6d86951781cece8a5018d643db93c84cf2610,17727,/6f/b6/d8/69/6fb6d86951781cece8a5018d643db93c84cf2610.jpg,,https://songer.datasn.com/data/api/v1/u_4db7936df78dfe468fc2/qiche_peijian_daquan_5/by_table/qipei_image_access/6f/b6/d8/69/6fb6d86951781cece8a5018d643db93c84cf2610.jpg,178,"2018-08-16 01:37:39",24,"2018-08-16 01:37:39","4946152 4946152",陶女士,0719-8287136,湖北十堰,贸易,"早 8:00 - 晚 18:00",1,4946152,,,"English Русский",4946152,4946152,0,0,,(kg),(mm),,,十堰广联贸易有限公司,15972569822
114,"2018-10-11 02:35:44",image/jpeg,92c00e6d0112c033fcea9135e086e7f430603335,44878,/92/c0/0e/6d/92c00e6d0112c033fcea9135e086e7f430603335.jpg,,https://songer.datasn.com/data/api/v1/u_4db7936df78dfe468fc2/qiche_peijian_daquan_5/by_table/qipei_image_access/92/c0/0e/6d/92c00e6d0112c033fcea9135e086e7f430603335.jpg,179,"2018-08-16 01:37:43",25,"2018-08-16 01:37:43","M1300-1002106 东风大力神YC6M玉柴发动机缸体气缸套",吕德荣,18772931815,湖北十堰,贸易,"早 8:00 - 晚 18:00","1 / 组",M1300-1002106,"发动机配件 - 玉柴",玉柴,"English Русский",M1300-1002106,东风大力神YC6M玉柴发动机缸体气缸套,0,0,"发动机 - 玉柴发动机",(kg),(mm),"发动机配件 - 玉柴",玉柴,十堰市港峰工贸有限公司,13339855539
115,"2018-10-11 02:35:45",image/jpeg,4bdcecc6a7c9e7c2cc599a8aaef919b32880002f,40296,/4b/dc/ec/c6/4bdcecc6a7c9e7c2cc599a8aaef919b32880002f.jpg,,https://songer.datasn.com/data/api/v1/u_4db7936df78dfe468fc2/qiche_peijian_daquan_5/by_table/qipei_image_access/4b/dc/ec/c6/4bdcecc6a7c9e7c2cc599a8aaef919b32880002f.jpg,180,"2018-08-16 01:37:43",25,"2018-08-16 01:37:43","M1300-1002106 东风大力神YC6M玉柴发动机缸体气缸套",吕德荣,18772931815,湖北十堰,贸易,"早 8:00 - 晚 18:00","1 / 组",M1300-1002106,"发动机配件 - 玉柴",玉柴,"English Русский",M1300-1002106,东风大力神YC6M玉柴发动机缸体气缸套,0,0,"发动机 - 玉柴发动机",(kg),(mm),"发动机配件 - 玉柴",玉柴,十堰市港峰工贸有限公司,13339855539
116,"2018-10-11 02:35:45",image/jpeg,9173cd40509b37ba8b4e34e27b992c8cb07a5496,52249,/91/73/cd/40/9173cd40509b37ba8b4e34e27b992c8cb07a5496.jpg,,https://songer.datasn.com/data/api/v1/u_4db7936df78dfe468fc2/qiche_peijian_daquan_5/by_table/qipei_image_access/91/73/cd/40/9173cd40509b37ba8b4e34e27b992c8cb07a5496.jpg,181,"2018-08-16 01:37:43",25,"2018-08-16 01:37:43","M1300-1002106 东风大力神YC6M玉柴发动机缸体气缸套",吕德荣,18772931815,湖北十堰,贸易,"早 8:00 - 晚 18:00","1 / 组",M1300-1002106,"发动机配件 - 玉柴",玉柴,"English Русский",M1300-1002106,东风大力神YC6M玉柴发动机缸体气缸套,0,0,"发动机 - 玉柴发动机",(kg),(mm),"发动机配件 - 玉柴",玉柴,十堰市港峰工贸有限公司,13339855539
117,"2018-10-11 02:35:47",image/jpeg,99213fae5b40b1fc009de2006cfa718f958aded7,36770,/99/21/3f/ae/99213fae5b40b1fc009de2006cfa718f958aded7.jpg,,https://songer.datasn.com/data/api/v1/u_4db7936df78dfe468fc2/qiche_peijian_daquan_5/by_table/qipei_image_access/99/21/3f/ae/99213fae5b40b1fc009de2006cfa718f958aded7.jpg,182,"2018-08-16 01:37:43",25,"2018-08-16 01:37:43","M1300-1002106 东风大力神YC6M玉柴发动机缸体气缸套",吕德荣,18772931815,湖北十堰,贸易,"早 8:00 - 晚 18:00","1 / 组",M1300-1002106,"发动机配件 - 玉柴",玉柴,"English Русский",M1300-1002106,东风大力神YC6M玉柴发动机缸体气缸套,0,0,"发动机 - 玉柴发动机",(kg),(mm),"发动机配件 - 玉柴",玉柴,十堰市港峰工贸有限公司,13339855539
118,"2018-10-11 02:35:49",image/jpeg,140f272f84180911a7ac3ed0ebe601084a62737f,77975,/14/0f/27/2f/140f272f84180911a7ac3ed0ebe601084a62737f.jpg,,https://songer.datasn.com/data/api/v1/u_4db7936df78dfe468fc2/qiche_peijian_daquan_5/by_table/qipei_image_access/14/0f/27/2f/140f272f84180911a7ac3ed0ebe601084a62737f.jpg,183,"2018-08-16 01:37:45",26,"2018-08-16 01:37:45","L3000-1002106 L3000-1002106气缸套玉柴天然气发动机配",陶女士,0719-8287136,湖北十堰,贸易,"早 8:00 - 晚 18:00",1,L3000-1002106,,,"English Русский",L3000-1002106,L3000-1002106气缸套玉柴天然气发动机配件,0,0,,(kg),(mm),,,十堰广联贸易有限公司,15972569822
119,"2018-10-11 02:35:49",image/png,31051ccdf692259d1c779fae948a15cd2b986813,106750,/31/05/1c/cd/31051ccdf692259d1c779fae948a15cd2b986813.png,,https://songer.datasn.com/data/api/v1/u_4db7936df78dfe468fc2/qiche_peijian_daquan_5/by_table/qipei_image_access/31/05/1c/cd/31051ccdf692259d1c779fae948a15cd2b986813.png,184,"2018-08-16 01:37:45",26,"2018-08-16 01:37:45","L3000-1002106 L3000-1002106气缸套玉柴天然气发动机配",陶女士,0719-8287136,湖北十堰,贸易,"早 8:00 - 晚 18:00",1,L3000-1002106,,,"English Русский",L3000-1002106,L3000-1002106气缸套玉柴天然气发动机配件,0,0,,(kg),(mm),,,十堰广联贸易有限公司,15972569822
120,"2018-10-11 02:35:53",image/jpeg,b0925f36e4319e35a74e26fe89c3392f3cc11a24,54597,/b0/92/5f/36/b0925f36e4319e35a74e26fe89c3392f3cc11a24.jpg,,https://songer.datasn.com/data/api/v1/u_4db7936df78dfe468fc2/qiche_peijian_daquan_5/by_table/qipei_image_access/b0/92/5f/36/b0925f36e4319e35a74e26fe89c3392f3cc11a24.jpg,185,"2018-08-16 01:37:50",27,"2018-08-16 01:37:50","M1300-1002106 玉柴发动机YC6M340 气缸套 东风大力神",何勇,0719-8368258,湖北十堰,贸易,"早 8:00 - 晚 18:00","1 / 件",M1300-1002106,"动力系统 - 玉柴","YC6M YC6MK","English Русский",M1300-1002106,"玉柴发动机YC6M340 气缸套 东风大力神",1,1,"发动机 - 玉柴发动机",(kg),(mm),"动力系统 - 玉柴","YC6M YC6MK",QP120官方旗舰店,18971928816
121,"2018-10-11 02:35:57",image/jpeg,5f1b9d1833f3965bb4727157bd9372c78e61e0f3,54086,/5f/1b/9d/18/5f1b9d1833f3965bb4727157bd9372c78e61e0f3.jpg,,https://songer.datasn.com/data/api/v1/u_4db7936df78dfe468fc2/qiche_peijian_daquan_5/by_table/qipei_image_access/5f/1b/9d/18/5f1b9d1833f3965bb4727157bd9372c78e61e0f3.jpg,186,"2018-08-16 01:37:52",28,"2018-08-16 01:37:52","MK100-1002106ASF5 东风大力神玉柴发动机YC6M 340 气缸套",何勇,0719-8368258,湖北十堰,贸易,"早 8:00 - 晚 18:00","1 / 件",MK100-1002106ASF5,"动力系统 - 玉柴","YC6M YC6MK","English Русский",MK100-1002106ASF5,"东风大力神玉柴发动机YC6M 340 气缸套",6,6,"发动机 - 玉柴发动机","3.80 (kg)",(mm),"动力系统 - 玉柴","YC6M YC6MK",QP120官方旗舰店,18971928816
122,"2018-10-11 02:36:01",image/jpeg,b5e1fe10a375cd67e1033bc2fb342d83fc427047,51993,/b5/e1/fe/10/b5e1fe10a375cd67e1033bc2fb342d83fc427047.jpg,,https://songer.datasn.com/data/api/v1/u_4db7936df78dfe468fc2/qiche_peijian_daquan_5/by_table/qipei_image_access/b5/e1/fe/10/b5e1fe10a375cd67e1033bc2fb342d83fc427047.jpg,187,"2018-08-16 01:37:57",29,"2018-08-16 01:37:57","3801826 3055099 康明斯发动机NT855气缸套组件",何勇,0719-8368258,湖北十堰,贸易,"早 8:00 - 晚 18:00","1 / 套",3801826,"动力系统 - 康明斯","4BT/6BT NT855/N14","English Русский",3801826,"3055099 康明斯发动机NT855气缸套组件",6,1,"发动机 - 康明斯","8.50 (kg)",(mm),"动力系统 - 康明斯","4BT/6BT NT855/N14",QP120官方旗舰店,18971928816
123,"2018-10-11 02:36:05",image/jpeg,f4b7e96b61fa8dabd21edaedcef4ed40d3d29799,71085,/f4/b7/e9/6b/f4b7e96b61fa8dabd21edaedcef4ed40d3d29799.jpg,,https://songer.datasn.com/data/api/v1/u_4db7936df78dfe468fc2/qiche_peijian_daquan_5/by_table/qipei_image_access/f4/b7/e9/6b/f4b7e96b61fa8dabd21edaedcef4ed40d3d29799.jpg,188,"2018-08-16 01:37:57",30,"2018-08-16 01:37:57","3022157 3022157重庆康明斯K19发动机汽缸套",陶女士,0719-8287136,湖北十堰,贸易,"早 8:00 - 晚 18:00",1,3022157,,,"English Русский",3022157,3022157重庆康明斯K19发动机汽缸套,0,0,,(kg),(mm),,,十堰广联贸易有限公司,15972569822
124,"2018-10-11 02:36:09",image/jpeg,093a677765d0dd430b99606a03f719570446c0e8,32857,/09/3a/67/77/093a677765d0dd430b99606a03f719570446c0e8.jpg,,https://songer.datasn.com/data/api/v1/u_4db7936df78dfe468fc2/qiche_peijian_daquan_5/by_table/qipei_image_access/09/3a/67/77/093a677765d0dd430b99606a03f719570446c0e8.jpg,189,"2018-08-16 01:37:57",30,"2018-08-16 01:37:57","3022157 3022157重庆康明斯K19发动机汽缸套",陶女士,0719-8287136,湖北十堰,贸易,"早 8:00 - 晚 18:00",1,3022157,,,"English Русский",3022157,3022157重庆康明斯K19发动机汽缸套,0,0,,(kg),(mm),,,十堰广联贸易有限公司,15972569822
125,"2018-10-11 02:36:12",image/jpeg,4b59209088430e16c883e315a492c55a2a0503cd,71401,/4b/59/20/90/4b59209088430e16c883e315a492c55a2a0503cd.jpg,,https://songer.datasn.com/data/api/v1/u_4db7936df78dfe468fc2/qiche_peijian_daquan_5/by_table/qipei_image_access/4b/59/20/90/4b59209088430e16c883e315a492c55a2a0503cd.jpg,190,"2018-08-16 01:38:01",31,"2018-08-16 01:38:01","530-1005014A 主轴瓦组件",何勇,0719-8368258,湖北十堰,贸易,"早 8:00 - 晚 18:00","1 / 组",530-1005014A,"动力系统 - 玉柴",YC4E140,"English Русский",530-1005014A,主轴瓦组件,1,1,"发动机 - 玉柴发动机",(kg),(mm),"动力系统 - 玉柴",YC4E140,QP120官方旗舰店,18971928816
126,"2018-10-11 02:36:15",image/jpeg,a4591ae0660fb546c966227af5924b21491afcba,78535,/a4/59/1a/e0/a4591ae0660fb546c966227af5924b21491afcba.jpg,,https://songer.datasn.com/data/api/v1/u_4db7936df78dfe468fc2/qiche_peijian_daquan_5/by_table/qipei_image_access/a4/59/1a/e0/a4591ae0660fb546c966227af5924b21491afcba.jpg,191,"2018-08-16 01:38:01",31,"2018-08-16 01:38:01","530-1005014A 主轴瓦组件",何勇,0719-8368258,湖北十堰,贸易,"早 8:00 - 晚 18:00","1 / 组",530-1005014A,"动力系统 - 玉柴",YC4E140,"English Русский",530-1005014A,主轴瓦组件,1,1,"发动机 - 玉柴发动机",(kg),(mm),"动力系统 - 玉柴",YC4E140,QP120官方旗舰店,18971928816
127,"2018-10-11 02:36:16",image/jpeg,008c3c22c0686cb0ccbf9ac9d7e62b6db2b481e4,56773,/00/8c/3c/22/008c3c22c0686cb0ccbf9ac9d7e62b6db2b481e4.jpg,,https://songer.datasn.com/data/api/v1/u_4db7936df78dfe468fc2/qiche_peijian_daquan_5/by_table/qipei_image_access/00/8c/3c/22/008c3c22c0686cb0ccbf9ac9d7e62b6db2b481e4.jpg,192,"2018-08-16 01:38:01",31,"2018-08-16 01:38:01","530-1005014A 主轴瓦组件",何勇,0719-8368258,湖北十堰,贸易,"早 8:00 - 晚 18:00","1 / 组",530-1005014A,"动力系统 - 玉柴",YC4E140,"English Русский",530-1005014A,主轴瓦组件,1,1,"发动机 - 玉柴发动机",(kg),(mm),"动力系统 - 玉柴",YC4E140,QP120官方旗舰店,18971928816
128,"2018-10-11 02:36:17",image/jpeg,e3e9cbe720e8d0eb32698460d906942041ccc015,51119,/e3/e9/cb/e7/e3e9cbe720e8d0eb32698460d906942041ccc015.jpg,,https://songer.datasn.com/data/api/v1/u_4db7936df78dfe468fc2/qiche_peijian_daquan_5/by_table/qipei_image_access/e3/e9/cb/e7/e3e9cbe720e8d0eb32698460d906942041ccc015.jpg,193,"2018-08-16 01:38:06",32,"2018-08-16 01:38:06","F7000-1005007 曲轴止推片 玉柴发动机",何勇,0719-8368258,湖北十堰,贸易,"早 8:00 - 晚 18:00","1 / 件",F7000-1005007,"动力系统 - 玉柴",YC4F90,"English Русский",F7000-1005007,"曲轴止推片 玉柴发动机",4,4,"发动机 - 玉柴发动机","0.095 (kg)",(mm),"动力系统 - 玉柴",YC4F90,QP120官方旗舰店,18971928816
129,"2018-10-11 02:36:20",image/jpeg,9936f010312bbe44e09c46b26d7678b439d6d9f0,49801,/99/36/f0/10/9936f010312bbe44e09c46b26d7678b439d6d9f0.jpg,,https://songer.datasn.com/data/api/v1/u_4db7936df78dfe468fc2/qiche_peijian_daquan_5/by_table/qipei_image_access/99/36/f0/10/9936f010312bbe44e09c46b26d7678b439d6d9f0.jpg,194,"2018-08-16 01:38:06",32,"2018-08-16 01:38:06","F7000-1005007 曲轴止推片 玉柴发动机",何勇,0719-8368258,湖北十堰,贸易,"早 8:00 - 晚 18:00","1 / 件",F7000-1005007,"动力系统 - 玉柴",YC4F90,"English Русский",F7000-1005007,"曲轴止推片 玉柴发动机",4,4,"发动机 - 玉柴发动机","0.095 (kg)",(mm),"动力系统 - 玉柴",YC4F90,QP120官方旗舰店,18971928816
130,"2018-10-11 02:36:21",image/jpeg,a0164de0a6cdcc7afeed41c728352f3ea56851d3,34143,/a0/16/4d/e0/a0164de0a6cdcc7afeed41c728352f3ea56851d3.jpg,,https://songer.datasn.com/data/api/v1/u_4db7936df78dfe468fc2/qiche_peijian_daquan_5/by_table/qipei_image_access/a0/16/4d/e0/a0164de0a6cdcc7afeed41c728352f3ea56851d3.jpg,195,"2018-08-16 01:38:06",32,"2018-08-16 01:38:06","F7000-1005007 曲轴止推片 玉柴发动机",何勇,0719-8368258,湖北十堰,贸易,"早 8:00 - 晚 18:00","1 / 件",F7000-1005007,"动力系统 - 玉柴",YC4F90,"English Русский",F7000-1005007,"曲轴止推片 玉柴发动机",4,4,"发动机 - 玉柴发动机","0.095 (kg)",(mm),"动力系统 - 玉柴",YC4F90,QP120官方旗舰店,18971928816
131,"2018-10-11 02:36:22",image/jpeg,e0f29b6cb0ae53cecb532e46fb95f09d01ba2e90,81194,/e0/f2/9b/6c/e0f29b6cb0ae53cecb532e46fb95f09d01ba2e90.jpg,,https://songer.datasn.com/data/api/v1/u_4db7936df78dfe468fc2/qiche_peijian_daquan_5/by_table/qipei_image_access/e0/f2/9b/6c/e0f29b6cb0ae53cecb532e46fb95f09d01ba2e90.jpg,196,"2018-08-16 01:38:06",32,"2018-08-16 01:38:06","F7000-1005007 曲轴止推片 玉柴发动机",何勇,0719-8368258,湖北十堰,贸易,"早 8:00 - 晚 18:00","1 / 件",F7000-1005007,"动力系统 - 玉柴",YC4F90,"English Русский",F7000-1005007,"曲轴止推片 玉柴发动机",4,4,"发动机 - 玉柴发动机","0.095 (kg)",(mm),"动力系统 - 玉柴",YC4F90,QP120官方旗舰店,18971928816
132,"2018-10-11 02:36:24",image/jpeg,898c2946f80cdfce73fb09ed948046d20ef38144,38957,/89/8c/29/46/898c2946f80cdfce73fb09ed948046d20ef38144.jpg,,https://songer.datasn.com/data/api/v1/u_4db7936df78dfe468fc2/qiche_peijian_daquan_5/by_table/qipei_image_access/89/8c/29/46/898c2946f80cdfce73fb09ed948046d20ef38144.jpg,197,"2018-08-16 01:38:07",33,"2018-08-16 01:38:07","F3000-1005001C 曲轴",何勇,0719-8368258,湖北十堰,贸易,"早 8:00 - 晚 18:00","1 / 件",F3000-1005001C,"动力系统 - 玉柴",YC4F90,"English Русский",F3000-1005001C,曲轴,1,1,"发动机 - 玉柴发动机","31.50 (kg)",(mm),"动力系统 - 玉柴",YC4F90,QP120官方旗舰店,18971928816
133,"2018-10-11 02:36:26",image/jpeg,b4369da69d4b07ea0279d078011cbfccea35d055,36088,/b4/36/9d/a6/b4369da69d4b07ea0279d078011cbfccea35d055.jpg,,https://songer.datasn.com/data/api/v1/u_4db7936df78dfe468fc2/qiche_peijian_daquan_5/by_table/qipei_image_access/b4/36/9d/a6/b4369da69d4b07ea0279d078011cbfccea35d055.jpg,198,"2018-08-16 01:38:07",33,"2018-08-16 01:38:07","F3000-1005001C 曲轴",何勇,0719-8368258,湖北十堰,贸易,"早 8:00 - 晚 18:00","1 / 件",F3000-1005001C,"动力系统 - 玉柴",YC4F90,"English Русский",F3000-1005001C,曲轴,1,1,"发动机 - 玉柴发动机","31.50 (kg)",(mm),"动力系统 - 玉柴",YC4F90,QP120官方旗舰店,18971928816
134,"2018-10-11 02:36:30",image/jpeg,b4488a173ac4b78d61d74a64e556918571e4aebd,31580,/b4/48/8a/17/b4488a173ac4b78d61d74a64e556918571e4aebd.jpg,,https://songer.datasn.com/data/api/v1/u_4db7936df78dfe468fc2/qiche_peijian_daquan_5/by_table/qipei_image_access/b4/48/8a/17/b4488a173ac4b78d61d74a64e556918571e4aebd.jpg,199,"2018-08-16 01:38:07",33,"2018-08-16 01:38:07","F3000-1005001C 曲轴",何勇,0719-8368258,湖北十堰,贸易,"早 8:00 - 晚 18:00","1 / 件",F3000-1005001C,"动力系统 - 玉柴",YC4F90,"English Русский",F3000-1005001C,曲轴,1,1,"发动机 - 玉柴发动机","31.50 (kg)",(mm),"动力系统 - 玉柴",YC4F90,QP120官方旗舰店,18971928816
135,"2018-10-11 02:36:30",image/jpeg,df2254b793593de4a1261867e159923934cc84e5,56724,/df/22/54/b7/df2254b793593de4a1261867e159923934cc84e5.jpg,,https://songer.datasn.com/data/api/v1/u_4db7936df78dfe468fc2/qiche_peijian_daquan_5/by_table/qipei_image_access/df/22/54/b7/df2254b793593de4a1261867e159923934cc84e5.jpg,200,"2018-08-16 01:38:07",33,"2018-08-16 01:38:07","F3000-1005001C 曲轴",何勇,0719-8368258,湖北十堰,贸易,"早 8:00 - 晚 18:00","1 / 件",F3000-1005001C,"动力系统 - 玉柴",YC4F90,"English Русский",F3000-1005001C,曲轴,1,1,"发动机 - 玉柴发动机","31.50 (kg)",(mm),"动力系统 - 玉柴",YC4F90,QP120官方旗舰店,18971928816
136,"2018-10-11 02:36:34",image/jpeg,e9abee7d3dd68f26fa9ff4bfb431280b830f08e7,61794,/e9/ab/ee/7d/e9abee7d3dd68f26fa9ff4bfb431280b830f08e7.jpg,,https://songer.datasn.com/data/api/v1/u_4db7936df78dfe468fc2/qiche_peijian_daquan_5/by_table/qipei_image_access/e9/ab/ee/7d/e9abee7d3dd68f26fa9ff4bfb431280b830f08e7.jpg,201,"2018-08-16 01:38:08",34,"2018-08-16 01:38:08","F7000-1005005A 主轴瓦组件",何勇,0719-8368258,湖北十堰,贸易,"早 8:00 - 晚 18:00","1 / 套",F7000-1005005A,"动力系统 - 玉柴",YC4F90,"English Русский",F7000-1005005A,主轴瓦组件,1,1,"发动机 - 玉柴发动机","0.51 (kg)",(mm),"动力系统 - 玉柴",YC4F90,QP120官方旗舰店,18971928816
137,"2018-10-11 02:36:39",image/jpeg,15411a99c85e69cc95337b9cacfe9d9734e4186b,35903,/15/41/1a/99/15411a99c85e69cc95337b9cacfe9d9734e4186b.jpg,,https://songer.datasn.com/data/api/v1/u_4db7936df78dfe468fc2/qiche_peijian_daquan_5/by_table/qipei_image_access/15/41/1a/99/15411a99c85e69cc95337b9cacfe9d9734e4186b.jpg,202,"2018-08-16 01:38:08",34,"2018-08-16 01:38:08","F7000-1005005A 主轴瓦组件",何勇,0719-8368258,湖北十堰,贸易,"早 8:00 - 晚 18:00","1 / 套",F7000-1005005A,"动力系统 - 玉柴",YC4F90,"English Русский",F7000-1005005A,主轴瓦组件,1,1,"发动机 - 玉柴发动机","0.51 (kg)",(mm),"动力系统 - 玉柴",YC4F90,QP120官方旗舰店,18971928816
138,"2018-10-11 02:36:41",image/jpeg,9f5a7637a0a543dc9ae454b22f80a00292cd731c,67192,/9f/5a/76/37/9f5a7637a0a543dc9ae454b22f80a00292cd731c.jpg,,https://songer.datasn.com/data/api/v1/u_4db7936df78dfe468fc2/qiche_peijian_daquan_5/by_table/qipei_image_access/9f/5a/76/37/9f5a7637a0a543dc9ae454b22f80a00292cd731c.jpg,203,"2018-08-16 01:38:08",34,"2018-08-16 01:38:08","F7000-1005005A 主轴瓦组件",何勇,0719-8368258,湖北十堰,贸易,"早 8:00 - 晚 18:00","1 / 套",F7000-1005005A,"动力系统 - 玉柴",YC4F90,"English Русский",F7000-1005005A,主轴瓦组件,1,1,"发动机 - 玉柴发动机","0.51 (kg)",(mm),"动力系统 - 玉柴",YC4F90,QP120官方旗舰店,18971928816
139,"2018-10-11 02:36:45",image/jpeg,4336cb85c261ed628b07ba955fc1a4c84a994fef,34838,/43/36/cb/85/4336cb85c261ed628b07ba955fc1a4c84a994fef.jpg,,https://songer.datasn.com/data/api/v1/u_4db7936df78dfe468fc2/qiche_peijian_daquan_5/by_table/qipei_image_access/43/36/cb/85/4336cb85c261ed628b07ba955fc1a4c84a994fef.jpg,204,"2018-08-16 01:38:09",35,"2018-08-16 01:38:09","F3400-1005140B 扭振减振器",何勇,0719-8368258,湖北十堰,贸易,"早 8:00 - 晚 18:00","1 / 件",F3400-1005140B,"动力系统 - 玉柴",YC4F90,"English Русский",F3400-1005140B,扭振减振器,1,1,"发动机 - 玉柴发动机","2.155 (kg)",(mm),"动力系统 - 玉柴",YC4F90,QP120官方旗舰店,18971928816