qipei_image.id,qipei_image.ts,qipei_image.source_content_type,qipei_image.hash_file_content,qipei_image.size,qipei_image.path,qipei_image.title,qipei_image.access,image.id,image.ts,qiche_peijian.id,qiche_peijian.ts,qiche_peijian.title,qiche_peijian.lianxiren,qiche_peijian.lianxi_dianhua,qiche_peijian.suozai_diqu,qiche_peijian.qiye_leixing,qiche_peijian.gongzuo_shijian,qiche_peijian.qidingliang,qiche_peijian.xinghao,qiche_peijian.pinpai,qiche_peijian.shiyong,qiche_peijian.yuyan,qiche_peijian.chanpin_xinghao,qiche_peijian.chanpin_mingcheng,qiche_peijian.yongliang,qiche_peijian.baozhuang_shuliang,qiche_peijian.zhuji_yingyong,qiche_peijian.chanpin_maozhong,qiche_peijian.guige,qiche_peijian.chandi_pinpai,qiche_peijian.shiyong_jixing,qiche_peijian.shangjia,qiche_peijian.dizhi
201,"2018-10-11 02:39:06",image/jpeg,51713d28a3ad8232504ed99ee4488c7bf6d651d0,59888,/51/71/3d/28/51713d28a3ad8232504ed99ee4488c7bf6d651d0.jpg,,https://songer.datasn.com/data/api/v1/u_4db7936df78dfe468fc2/qiche_peijian_daquan_5/by_table/qipei_image_access/51/71/3d/28/51713d28a3ad8232504ed99ee4488c7bf6d651d0.jpg,266,"2018-08-16 01:39:01",53,"2018-08-16 01:39:01","530-1004019 连杆瓦",何勇,0719-8368258,湖北十堰,贸易,"早 8:00 - 晚 18:00","1 / 组",530-1004019,"动力系统 - 玉柴",YC4E140,"English Русский",530-1004019,连杆瓦,1,1,"发动机 - 玉柴发动机","0.55 (kg)",(mm),"动力系统 - 玉柴",YC4E140,QP120官方旗舰店,18971928816
202,"2018-10-11 02:39:10",image/jpeg,ede1bb6bbb35d0efc0329b5789e89c4f7e072c1e,63067,/ed/e1/bb/6b/ede1bb6bbb35d0efc0329b5789e89c4f7e072c1e.jpg,,https://songer.datasn.com/data/api/v1/u_4db7936df78dfe468fc2/qiche_peijian_daquan_5/by_table/qipei_image_access/ed/e1/bb/6b/ede1bb6bbb35d0efc0329b5789e89c4f7e072c1e.jpg,267,"2018-08-16 01:39:01",53,"2018-08-16 01:39:01","530-1004019 连杆瓦",何勇,0719-8368258,湖北十堰,贸易,"早 8:00 - 晚 18:00","1 / 组",530-1004019,"动力系统 - 玉柴",YC4E140,"English Русский",530-1004019,连杆瓦,1,1,"发动机 - 玉柴发动机","0.55 (kg)",(mm),"动力系统 - 玉柴",YC4E140,QP120官方旗舰店,18971928816
203,"2018-10-11 02:39:10",image/jpeg,587e9619827982a3a556bdf6a5163e2177a0442c,64225,/58/7e/96/19/587e9619827982a3a556bdf6a5163e2177a0442c.jpg,,https://songer.datasn.com/data/api/v1/u_4db7936df78dfe468fc2/qiche_peijian_daquan_5/by_table/qipei_image_access/58/7e/96/19/587e9619827982a3a556bdf6a5163e2177a0442c.jpg,268,"2018-08-16 01:39:01",53,"2018-08-16 01:39:01","530-1004019 连杆瓦",何勇,0719-8368258,湖北十堰,贸易,"早 8:00 - 晚 18:00","1 / 组",530-1004019,"动力系统 - 玉柴",YC4E140,"English Русский",530-1004019,连杆瓦,1,1,"发动机 - 玉柴发动机","0.55 (kg)",(mm),"动力系统 - 玉柴",YC4E140,QP120官方旗舰店,18971928816
204,"2018-10-11 02:39:12",image/jpeg,607fc4fd3668933cc2c434eba3816a7e796f7737,42571,/60/7f/c4/fd/607fc4fd3668933cc2c434eba3816a7e796f7737.jpg,,https://songer.datasn.com/data/api/v1/u_4db7936df78dfe468fc2/qiche_peijian_daquan_5/by_table/qipei_image_access/60/7f/c4/fd/607fc4fd3668933cc2c434eba3816a7e796f7737.jpg,269,"2018-08-16 01:39:02",54,"2018-08-16 01:39:02","C4891179 康明斯连杆螺栓",何勇,0719-8368258,湖北十堰,贸易,"早 8:00 - 晚 18:00","1 / 件",C4891179,"动力系统 - 康明斯","4BT/6BT 6L/ISL/QSL","English Русский",C4891179,康明斯连杆螺栓,12,6,"发动机 - 康明斯",(kg),(mm),"动力系统 - 康明斯","4BT/6BT 6L/ISL/QSL",QP120官方旗舰店,18971928816
205,"2018-10-11 02:39:13",image/jpeg,84eada9538307c4e2a5517d739d5e38766ddb8e0,31000,/84/ea/da/95/84eada9538307c4e2a5517d739d5e38766ddb8e0.jpg,,https://songer.datasn.com/data/api/v1/u_4db7936df78dfe468fc2/qiche_peijian_daquan_5/by_table/qipei_image_access/84/ea/da/95/84eada9538307c4e2a5517d739d5e38766ddb8e0.jpg,270,"2018-08-16 01:39:02",54,"2018-08-16 01:39:02","C4891179 康明斯连杆螺栓",何勇,0719-8368258,湖北十堰,贸易,"早 8:00 - 晚 18:00","1 / 件",C4891179,"动力系统 - 康明斯","4BT/6BT 6L/ISL/QSL","English Русский",C4891179,康明斯连杆螺栓,12,6,"发动机 - 康明斯",(kg),(mm),"动力系统 - 康明斯","4BT/6BT 6L/ISL/QSL",QP120官方旗舰店,18971928816
206,"2018-10-11 02:39:17",image/jpeg,72d2c550c0dc9578acea43a405f6e782fcba06c6,41250,/72/d2/c5/50/72d2c550c0dc9578acea43a405f6e782fcba06c6.jpg,,https://songer.datasn.com/data/api/v1/u_4db7936df78dfe468fc2/qiche_peijian_daquan_5/by_table/qipei_image_access/72/d2/c5/50/72d2c550c0dc9578acea43a405f6e782fcba06c6.jpg,271,"2018-08-16 01:39:02",54,"2018-08-16 01:39:02","C4891179 康明斯连杆螺栓",何勇,0719-8368258,湖北十堰,贸易,"早 8:00 - 晚 18:00","1 / 件",C4891179,"动力系统 - 康明斯","4BT/6BT 6L/ISL/QSL","English Русский",C4891179,康明斯连杆螺栓,12,6,"发动机 - 康明斯",(kg),(mm),"动力系统 - 康明斯","4BT/6BT 6L/ISL/QSL",QP120官方旗舰店,18971928816
207,"2018-10-11 02:39:17",image/jpeg,3183767244ae33bfea6244173e5cdaca4e0d30a5,39295,/31/83/76/72/3183767244ae33bfea6244173e5cdaca4e0d30a5.jpg,,https://songer.datasn.com/data/api/v1/u_4db7936df78dfe468fc2/qiche_peijian_daquan_5/by_table/qipei_image_access/31/83/76/72/3183767244ae33bfea6244173e5cdaca4e0d30a5.jpg,272,"2018-08-16 01:39:04",55,"2018-08-16 01:39:04","C4943979 康明斯连杆总成东风EQB180发动机",何勇,0719-8368258,湖北十堰,贸易,"早 8:00 - 晚 18:00","1 / 件",C4943979,"动力系统 - 康明斯","4BT/6BT K19/K38/K50","English Русский",C4943979,康明斯连杆总成东风EQB180发动机,6,1,"发动机 - 康明斯","2.05 (kg)",(mm),"动力系统 - 康明斯","4BT/6BT K19/K38/K50",QP120官方旗舰店,18971928816
208,"2018-10-11 02:39:19",image/jpeg,cb9f9a11e25be30a7d6c26d6c59a72f912c2d535,30442,/cb/9f/9a/11/cb9f9a11e25be30a7d6c26d6c59a72f912c2d535.jpg,,https://songer.datasn.com/data/api/v1/u_4db7936df78dfe468fc2/qiche_peijian_daquan_5/by_table/qipei_image_access/cb/9f/9a/11/cb9f9a11e25be30a7d6c26d6c59a72f912c2d535.jpg,273,"2018-08-16 01:39:04",55,"2018-08-16 01:39:04","C4943979 康明斯连杆总成东风EQB180发动机",何勇,0719-8368258,湖北十堰,贸易,"早 8:00 - 晚 18:00","1 / 件",C4943979,"动力系统 - 康明斯","4BT/6BT K19/K38/K50","English Русский",C4943979,康明斯连杆总成东风EQB180发动机,6,1,"发动机 - 康明斯","2.05 (kg)",(mm),"动力系统 - 康明斯","4BT/6BT K19/K38/K50",QP120官方旗舰店,18971928816
209,"2018-10-11 02:39:21",image/jpeg,8f75aa9e0df755524b7522717a7a33d79a459b4a,39157,/8f/75/aa/9e/8f75aa9e0df755524b7522717a7a33d79a459b4a.jpg,,https://songer.datasn.com/data/api/v1/u_4db7936df78dfe468fc2/qiche_peijian_daquan_5/by_table/qipei_image_access/8f/75/aa/9e/8f75aa9e0df755524b7522717a7a33d79a459b4a.jpg,274,"2018-08-16 01:39:04",55,"2018-08-16 01:39:04","C4943979 康明斯连杆总成东风EQB180发动机",何勇,0719-8368258,湖北十堰,贸易,"早 8:00 - 晚 18:00","1 / 件",C4943979,"动力系统 - 康明斯","4BT/6BT K19/K38/K50","English Русский",C4943979,康明斯连杆总成东风EQB180发动机,6,1,"发动机 - 康明斯","2.05 (kg)",(mm),"动力系统 - 康明斯","4BT/6BT K19/K38/K50",QP120官方旗舰店,18971928816
210,"2018-10-11 02:39:25",image/jpeg,efc1024e16acf85a9b63937635deca38c1fb91eb,31848,/ef/c1/02/4e/efc1024e16acf85a9b63937635deca38c1fb91eb.jpg,,https://songer.datasn.com/data/api/v1/u_4db7936df78dfe468fc2/qiche_peijian_daquan_5/by_table/qipei_image_access/ef/c1/02/4e/efc1024e16acf85a9b63937635deca38c1fb91eb.jpg,275,"2018-08-16 01:39:04",55,"2018-08-16 01:39:04","C4943979 康明斯连杆总成东风EQB180发动机",何勇,0719-8368258,湖北十堰,贸易,"早 8:00 - 晚 18:00","1 / 件",C4943979,"动力系统 - 康明斯","4BT/6BT K19/K38/K50","English Русский",C4943979,康明斯连杆总成东风EQB180发动机,6,1,"发动机 - 康明斯","2.05 (kg)",(mm),"动力系统 - 康明斯","4BT/6BT K19/K38/K50",QP120官方旗舰店,18971928816
211,"2018-10-11 02:39:28",image/jpeg,5dd4d5d988e7f788209c6b54c8971f445644ff18,29930,/5d/d4/d5/d9/5dd4d5d988e7f788209c6b54c8971f445644ff18.jpg,,https://songer.datasn.com/data/api/v1/u_4db7936df78dfe468fc2/qiche_peijian_daquan_5/by_table/qipei_image_access/5d/d4/d5/d9/5dd4d5d988e7f788209c6b54c8971f445644ff18.jpg,276,"2018-08-16 01:39:04",55,"2018-08-16 01:39:04","C4943979 康明斯连杆总成东风EQB180发动机",何勇,0719-8368258,湖北十堰,贸易,"早 8:00 - 晚 18:00","1 / 件",C4943979,"动力系统 - 康明斯","4BT/6BT K19/K38/K50","English Русский",C4943979,康明斯连杆总成东风EQB180发动机,6,1,"发动机 - 康明斯","2.05 (kg)",(mm),"动力系统 - 康明斯","4BT/6BT K19/K38/K50",QP120官方旗舰店,18971928816
212,"2018-10-11 02:39:32",image/jpeg,15de800d44da992909a97882ad044fec662856f4,33506,/15/de/80/0d/15de800d44da992909a97882ad044fec662856f4.jpg,,https://songer.datasn.com/data/api/v1/u_4db7936df78dfe468fc2/qiche_peijian_daquan_5/by_table/qipei_image_access/15/de/80/0d/15de800d44da992909a97882ad044fec662856f4.jpg,277,"2018-08-16 01:39:04",55,"2018-08-16 01:39:04","C4943979 康明斯连杆总成东风EQB180发动机",何勇,0719-8368258,湖北十堰,贸易,"早 8:00 - 晚 18:00","1 / 件",C4943979,"动力系统 - 康明斯","4BT/6BT K19/K38/K50","English Русский",C4943979,康明斯连杆总成东风EQB180发动机,6,1,"发动机 - 康明斯","2.05 (kg)",(mm),"动力系统 - 康明斯","4BT/6BT K19/K38/K50",QP120官方旗舰店,18971928816
213,"2018-10-11 02:39:32",image/jpeg,da99332cd8376cc87caba647ff38b942995e3ecb,29061,/da/99/33/2c/da99332cd8376cc87caba647ff38b942995e3ecb.jpg,,https://songer.datasn.com/data/api/v1/u_4db7936df78dfe468fc2/qiche_peijian_daquan_5/by_table/qipei_image_access/da/99/33/2c/da99332cd8376cc87caba647ff38b942995e3ecb.jpg,278,"2018-08-16 01:39:04",55,"2018-08-16 01:39:04","C4943979 康明斯连杆总成东风EQB180发动机",何勇,0719-8368258,湖北十堰,贸易,"早 8:00 - 晚 18:00","1 / 件",C4943979,"动力系统 - 康明斯","4BT/6BT K19/K38/K50","English Русский",C4943979,康明斯连杆总成东风EQB180发动机,6,1,"发动机 - 康明斯","2.05 (kg)",(mm),"动力系统 - 康明斯","4BT/6BT K19/K38/K50",QP120官方旗舰店,18971928816
214,"2018-10-11 02:39:34",image/jpeg,2257a9f98d4395ea11c3c82847c8a501650991a9,63280,/22/57/a9/f9/2257a9f98d4395ea11c3c82847c8a501650991a9.jpg,,https://songer.datasn.com/data/api/v1/u_4db7936df78dfe468fc2/qiche_peijian_daquan_5/by_table/qipei_image_access/22/57/a9/f9/2257a9f98d4395ea11c3c82847c8a501650991a9.jpg,279,"2018-08-16 01:39:04",55,"2018-08-16 01:39:04","C4943979 康明斯连杆总成东风EQB180发动机",何勇,0719-8368258,湖北十堰,贸易,"早 8:00 - 晚 18:00","1 / 件",C4943979,"动力系统 - 康明斯","4BT/6BT K19/K38/K50","English Русский",C4943979,康明斯连杆总成东风EQB180发动机,6,1,"发动机 - 康明斯","2.05 (kg)",(mm),"动力系统 - 康明斯","4BT/6BT K19/K38/K50",QP120官方旗舰店,18971928816
215,"2018-10-11 02:39:38",image/jpeg,8876efab82ae7f2a04c4723e878d4de0062c2c19,48645,/88/76/ef/ab/8876efab82ae7f2a04c4723e878d4de0062c2c19.jpg,,https://songer.datasn.com/data/api/v1/u_4db7936df78dfe468fc2/qiche_peijian_daquan_5/by_table/qipei_image_access/88/76/ef/ab/8876efab82ae7f2a04c4723e878d4de0062c2c19.jpg,280,"2018-08-16 01:39:05",56,"2018-08-16 01:39:05","FA100-1004005 连杆瓦",何勇,0719-8368258,湖北十堰,贸易,"早 8:00 - 晚 18:00","1 / 件",FA100-1004005,"动力系统 - 玉柴",YC4F90,"English Русский",FA100-1004005,连杆瓦,1,1,"发动机 - 玉柴发动机","0.325 (kg)",(mm),"动力系统 - 玉柴",YC4F90,QP120官方旗舰店,18971928816
216,"2018-10-11 02:39:41",image/jpeg,0932259c90481581f0be08f99f597f4315f2ee93,33690,/09/32/25/9c/0932259c90481581f0be08f99f597f4315f2ee93.jpg,,https://songer.datasn.com/data/api/v1/u_4db7936df78dfe468fc2/qiche_peijian_daquan_5/by_table/qipei_image_access/09/32/25/9c/0932259c90481581f0be08f99f597f4315f2ee93.jpg,281,"2018-08-16 01:39:05",56,"2018-08-16 01:39:05","FA100-1004005 连杆瓦",何勇,0719-8368258,湖北十堰,贸易,"早 8:00 - 晚 18:00","1 / 件",FA100-1004005,"动力系统 - 玉柴",YC4F90,"English Русский",FA100-1004005,连杆瓦,1,1,"发动机 - 玉柴发动机","0.325 (kg)",(mm),"动力系统 - 玉柴",YC4F90,QP120官方旗舰店,18971928816
217,"2018-10-11 02:39:45",image/jpeg,bf7c1a864b5843f470fc89ee6c65b0cf522ae48d,57349,/bf/7c/1a/86/bf7c1a864b5843f470fc89ee6c65b0cf522ae48d.jpg,,https://songer.datasn.com/data/api/v1/u_4db7936df78dfe468fc2/qiche_peijian_daquan_5/by_table/qipei_image_access/bf/7c/1a/86/bf7c1a864b5843f470fc89ee6c65b0cf522ae48d.jpg,282,"2018-08-16 01:39:05",56,"2018-08-16 01:39:05","FA100-1004005 连杆瓦",何勇,0719-8368258,湖北十堰,贸易,"早 8:00 - 晚 18:00","1 / 件",FA100-1004005,"动力系统 - 玉柴",YC4F90,"English Русский",FA100-1004005,连杆瓦,1,1,"发动机 - 玉柴发动机","0.325 (kg)",(mm),"动力系统 - 玉柴",YC4F90,QP120官方旗舰店,18971928816
218,"2018-10-11 02:39:45",image/jpeg,64b53d1c28a7462dd50ae843dc8234040e0e9c37,33673,/64/b5/3d/1c/64b53d1c28a7462dd50ae843dc8234040e0e9c37.jpg,,https://songer.datasn.com/data/api/v1/u_4db7936df78dfe468fc2/qiche_peijian_daquan_5/by_table/qipei_image_access/64/b5/3d/1c/64b53d1c28a7462dd50ae843dc8234040e0e9c37.jpg,283,"2018-08-16 01:39:06",57,"2018-08-16 01:39:06","FA100-1004200A 连杆总成",何勇,0719-8368258,湖北十堰,贸易,"早 8:00 - 晚 18:00","1 / 件",FA100-1004200A,"动力系统 - 玉柴",YC4F90,"English Русский",FA100-1004200A,连杆总成,4,4,"发动机 - 玉柴发动机","1.285 (kg)",(mm),"动力系统 - 玉柴",YC4F90,QP120官方旗舰店,18971928816
219,"2018-10-11 02:39:46",image/jpeg,23fc93938e374a9219846ce8982b95cb389e536b,29883,/23/fc/93/93/23fc93938e374a9219846ce8982b95cb389e536b.jpg,,https://songer.datasn.com/data/api/v1/u_4db7936df78dfe468fc2/qiche_peijian_daquan_5/by_table/qipei_image_access/23/fc/93/93/23fc93938e374a9219846ce8982b95cb389e536b.jpg,284,"2018-08-16 01:39:06",57,"2018-08-16 01:39:06","FA100-1004200A 连杆总成",何勇,0719-8368258,湖北十堰,贸易,"早 8:00 - 晚 18:00","1 / 件",FA100-1004200A,"动力系统 - 玉柴",YC4F90,"English Русский",FA100-1004200A,连杆总成,4,4,"发动机 - 玉柴发动机","1.285 (kg)",(mm),"动力系统 - 玉柴",YC4F90,QP120官方旗舰店,18971928816
220,"2018-10-11 02:39:50",image/jpeg,10f78df71904ad51b8ac4d071bd4e1910dda216e,29508,/10/f7/8d/f7/10f78df71904ad51b8ac4d071bd4e1910dda216e.jpg,,https://songer.datasn.com/data/api/v1/u_4db7936df78dfe468fc2/qiche_peijian_daquan_5/by_table/qipei_image_access/10/f7/8d/f7/10f78df71904ad51b8ac4d071bd4e1910dda216e.jpg,285,"2018-08-16 01:39:06",57,"2018-08-16 01:39:06","FA100-1004200A 连杆总成",何勇,0719-8368258,湖北十堰,贸易,"早 8:00 - 晚 18:00","1 / 件",FA100-1004200A,"动力系统 - 玉柴",YC4F90,"English Русский",FA100-1004200A,连杆总成,4,4,"发动机 - 玉柴发动机","1.285 (kg)",(mm),"动力系统 - 玉柴",YC4F90,QP120官方旗舰店,18971928816
221,"2018-10-11 02:39:51",image/jpeg,8d66a38ca251a09bb93d231cbf06655d43549c7c,68937,/8d/66/a3/8c/8d66a38ca251a09bb93d231cbf06655d43549c7c.jpg,,https://songer.datasn.com/data/api/v1/u_4db7936df78dfe468fc2/qiche_peijian_daquan_5/by_table/qipei_image_access/8d/66/a3/8c/8d66a38ca251a09bb93d231cbf06655d43549c7c.jpg,286,"2018-08-16 01:39:06",57,"2018-08-16 01:39:06","FA100-1004200A 连杆总成",何勇,0719-8368258,湖北十堰,贸易,"早 8:00 - 晚 18:00","1 / 件",FA100-1004200A,"动力系统 - 玉柴",YC4F90,"English Русский",FA100-1004200A,连杆总成,4,4,"发动机 - 玉柴发动机","1.285 (kg)",(mm),"动力系统 - 玉柴",YC4F90,QP120官方旗舰店,18971928816
222,"2018-10-11 02:39:51",image/jpeg,b1c0a3d4f9b06239ac2996423a5864ce98d393c0,30295,/b1/c0/a3/d4/b1c0a3d4f9b06239ac2996423a5864ce98d393c0.jpg,,https://songer.datasn.com/data/api/v1/u_4db7936df78dfe468fc2/qiche_peijian_daquan_5/by_table/qipei_image_access/b1/c0/a3/d4/b1c0a3d4f9b06239ac2996423a5864ce98d393c0.jpg,287,"2018-08-16 01:39:11",58,"2018-08-16 01:39:11","6102.04.10A 连杆结合部",何勇,0719-8368258,湖北十堰,贸易,"早 8:00 - 晚 18:00","1 / 件",6102.04.10A,"动力系统 - 朝柴",4100ZLQ,"English Русский",6102.04.10A,连杆结合部,4,4,"发动机 - 朝柴发动机",(kg),(mm),"动力系统 - 朝柴",4100ZLQ,QP120官方旗舰店,18971928816
223,"2018-10-11 02:39:54",image/jpeg,dbd22c5bac7eb1a10b6063cd9b87670346c280ed,48032,/db/d2/2c/5b/dbd22c5bac7eb1a10b6063cd9b87670346c280ed.jpg,,https://songer.datasn.com/data/api/v1/u_4db7936df78dfe468fc2/qiche_peijian_daquan_5/by_table/qipei_image_access/db/d2/2c/5b/dbd22c5bac7eb1a10b6063cd9b87670346c280ed.jpg,288,"2018-08-16 01:39:13",59,"2018-08-16 01:39:13","【5284537F】 【5284537F】福田康明斯发动机ISF2.8连",陶女士,0719-8287136,湖北十堰,贸易,"早 8:00 - 晚 18:00",1,【5284537F】,,,"English Русский",【5284537F】,【5284537F】福田康明斯发动机ISF2.8连杆瓦,0,0,,(kg),(mm),,,十堰广联贸易有限公司,15972569822
224,"2018-10-11 02:39:55",image/jpeg,dbd22c5bac7eb1a10b6063cd9b87670346c280ed,48032,/db/d2/2c/5b/dbd22c5bac7eb1a10b6063cd9b87670346c280ed.jpg,,https://songer.datasn.com/data/api/v1/u_4db7936df78dfe468fc2/qiche_peijian_daquan_5/by_table/qipei_image_access/db/d2/2c/5b/dbd22c5bac7eb1a10b6063cd9b87670346c280ed.jpg,289,"2018-08-16 01:39:13",59,"2018-08-16 01:39:13","【5284537F】 【5284537F】福田康明斯发动机ISF2.8连",陶女士,0719-8287136,湖北十堰,贸易,"早 8:00 - 晚 18:00",1,【5284537F】,,,"English Русский",【5284537F】,【5284537F】福田康明斯发动机ISF2.8连杆瓦,0,0,,(kg),(mm),,,十堰广联贸易有限公司,15972569822
225,"2018-10-11 02:39:58",image/jpeg,9ed5101d22d8885065dd5a49b946f31e9b60ef0b,57004,/9e/d5/10/1d/9ed5101d22d8885065dd5a49b946f31e9b60ef0b.jpg,,https://songer.datasn.com/data/api/v1/u_4db7936df78dfe468fc2/qiche_peijian_daquan_5/by_table/qipei_image_access/9e/d5/10/1d/9ed5101d22d8885065dd5a49b946f31e9b60ef0b.jpg,290,"2018-08-16 01:39:13",59,"2018-08-16 01:39:13","【5284537F】 【5284537F】福田康明斯发动机ISF2.8连",陶女士,0719-8287136,湖北十堰,贸易,"早 8:00 - 晚 18:00",1,【5284537F】,,,"English Русский",【5284537F】,【5284537F】福田康明斯发动机ISF2.8连杆瓦,0,0,,(kg),(mm),,,十堰广联贸易有限公司,15972569822
226,"2018-10-11 02:40:00",image/jpeg,9ed5101d22d8885065dd5a49b946f31e9b60ef0b,57004,/9e/d5/10/1d/9ed5101d22d8885065dd5a49b946f31e9b60ef0b.jpg,,https://songer.datasn.com/data/api/v1/u_4db7936df78dfe468fc2/qiche_peijian_daquan_5/by_table/qipei_image_access/9e/d5/10/1d/9ed5101d22d8885065dd5a49b946f31e9b60ef0b.jpg,291,"2018-08-16 01:39:15",60,"2018-08-16 01:39:15","【5340181】 【5340181】福田康明斯ISF2.8连杆瓦",陶女士,0719-8287136,湖北十堰,贸易,"早 8:00 - 晚 18:00",1,【5340181】,,,"English Русский",【5340181】,【5340181】福田康明斯ISF2.8连杆瓦,0,0,,(kg),(mm),,,十堰广联贸易有限公司,15972569822
227,"2018-10-11 02:40:01",image/jpeg,dbd22c5bac7eb1a10b6063cd9b87670346c280ed,48032,/db/d2/2c/5b/dbd22c5bac7eb1a10b6063cd9b87670346c280ed.jpg,,https://songer.datasn.com/data/api/v1/u_4db7936df78dfe468fc2/qiche_peijian_daquan_5/by_table/qipei_image_access/db/d2/2c/5b/dbd22c5bac7eb1a10b6063cd9b87670346c280ed.jpg,292,"2018-08-16 01:39:15",60,"2018-08-16 01:39:15","【5340181】 【5340181】福田康明斯ISF2.8连杆瓦",陶女士,0719-8287136,湖北十堰,贸易,"早 8:00 - 晚 18:00",1,【5340181】,,,"English Русский",【5340181】,【5340181】福田康明斯ISF2.8连杆瓦,0,0,,(kg),(mm),,,十堰广联贸易有限公司,15972569822
228,"2018-10-11 02:40:02",image/jpeg,47135d580f0f70d4db3c1f0474c51e89ea823205,52007,/47/13/5d/58/47135d580f0f70d4db3c1f0474c51e89ea823205.jpg,,https://songer.datasn.com/data/api/v1/u_4db7936df78dfe468fc2/qiche_peijian_daquan_5/by_table/qipei_image_access/47/13/5d/58/47135d580f0f70d4db3c1f0474c51e89ea823205.jpg,293,"2018-08-16 01:39:19",61,"2018-08-16 01:39:19","A3960071 康明斯发动机齿轮室4BT 6BT",何勇,0719-8368258,湖北十堰,贸易,"早 8:00 - 晚 18:00","1 / 件",A3960071,"动力系统 - 国泰汽摩",4BT/6BT,"English Русский",A3960071,"康明斯发动机齿轮室4BT 6BT",1,1,"发动机 - 康明斯","3.20 (kg)",(mm),"动力系统 - 国泰汽摩",4BT/6BT,QP120官方旗舰店,18971928816
229,"2018-10-11 02:40:03",image/jpeg,70009846edf4ef43c67e4b882e4e1c25e98030ce,48674,/70/00/98/46/70009846edf4ef43c67e4b882e4e1c25e98030ce.jpg,,https://songer.datasn.com/data/api/v1/u_4db7936df78dfe468fc2/qiche_peijian_daquan_5/by_table/qipei_image_access/70/00/98/46/70009846edf4ef43c67e4b882e4e1c25e98030ce.jpg,294,"2018-08-16 01:39:19",61,"2018-08-16 01:39:19","A3960071 康明斯发动机齿轮室4BT 6BT",何勇,0719-8368258,湖北十堰,贸易,"早 8:00 - 晚 18:00","1 / 件",A3960071,"动力系统 - 国泰汽摩",4BT/6BT,"English Русский",A3960071,"康明斯发动机齿轮室4BT 6BT",1,1,"发动机 - 康明斯","3.20 (kg)",(mm),"动力系统 - 国泰汽摩",4BT/6BT,QP120官方旗舰店,18971928816
230,"2018-10-11 02:40:04",image/jpeg,2382801316c04e9dc3d565b40825f5146871ad5e,61344,/23/82/80/13/2382801316c04e9dc3d565b40825f5146871ad5e.jpg,,https://songer.datasn.com/data/api/v1/u_4db7936df78dfe468fc2/qiche_peijian_daquan_5/by_table/qipei_image_access/23/82/80/13/2382801316c04e9dc3d565b40825f5146871ad5e.jpg,295,"2018-08-16 01:39:19",61,"2018-08-16 01:39:19","A3960071 康明斯发动机齿轮室4BT 6BT",何勇,0719-8368258,湖北十堰,贸易,"早 8:00 - 晚 18:00","1 / 件",A3960071,"动力系统 - 国泰汽摩",4BT/6BT,"English Русский",A3960071,"康明斯发动机齿轮室4BT 6BT",1,1,"发动机 - 康明斯","3.20 (kg)",(mm),"动力系统 - 国泰汽摩",4BT/6BT,QP120官方旗舰店,18971928816
231,"2018-10-11 02:40:07",image/jpeg,d221936e610579764280292f77adf97e9b35dbf6,51568,/d2/21/93/6e/d221936e610579764280292f77adf97e9b35dbf6.jpg,,https://songer.datasn.com/data/api/v1/u_4db7936df78dfe468fc2/qiche_peijian_daquan_5/by_table/qipei_image_access/d2/21/93/6e/d221936e610579764280292f77adf97e9b35dbf6.jpg,296,"2018-08-16 01:39:19",61,"2018-08-16 01:39:19","A3960071 康明斯发动机齿轮室4BT 6BT",何勇,0719-8368258,湖北十堰,贸易,"早 8:00 - 晚 18:00","1 / 件",A3960071,"动力系统 - 国泰汽摩",4BT/6BT,"English Русский",A3960071,"康明斯发动机齿轮室4BT 6BT",1,1,"发动机 - 康明斯","3.20 (kg)",(mm),"动力系统 - 国泰汽摩",4BT/6BT,QP120官方旗舰店,18971928816
232,"2018-10-11 02:40:10",image/jpeg,0b1b6eed511c891795c86528fe634ff0e25de8bb,65968,/0b/1b/6e/ed/0b1b6eed511c891795c86528fe634ff0e25de8bb.jpg,,https://songer.datasn.com/data/api/v1/u_4db7936df78dfe468fc2/qiche_peijian_daquan_5/by_table/qipei_image_access/0b/1b/6e/ed/0b1b6eed511c891795c86528fe634ff0e25de8bb.jpg,297,"2018-08-16 01:39:24",62,"2018-08-16 01:39:24","3104392 3104392特雷克斯装载机配件康明斯QSX15气",陶女士,0719-8287136,湖北十堰,贸易,"早 8:00 - 晚 18:00",1,3104392,,,"English Русский",3104392,3104392特雷克斯装载机配件康明斯QSX15气阀室罩盖垫,0,0,,(kg),(mm),,,十堰广联贸易有限公司,15972569822
233,"2018-10-11 02:40:14",image/jpeg,0b1b6eed511c891795c86528fe634ff0e25de8bb,65968,/0b/1b/6e/ed/0b1b6eed511c891795c86528fe634ff0e25de8bb.jpg,,https://songer.datasn.com/data/api/v1/u_4db7936df78dfe468fc2/qiche_peijian_daquan_5/by_table/qipei_image_access/0b/1b/6e/ed/0b1b6eed511c891795c86528fe634ff0e25de8bb.jpg,298,"2018-08-16 01:39:24",62,"2018-08-16 01:39:24","3104392 3104392特雷克斯装载机配件康明斯QSX15气",陶女士,0719-8287136,湖北十堰,贸易,"早 8:00 - 晚 18:00",1,3104392,,,"English Русский",3104392,3104392特雷克斯装载机配件康明斯QSX15气阀室罩盖垫,0,0,,(kg),(mm),,,十堰广联贸易有限公司,15972569822
234,"2018-10-11 02:40:14",image/jpeg,9cc3c264bd3ab49ac25455bc57bd8496ae4182a6,51969,/9c/c3/c2/64/9cc3c264bd3ab49ac25455bc57bd8496ae4182a6.jpg,,https://songer.datasn.com/data/api/v1/u_4db7936df78dfe468fc2/qiche_peijian_daquan_5/by_table/qipei_image_access/9c/c3/c2/64/9cc3c264bd3ab49ac25455bc57bd8496ae4182a6.jpg,299,"2018-08-16 01:39:24",62,"2018-08-16 01:39:24","3104392 3104392特雷克斯装载机配件康明斯QSX15气",陶女士,0719-8287136,湖北十堰,贸易,"早 8:00 - 晚 18:00",1,3104392,,,"English Русский",3104392,3104392特雷克斯装载机配件康明斯QSX15气阀室罩盖垫,0,0,,(kg),(mm),,,十堰广联贸易有限公司,15972569822
235,"2018-10-11 02:40:14",image/jpeg,12529da552b111d424e44773e35152eae0408f2b,19211,/12/52/9d/a5/12529da552b111d424e44773e35152eae0408f2b.jpg,,https://songer.datasn.com/data/api/v1/u_4db7936df78dfe468fc2/qiche_peijian_daquan_5/by_table/qipei_image_access/12/52/9d/a5/12529da552b111d424e44773e35152eae0408f2b.jpg,300,"2018-08-16 01:39:29",63,"2018-08-16 01:39:29","C5267784 齿轮室",魏笑妃,0719-8311433,湖北十堰,贸易,"早 8:00 - 晚 18:00","1 / 件",C5267784,"发动机 - 康明斯",4BT,"English Русский",C5267784,齿轮室,1,1,"卡车 - 东风汽车",(kg),(mm),"发动机 - 康明斯",4BT,湖北京汉动力科技有限公司,13972463247
236,"2018-10-11 02:40:17",image/jpeg,2cfe9e6eb87d2dd5805aa4f3660f23ec476e3b96,53626,/2c/fe/9e/6e/2cfe9e6eb87d2dd5805aa4f3660f23ec476e3b96.jpg,,https://songer.datasn.com/data/api/v1/u_4db7936df78dfe468fc2/qiche_peijian_daquan_5/by_table/qipei_image_access/2c/fe/9e/6e/2cfe9e6eb87d2dd5805aa4f3660f23ec476e3b96.jpg,301,"2018-08-16 01:39:30",64,"2018-08-16 01:39:30","C4992992 原厂C4992992东风康明斯6CT/6L发动机齿",吕德荣,18772931815,湖北十堰,贸易,"早 8:00 - 晚 18:00","1 / 个",C4992992,"发动机配件 - 康明斯","康明斯 6CT 6L","English Русский",C4992992,原厂C4992992东风康明斯6CT/6L发动机齿轮室,0,0,"卡车 - 东风汽车",(kg),(mm),"发动机配件 - 康明斯","康明斯 6CT 6L",十堰市港峰工贸有限公司,13339855539
237,"2018-10-11 02:40:20",image/jpeg,a9aec0fadb75c62f987145f784616966ff632503,47367,/a9/ae/c0/fa/a9aec0fadb75c62f987145f784616966ff632503.jpg,,https://songer.datasn.com/data/api/v1/u_4db7936df78dfe468fc2/qiche_peijian_daquan_5/by_table/qipei_image_access/a9/ae/c0/fa/a9aec0fadb75c62f987145f784616966ff632503.jpg,302,"2018-08-16 01:39:30",64,"2018-08-16 01:39:30","C4992992 原厂C4992992东风康明斯6CT/6L发动机齿",吕德荣,18772931815,湖北十堰,贸易,"早 8:00 - 晚 18:00","1 / 个",C4992992,"发动机配件 - 康明斯","康明斯 6CT 6L","English Русский",C4992992,原厂C4992992东风康明斯6CT/6L发动机齿轮室,0,0,"卡车 - 东风汽车",(kg),(mm),"发动机配件 - 康明斯","康明斯 6CT 6L",十堰市港峰工贸有限公司,13339855539
238,"2018-10-11 02:40:23",image/jpeg,613b6859687abf5f556dc8387e8d3fc5807f8dd3,58920,/61/3b/68/59/613b6859687abf5f556dc8387e8d3fc5807f8dd3.jpg,,https://songer.datasn.com/data/api/v1/u_4db7936df78dfe468fc2/qiche_peijian_daquan_5/by_table/qipei_image_access/61/3b/68/59/613b6859687abf5f556dc8387e8d3fc5807f8dd3.jpg,303,"2018-08-16 01:39:30",64,"2018-08-16 01:39:30","C4992992 原厂C4992992东风康明斯6CT/6L发动机齿",吕德荣,18772931815,湖北十堰,贸易,"早 8:00 - 晚 18:00","1 / 个",C4992992,"发动机配件 - 康明斯","康明斯 6CT 6L","English Русский",C4992992,原厂C4992992东风康明斯6CT/6L发动机齿轮室,0,0,"卡车 - 东风汽车",(kg),(mm),"发动机配件 - 康明斯","康明斯 6CT 6L",十堰市港峰工贸有限公司,13339855539
239,"2018-10-11 02:40:23",image/jpeg,f595bd45ea52a1111fc2734c60e2f98936892e50,50973,/f5/95/bd/45/f595bd45ea52a1111fc2734c60e2f98936892e50.jpg,,https://songer.datasn.com/data/api/v1/u_4db7936df78dfe468fc2/qiche_peijian_daquan_5/by_table/qipei_image_access/f5/95/bd/45/f595bd45ea52a1111fc2734c60e2f98936892e50.jpg,304,"2018-08-16 01:39:30",64,"2018-08-16 01:39:30","C4992992 原厂C4992992东风康明斯6CT/6L发动机齿",吕德荣,18772931815,湖北十堰,贸易,"早 8:00 - 晚 18:00","1 / 个",C4992992,"发动机配件 - 康明斯","康明斯 6CT 6L","English Русский",C4992992,原厂C4992992东风康明斯6CT/6L发动机齿轮室,0,0,"卡车 - 东风汽车",(kg),(mm),"发动机配件 - 康明斯","康明斯 6CT 6L",十堰市港峰工贸有限公司,13339855539