qiche_peijian.id,qiche_peijian.ts,qiche_peijian.title,qiche_peijian.bianma,qiche_peijian.shiyong_chexing,qiche_peijian.danwei,qiche_peijian.jianjie,qiche_peijian.shiyong_chexi,qiche_peijian.guige,qiche_peijian.tuhao,qiche_peijian.lingshoujia,qiche_peijian.shengshi,qiche_peijian.qiye_leixing,qiche_peijian.shangji,qiche_peijian.lianxi_dianhua,qiche_peijian.lianxiren,qiche_peijian.lianxi_dizhi
101,"2018-10-11 03:17:18",发电机真空泵,1468,瑞玲皮卡,襄阳市永鑫汽配,,JAC,个,,,湖北-襄阳,汽配商,襄阳市永鑫汽配,07103493468,童丽萍,襄阳市光彩汽配城12栋112号
102,"2018-10-11 03:17:37",水泵,1027110GD050,瑞风S5,襄阳市永鑫汽配,,JAC,个,,,湖北-襄阳,汽配商,襄阳市永鑫汽配,07103493468,童丽萍,襄阳市光彩汽配城12栋112号
103,"2018-10-11 03:17:55",刹车总泵（大孔）,46010-JN02AA,08TL,襄阳市永鑫汽配,,东风日产,个,,,湖北-襄阳,汽配商,襄阳市永鑫汽配,07103493468,童丽萍,襄阳市光彩汽配城12栋112号
104,"2018-10-11 03:18:14",汽油泵密封圈,17342-79900Z,YDQD,襄阳市永鑫汽配,,东风日产,个,,,湖北-襄阳,汽配商,襄阳市永鑫汽配,07103493468,童丽萍,襄阳市光彩汽配城12栋112号
105,"2018-10-11 03:18:33",汽油泵密封圈,17342-79900,YDQD,襄阳市永鑫汽配,,东风日产,个,,,湖北-襄阳,汽配商,襄阳市永鑫汽配,07103493468,童丽萍,襄阳市光彩汽配城12栋112号
106,"2018-10-11 03:18:48",助力泵油壶铁,49180-P2700,P27,襄阳市永鑫汽配,,郑州日产,个,,,湖北-襄阳,汽配商,襄阳市永鑫汽配,07103493468,童丽萍,襄阳市光彩汽配城12栋112号
107,"2018-10-11 03:19:07",离合器总泵,30610-V0100F,帅克1.,襄阳市永鑫汽配,,郑州日产,个,,,湖北-襄阳,汽配商,襄阳市永鑫汽配,07103493468,童丽萍,襄阳市光彩汽配城12栋112号
108,"2018-10-11 03:19:26","水管 水泵进水管",DAMD365545,风行4G,襄阳市永鑫汽配,,东风风行,个,,,湖北-襄阳,汽配商,襄阳市永鑫汽配,07103493468,童丽萍,襄阳市光彩汽配城12栋112号
109,"2018-10-11 03:19:45",压缩机泵头,92660-3DN0A,11骐达,襄阳市永鑫汽配,,东风日产,个,,,湖北-襄阳,汽配商,襄阳市永鑫汽配,07103493468,童丽萍,襄阳市光彩汽配城12栋112号
110,"2018-10-11 03:20:01",助力泵,S0335,瑞风2.,襄阳市永鑫汽配,,JAC,个,,,湖北-襄阳,汽配商,襄阳市永鑫汽配,07103493468,童丽萍,襄阳市光彩汽配城12栋112号
111,"2018-10-11 03:20:16",机油泵,21181-60155,悦悦,襄阳市永鑫汽配,,JAC,个,,,湖北-襄阳,汽配商,襄阳市永鑫汽配,07103493468,童丽萍,襄阳市光彩汽配城12栋112号
112,"2018-10-11 03:20:34","刹车总泵 TA",D6010-3DF3A,11骐达,襄阳市永鑫汽配,,东风日产,个,,,湖北-襄阳,汽配商,襄阳市永鑫汽配,07103493468,童丽萍,襄阳市光彩汽配城12栋112号
113,"2018-10-11 03:20:49","刹车总泵 TM",D6010-3DF2A,11骐达,襄阳市永鑫汽配,,东风日产,个,,,湖北-襄阳,汽配商,襄阳市永鑫汽配,07103493468,童丽萍,襄阳市光彩汽配城12栋112号
114,"2018-10-11 03:21:08",刹车分泵前左,3001001,帅克,襄阳市永鑫汽配,,郑州日产,个,,,湖北-襄阳,汽配商,襄阳市永鑫汽配,07103493468,童丽萍,襄阳市光彩汽配城12栋112号
115,"2018-10-11 03:21:24",刹车分泵前右,3001002-,帅克,襄阳市永鑫汽配,,东风日产,个,,,湖北-襄阳,汽配商,襄阳市永鑫汽配,07103493468,童丽萍,襄阳市光彩汽配城12栋112号
116,"2018-10-11 03:21:42",水泵,D185,ZD25,襄阳市永鑫汽配,,郑州日产,个,,,湖北-襄阳,汽配商,襄阳市永鑫汽配,07103493468,童丽萍,襄阳市光彩汽配城12栋112号
117,"2018-10-11 03:22:01",刹车分泵/右后,B-3502140,风行景逸,襄阳市永鑫汽配,,东风风行,个,,,湖北-襄阳,汽配商,襄阳市永鑫汽配,07103493468,童丽萍,襄阳市光彩汽配城12栋112号
118,"2018-10-11 03:22:21",离合器分泵,R5M23D-SMR98,风行凌智,襄阳市永鑫汽配,,东风风行,个,,,湖北-襄阳,汽配商,襄阳市永鑫汽配,07103493468,童丽萍,襄阳市光彩汽配城12栋112号
119,"2018-10-11 03:22:39",刹车分泵前右,41001-JN00A,08天籁,襄阳市永鑫汽配,,东风日产,个,,,湖北-襄阳,汽配商,襄阳市永鑫汽配,07103493468,童丽萍,襄阳市光彩汽配城12栋112号
120,"2018-10-11 03:22:55",刹车分泵前左,41011-JN00A,08天籁,襄阳市永鑫汽配,,东风日产,个,,,湖北-襄阳,汽配商,襄阳市永鑫汽配,07103493468,童丽萍,襄阳市光彩汽配城12栋112号
121,"2018-10-11 03:23:14",机油泵,15010-12G02,VG33,襄阳市永鑫汽配,,郑州日产,个,,,湖北-襄阳,汽配商,襄阳市永鑫汽配,07103493468,童丽萍,襄阳市光彩汽配城12栋112号
122,"2018-10-11 03:25:01",助力泵皮带,02117-05523,VG33,襄阳市永鑫汽配,,郑州日产,个,,,湖北-襄阳,汽配商,襄阳市永鑫汽配,07103493468,童丽萍,襄阳市光彩汽配城12栋112号
123,"2018-10-11 03:25:17",刹车分泵/后,44100-3T001,D22,襄阳市永鑫汽配,,郑州日产,个,,,湖北-襄阳,汽配商,襄阳市永鑫汽配,07103493468,童丽萍,襄阳市光彩汽配城12栋112号
124,"2018-10-11 03:25:36",水泵,21010-12G27,VG33,襄阳市永鑫汽配,,郑州日产,个,,,湖北-襄阳,汽配商,襄阳市永鑫汽配,07103493468,童丽萍,襄阳市光彩汽配城12栋112号
125,"2018-10-11 03:25:55",水泵进水接头软管,1307016FA060,瑞风,襄阳市永鑫汽配,,JAC,个,,,湖北-襄阳,汽配商,襄阳市永鑫汽配,07103493468,童丽萍,襄阳市光彩汽配城12栋112号
126,"2018-10-11 03:26:16","铁水管 水泵",1307400FA000,瑞风2.,襄阳市永鑫汽配,,JAC,个,,,湖北-襄阳,汽配商,襄阳市永鑫汽配,07103493468,童丽萍,襄阳市光彩汽配城12栋112号
127,"2018-10-11 03:26:35",离合器分泵,41700-43150,瑞风2.,襄阳市永鑫汽配,,JAC,个,,,湖北-襄阳,汽配商,襄阳市永鑫汽配,07103493468,童丽萍,襄阳市光彩汽配城12栋112号
128,"2018-10-11 03:26:53",汽油泵油管/黑,31055-V3210,瑞风,襄阳市永鑫汽配,,JAC,根,,,湖北-襄阳,汽配商,襄阳市永鑫汽配,07103493468,童丽萍,襄阳市光彩汽配城12栋112号
129,"2018-10-11 03:27:10",真空泵,14650-7T401,P27,襄阳市永鑫汽配,,郑州日产,个,,,湖北-襄阳,汽配商,襄阳市永鑫汽配,07103493468,童丽萍,襄阳市光彩汽配城12栋112号
130,"2018-10-11 03:27:26",汽油泵油管/蓝,31056-V2210,瑞风,襄阳市永鑫汽配,,JAC,根,,,湖北-襄阳,汽配商,襄阳市永鑫汽配,07103493468,童丽萍,襄阳市光彩汽配城12栋112号
131,"2018-10-11 03:27:45",离合器分泵，带分离轴承,TYLHQFB,同悦,襄阳市永鑫汽配,,JAC,个,,,湖北-襄阳,汽配商,襄阳市永鑫汽配,07103493468,童丽萍,襄阳市光彩汽配城12栋112号
132,"2018-10-11 03:28:03",低压管冷气泵-蒸发器,92440-Y3710,ZD25,襄阳市永鑫汽配,,郑州日产,根,,,湖北-襄阳,汽配商,襄阳市永鑫汽配,07103493468,童丽萍,襄阳市光彩汽配城12栋112号
133,"2018-10-11 03:28:22",离合器分泵,B132216000+B,帅克1.,襄阳市永鑫汽配,,郑州日产,个,,,湖北-襄阳,汽配商,襄阳市永鑫汽配,07103493468,童丽萍,襄阳市光彩汽配城12栋112号
134,"2018-10-11 03:28:48",离合器分泵（塑料）,218216,帅克,襄阳市永鑫汽配,,郑州日产,个,,,湖北-襄阳,汽配商,襄阳市永鑫汽配,07103493468,童丽萍,襄阳市光彩汽配城12栋112号
135,"2018-10-11 03:29:03",离合器分泵,41700-43010,瑞风柴油,襄阳市永鑫汽配,,JAC,个,,,湖北-襄阳,汽配商,襄阳市永鑫汽配,07103493468,童丽萍,襄阳市光彩汽配城12栋112号
136,"2018-10-11 03:29:17",助力泵,A5042DF,帅克1.,襄阳市永鑫汽配,,郑州日产,个,,,湖北-襄阳,汽配商,襄阳市永鑫汽配,07103493468,童丽萍,襄阳市光彩汽配城12栋112号
137,"2018-10-11 03:29:35",刹车分泵前右,A-3501511,风行菱智,襄阳市永鑫汽配,,东风风行,个,,,湖北-襄阳,汽配商,襄阳市永鑫汽配,07103493468,童丽萍,襄阳市光彩汽配城12栋112号
138,"2018-10-11 03:29:49",刹车分泵前左,A-3501510,风行菱智,襄阳市永鑫汽配,,东风风行,个,,,湖北-襄阳,汽配商,襄阳市永鑫汽配,07103493468,童丽萍,襄阳市光彩汽配城12栋112号
139,"2018-10-11 03:30:07",机油泵滤网,1220A023,4A91,襄阳市永鑫汽配,,东风风行,个,,,湖北-襄阳,汽配商,襄阳市永鑫汽配,07103493468,童丽萍,襄阳市光彩汽配城12栋112号
140,"2018-10-11 03:30:25",助力泵,A-3407040,4G63,襄阳市永鑫汽配,,东风风行,个,,,湖北-襄阳,汽配商,襄阳市永鑫汽配,07103493468,童丽萍,襄阳市光彩汽配城12栋112号
141,"2018-10-11 03:30:41",潍柴6110发动机涡轮增,潍柴6110发动机涡轮增,潍柴发动,潍坊华诚柴油机有限公司,,2105/490/4100/4105/6105/6110,台,,,山东-潍坊,生产厂家,潍坊华诚柴油机有限公司,"400-0536-049 400-0536-049",林经理,潍坊市潍城区
142,"2018-10-11 03:30:59",潍柴4102柴油机涡轮增,潍柴4102柴油机涡轮增,潍柴发动,潍坊华诚柴油机有限公司,,2105/490/4100/4105/6105/6110,台,,,山东-潍坊,生产厂家,潍坊华诚柴油机有限公司,"400-0536-049 400-0536-049",林经理,潍坊市潍城区
143,"2018-10-11 03:31:15",4110柴油机涡轮增压器,4110柴油机涡轮增压器,潍柴发动,潍坊华诚柴油机有限公司,,2105/490/4100/4105/6105/6110,台,,,山东-潍坊,生产厂家,潍坊华诚柴油机有限公司,"400-0536-049 400-0536-049",林经理,潍坊市潍城区
144,"2018-10-11 03:31:31",增压器（P222LE）,65.09100-705,P222,杭州萧山康联发电设备经营部,铝壳进气端直径为102mm,斗山大宇,,,,浙江-杭州,汽配商,杭州萧山康联发电设备经营部,13819486169,龙先生,浙江省杭州市
145,"2018-10-11 03:31:48",4108柴油发动机涡轮增,4108柴油发动机涡轮增,潍柴发动,潍坊华诚柴油机有限公司,,2105/490/4100/4105/6105/6110,台,,,山东-潍坊,生产厂家,潍坊华诚柴油机有限公司,"400-0536-049 400-0536-049",林经理,潍坊市潍城区
146,"2018-10-11 03:32:04",潍坊发动机4102涡轮增,潍坊发动机4102涡轮增,潍柴发动,潍坊华诚柴油机有限公司,,2105/490/4100/4105/6105/6110,台,,,山东-潍坊,生产厂家,潍坊华诚柴油机有限公司,"400-0536-049 400-0536-049",林经理,潍坊市潍城区
147,"2018-10-11 03:32:18",4108发动机涡轮增压器,4108发动机涡轮增压器,潍柴发动,潍坊华诚柴油机有限公司,,2105/490/4100/4105/6105/6110,台,,,山东-潍坊,生产厂家,潍坊华诚柴油机有限公司,"400-0536-049 400-0536-049",林经理,潍坊市潍城区
148,"2018-10-11 03:32:34",潍柴4105柴油机涡轮增,潍柴4105柴油机涡轮增,潍柴发动,潍坊华诚柴油机有限公司,,2105/490/4100/4105/6105/6110,台,,,山东-潍坊,生产厂家,潍坊华诚柴油机有限公司,"400-0536-049 400-0536-049",林经理,潍坊市潍城区
149,"2018-10-11 03:32:52",潍柴柴油机4108涡轮增,潍柴柴油机4108涡轮增,潍柴发动,潍坊华诚柴油机有限公司,,2105/490/4100/4105/6105/6110,台,,,山东-潍坊,生产厂家,潍坊华诚柴油机有限公司,"400-0536-049 400-0536-049",林经理,潍坊市潍城区
150,"2018-10-11 03:33:06",潍坊发动机2110涡轮增,潍坊发动机2110涡轮增,潍柴发动,潍坊华诚柴油机有限公司,,2105/490/4100/4105/6105/6110,台,,,山东-潍坊,生产厂家,潍坊华诚柴油机有限公司,"400-0536-049 400-0536-049",林经理,潍坊市潍城区
151,"2018-10-11 03:33:20",6105柴油机涡轮增压器,6105柴油机涡轮增压器,潍柴发动,潍坊华诚柴油机有限公司,,2105/490/4100/4105/6105/6110,台,,,山东-潍坊,生产厂家,潍坊华诚柴油机有限公司,"400-0536-049 400-0536-049",林经理,潍坊市潍城区
152,"2018-10-11 03:33:37",发动机4108涡轮增压器,发动机4108涡轮增压器,潍柴发动,潍坊华诚柴油机有限公司,,2105/490/4100/4105/6105/6110,台,,,山东-潍坊,生产厂家,潍坊华诚柴油机有限公司,"400-0536-049 400-0536-049",林经理,潍坊市潍城区
153,"2018-10-11 03:33:54",4110发动机涡轮增压器,4110发动机涡轮增压器,潍柴发动,潍坊华诚柴油机有限公司,,2105/490/4100/4105/6105/6110,台,,,山东-潍坊,生产厂家,潍坊华诚柴油机有限公司,"400-0536-049 400-0536-049",林经理,潍坊市潍城区
154,"2018-10-11 03:34:10",潍柴发动机4102涡轮增,潍柴发动机4102涡轮增,潍柴发动,潍坊华诚柴油机有限公司,,2105/490/4100/4105/6105/6110,台,,,山东-潍坊,生产厂家,潍坊华诚柴油机有限公司,"400-0536-049 400-0536-049",林经理,潍坊市潍城区
155,"2018-10-11 03:34:25",2105发动机涡轮增压器,2105发动机涡轮增压器,潍柴发动,潍坊华诚柴油机有限公司,,2105/490/4100/4105/6105/6110,台,,,山东-潍坊,生产厂家,潍坊华诚柴油机有限公司,"400-0536-049 400-0536-049",林经理,潍坊市潍城区
156,"2018-10-11 03:34:42",涡轮增压器-TD04,86830-3D000-,4D56,隆博汽配商行,,三菱,个,,,广东-广州,汽配商,隆博汽配商行,"13826410056 13826410056",黄经理,广州广园东路新致友汽配城
157,"2018-10-11 03:35:00",涡轮增压器-水冷4孔,CH630132,4M40,隆博汽配商行,,三菱,个,,,广东-广州,汽配商,隆博汽配商行,"13826410056 13826410056",黄经理,广州广园东路新致友汽配城
158,"2018-10-11 03:35:15",涡轮增压器-机械型,1701146,W271,隆博汽配商行,,奔驰,个,,,广东-广州,汽配商,隆博汽配商行,"13826410056 13826410056",黄经理,广州广园东路新致友汽配城
159,"2018-10-11 03:35:32",涡轮增压器水管,"06B 121 497","B5 C",隆博汽配商行,,大众,条,,,广东-广州,汽配商,隆博汽配商行,"13826410056 13826410056",黄经理,广州广园东路新致友汽配城
160,"2018-10-11 03:35:48",蜗轮增压器,WLZJQ-QS1118,全顺,屯溪汽配厂第一经营部,,,,,,安徽-黄山,汽配商,屯溪汽配厂第一经营部,,吴国琴,北海路55-33号
161,"2018-10-11 03:36:03",涡轮增压器水管,WLZYQSG-RF,瑞风,屯溪汽配厂第一经营部,,,,,,安徽-黄山,汽配商,屯溪汽配厂第一经营部,,吴国琴,北海路55-33号
162,"2018-10-11 03:36:18",6126柴油机涡轮增压器,6126柴油机涡轮增压器,潍柴发动,潍坊华诚柴油机有限公司,,2105/490/4100/4105/6105/6110,台,,,山东-潍坊,生产厂家,潍坊华诚柴油机有限公司,"400-0536-049 400-0536-049",林经理,潍坊市潍城区
163,"2018-10-11 03:36:36",潍柴4105涡轮增压器,潍柴4105涡轮增压器,潍柴发动,潍坊华诚柴油机有限公司,,2105/490/4100/4105/6105/6110,台,,,山东-潍坊,生产厂家,潍坊华诚柴油机有限公司,"400-0536-049 400-0536-049",林经理,潍坊市潍城区
164,"2018-10-11 03:36:53",增压器进油软管-钢丝,C3935821,D530,深圳市宝安区福永鑫方圆汽车配,ISDE4缸,东风天锦,条,,,广东-深圳,重型汽车配件,深圳市宝安区福永鑫方圆汽车配件商行,"13828846650 13828846650",戴修元,深圳市宝安区107国道福永段41号（东方国际车城旁）
165,"2018-10-11 03:37:08",密封垫-排气制动与增压器,D5010412299,D310,深圳市宝安区福永鑫方圆汽车配,,东风天龙,片,,,广东-深圳,重型汽车配件,深圳市宝安区福永鑫方圆汽车配件商行,"13828846650 13828846650",戴修元,深圳市宝安区107国道福永段41号（东方国际车城旁）
166,"2018-10-11 03:37:23",供应奥迪涡轮增压器原装拆,,A6,广州捷程汽配,,奥迪,1,,,广东-广州,汽配商,广州捷程汽配,"15018459490 020-26269930",叶桀,广州市白云大道北78号陈田湛隆汽配城兴隆区
167,"2018-10-11 03:37:44",增压器,65.09100-704,P126,杭州萧山康联发电设备经营部,,斗山大宇,台,,,浙江-杭州,汽配商,杭州萧山康联发电设备经营部,13819486169,龙先生,浙江省杭州市
168,"2018-10-11 03:37:59",增压器（右）,65.09100-705,P180,杭州萧山康联发电设备经营部,,斗山大宇,台,,,浙江-杭州,汽配商,杭州萧山康联发电设备经营部,13819486169,龙先生,浙江省杭州市
169,"2018-10-11 03:38:16",增压器（左）,65.09100-705,P180,杭州萧山康联发电设备经营部,,斗山大宇,台,,,浙江-杭州,汽配商,杭州萧山康联发电设备经营部,13819486169,龙先生,浙江省杭州市
170,"2018-10-11 03:38:34",增压器,3596901,VTA2,杭州萧山康联发电设备经营部,H050309301,康明斯,台,,,浙江-杭州,汽配商,杭州萧山康联发电设备经营部,13819486169,龙先生,浙江省杭州市
171,"2018-10-11 03:38:51",增压器（HX50）,612601110966,潍柴发动,北京凯源达欧曼汽车配件专卖店,,潍柴,件,,,北京-北京,重型汽车配件,北京凯源达欧曼汽车配件专卖店,"13810561327 15801033901",王军,北京市房山区大件路六环红绿灯向东200米
172,"2018-10-11 03:39:05",增压器方垫（出口）上柴,D13-302-01,上柴发动,北京凯源达欧曼汽车配件专卖店,,上柴,件,,,北京-北京,重型汽车配件,北京凯源达欧曼汽车配件专卖店,"13810561327 15801033901",王军,北京市房山区大件路六环红绿灯向东200米
173,"2018-10-11 03:39:24",增压器方垫（进口）上柴,D13-102-30B,上柴发动,北京凯源达欧曼汽车配件专卖店,,上柴,件,,,北京-北京,重型汽车配件,北京凯源达欧曼汽车配件专卖店,"13810561327 15801033901",王军,北京市房山区大件路六环红绿灯向东200米
174,"2018-10-11 03:39:39",增压器（右）,65.09100-704,P158,杭州萧山康联发电设备经营部,面对飞轮端7049在右手边,斗山大宇,个,,,浙江-杭州,汽配商,杭州萧山康联发电设备经营部,13819486169,龙先生,浙江省杭州市
175,"2018-10-11 03:39:54",增压器（左）,65.09100-704,P158,杭州萧山康联发电设备经营部,面对飞轮端7048是左手边的,斗山大宇,台,,,浙江-杭州,汽配商,杭州萧山康联发电设备经营部,13819486169,龙先生,浙江省杭州市
176,"2018-10-11 03:40:12",硅胶米管/增压器管,GJG60#,通用60,北京纪超汽车配件服务有限公司,,通用,根,,,北京-北京,汽配商,北京纪超汽车配件服务有限公司,"18612029339 ***********",祝纪超,北京市昌平区小汤山镇大东流宏久鑫汽配市场C栋43号
177,"2018-10-11 03:40:29",硅胶米管/增压器管,GJG#45,通用,北京纪超汽车配件服务有限公司,,通用,米,,,北京-北京,汽配商,北京纪超汽车配件服务有限公司,"18612029339 ***********",祝纪超,北京市昌平区小汤山镇大东流宏久鑫汽配市场C栋43号
178,"2018-10-11 03:40:48",增压器,D4043982,D310,深圳市宝安区福永鑫方圆汽车配,,东风天龙,台,,,广东-深圳,重型汽车配件,深圳市宝安区福永鑫方圆汽车配件商行,"13828846650 13828846650",戴修元,深圳市宝安区107国道福永段41号（东方国际车城旁）
179,"2018-10-11 03:41:04",回油管总成-增压器,11BF11-18030,EQ4h,深圳市宝安区福永鑫方圆汽车配,,EQ4H,,,,广东-深圳,重型汽车配件,深圳市宝安区福永鑫方圆汽车配件商行,"13828846650 13828846650",戴修元,深圳市宝安区107国道福永段41号（东方国际车城旁）
180,"2018-10-11 03:41:20",增压器,ZYQFA130(4BA,FA13,福州兴盛达汽配商行,,玉柴,台,,,福建-福州,汽配商,福州兴盛达汽配商行,13720817111,张辉,福州市晋安区环保楼下187第9，10间店
181,"2018-10-11 03:41:34",增压器扣,ZYQKDL153,德龙15,福州兴盛达汽配商行,,重汽,付,,,福建-福州,汽配商,福州兴盛达汽配商行,13720817111,张辉,福州市晋安区环保楼下187第9，10间店
182,"2018-10-11 03:41:49",增压器扣,ZYQK80DC,80带槽,福州兴盛达汽配商行,,通用,个,,,福建-福州,汽配商,福州兴盛达汽配商行,13720817111,张辉,福州市晋安区环保楼下187第9，10间店
183,"2018-10-11 03:42:06",增压器扣,ZYQK85,85,福州兴盛达汽配商行,,通用,个,,,福建-福州,汽配商,福州兴盛达汽配商行,13720817111,张辉,福州市晋安区环保楼下187第9，10间店
184,"2018-10-11 03:42:23",增压器扣,ZYQKDL135,德龙13,福州兴盛达汽配商行,,重汽,个,,,福建-福州,汽配商,福州兴盛达汽配商行,13720817111,张辉,福州市晋安区环保楼下187第9，10间店
185,"2018-10-11 03:42:41",增压器弯管,ZYQWGVG18001,VG18,福州兴盛达汽配商行,,重汽,个,,,福建-福州,汽配商,福州兴盛达汽配商行,13720817111,张辉,福州市晋安区环保楼下187第9，10间店
186,"2018-10-11 03:42:56",增压器,ZYQDC498,大柴49,福州兴盛达汽配商行,,福田皮卡,台,,,福建-福州,汽配商,福州兴盛达汽配商行,13720817111,张辉,福州市晋安区环保楼下187第9，10间店
187,"2018-10-11 03:43:14",增压器,ZYQ8229GSRML,"豪沃 8",福州兴盛达汽配商行,,重汽,台,,,福建-福州,汽配商,福州兴盛达汽配商行,13720817111,张辉,福州市晋安区环保楼下187第9，10间店
188,"2018-10-11 03:43:33",增压器（车用）,ZYQD6114YD,D611,福州兴盛达汽配商行,,上柴,台,,,福建-福州,汽配商,福州兴盛达汽配商行,13720817111,张辉,福州市晋安区环保楼下187第9，10间店
189,"2018-10-11 03:43:48",增压器扣,ZYQK180,180,福州兴盛达汽配商行,,通用,个,,,福建-福州,汽配商,福州兴盛达汽配商行,13720817111,张辉,福州市晋安区环保楼下187第9，10间店
190,"2018-10-11 03:44:08",增压器扣（带槽）,ZYQK123DC,123,福州兴盛达汽配商行,,通用,个,,,福建-福州,汽配商,福州兴盛达汽配商行,13720817111,张辉,福州市晋安区环保楼下187第9，10间店
191,"2018-10-11 03:44:29",增压器垫片,ZYQDPHW120,豪沃12,福州兴盛达汽配商行,,通用,片,,,福建-福州,汽配商,福州兴盛达汽配商行,13720817111,张辉,福州市晋安区环保楼下187第9，10间店
192,"2018-10-11 03:44:48",增压器回油管,ZYQHYGDYC,道依茨,福州兴盛达汽配商行,,通用,条,,,福建-福州,汽配商,福州兴盛达汽配商行,13720817111,张辉,福州市晋安区环保楼下187第9，10间店
193,"2018-10-11 03:45:08",增压器垫片,ZYQDPWC,维柴道依,福州兴盛达汽配商行,,吊车,片,,,福建-福州,汽配商,福州兴盛达汽配商行,13720817111,张辉,福州市晋安区环保楼下187第9，10间店
194,"2018-10-11 03:45:27",增压器,ZYQSC6135,上柴61,福州兴盛达汽配商行,,上柴,台,,,福建-福州,汽配商,福州兴盛达汽配商行,13720817111,张辉,福州市晋安区环保楼下187第9，10间店
195,"2018-10-11 03:45:46",增压器,ZYQG38-000-3,上柴,福州兴盛达汽配商行,,船用,台,,,福建-福州,汽配商,福州兴盛达汽配商行,13720817111,张辉,福州市晋安区环保楼下187第9，10间店
196,"2018-10-11 03:46:07",增压器扣,ZYQBKHWTP,豪运,福州兴盛达汽配商行,,重汽,只,,,福建-福州,汽配商,福州兴盛达汽配商行,13720817111,张辉,福州市晋安区环保楼下187第9，10间店
197,"2018-10-11 03:46:25",增压器扣,ZYQKXTP,豪沃,福州兴盛达汽配商行,,重汽,个,,,福建-福州,汽配商,福州兴盛达汽配商行,13720817111,张辉,福州市晋安区环保楼下187第9，10间店
198,"2018-10-11 03:46:45",增压器扣,ZYQK115DC,115带,福州兴盛达汽配商行,,通用,个,,,福建-福州,汽配商,福州兴盛达汽配商行,13720817111,张辉,福州市晋安区环保楼下187第9，10间店
199,"2018-10-11 03:47:01",增压器抱箍,ZYQBGHWD,豪沃（大,福州兴盛达汽配商行,,重汽,付,,,福建-福州,汽配商,福州兴盛达汽配商行,13720817111,张辉,福州市晋安区环保楼下187第9，10间店
200,"2018-10-11 03:47:17",增压器垫片,ZYQDPHW100,"豪沃 1",福州兴盛达汽配商行,,重汽,个,,,福建-福州,汽配商,福州兴盛达汽配商行,13720817111,张辉,福州市晋安区环保楼下187第9，10间店
