qiche_peijian.id,qiche_peijian.ts,qiche_peijian.title,qiche_peijian.bianma,qiche_peijian.shiyong_chexing,qiche_peijian.danwei,qiche_peijian.jianjie,qiche_peijian.shiyong_chexi,qiche_peijian.guige,qiche_peijian.tuhao,qiche_peijian.lingshoujia,qiche_peijian.shengshi,qiche_peijian.qiye_leixing,qiche_peijian.shangji,qiche_peijian.lianxi_dianhua,qiche_peijian.lianxiren,qiche_peijian.lianxi_dizhi
1,"2018-10-11 02:49:13",4110柴油机水泵潍柴,4110柴油机水泵潍柴,潍柴发动,潍坊华诚柴油机有限公司,,2105/490/4100/4105/6105/6110,台,,,山东-潍坊,生产厂家,潍坊华诚柴油机有限公司,"400-0536-049 400-0536-049",林经理,潍坊市潍城区
2,"2018-10-11 02:49:27",6105柴油机柴油泵潍坊,6105柴油机柴油泵潍坊,潍柴发动,潍坊华诚柴油机有限公司,,2105/490/4100/4105/6105/6110,台,,,山东-潍坊,生产厂家,潍坊华诚柴油机有限公司,"400-0536-049 400-0536-049",林经理,潍坊市潍城区
3,"2018-10-11 02:49:46",供应奥迪Q5助力泵原装拆,,Q5,广州捷程汽配,,奥迪,个,,,广东-广州,汽配商,广州捷程汽配,"15018459490 020-26269930",叶桀,广州市白云大道北78号陈田湛隆汽配城兴隆区
4,"2018-10-11 02:50:04",潍坊柴油发动机6126水,潍坊柴油发动机6126水,潍柴发动,潍坊华诚柴油机有限公司,,2105/490/4100/4105/6105/6110,台,,,山东-潍坊,生产厂家,潍坊华诚柴油机有限公司,"400-0536-049 400-0536-049",林经理,潍坊市潍城区
5,"2018-10-11 02:50:22",6110发动机水泵潍柴,6110发动机水泵潍柴,潍柴发动,潍坊华诚柴油机有限公司,,2105/490/4100/4105/6105/6110,台,,,山东-潍坊,生产厂家,潍坊华诚柴油机有限公司,"400-0536-049 400-0536-049",林经理,潍坊市潍城区
6,"2018-10-11 02:50:41",潍柴柴油发动机2105水,潍柴柴油发动机2105水,潍柴发动,潍坊华诚柴油机有限公司,,2105/490/4100/4105/6105/6110,台,,,山东-潍坊,生产厂家,潍坊华诚柴油机有限公司,"400-0536-049 400-0536-049",林经理,潍坊市潍城区
7,"2018-10-11 02:50:56",潍柴6105柴油机机油泵,潍柴6105柴油机机油泵,潍柴发动,潍坊华诚柴油机有限公司,,2105/490/4100/4105/6105/6110,台,,,山东-潍坊,生产厂家,潍坊华诚柴油机有限公司,"400-0536-049 400-0536-049",林经理,潍坊市潍城区
8,"2018-10-11 02:51:14",发动机6113罐车泵车,发动机6113罐车_水泥,潍柴发动,潍坊华诚柴油机有限公司,,2105/490/4100/4105/6105/6110,台,,,山东-潍坊,生产厂家,潍坊华诚柴油机有限公司,"400-0536-049 400-0536-049",林经理,潍坊市潍城区
9,"2018-10-11 02:51:31",潍坊4102柴油发动机水,潍坊4102柴油发动机水,潍柴发动,潍坊华诚柴油机有限公司,,2105/490/4100/4105/6105/6110,台,,,山东-潍坊,生产厂家,潍坊华诚柴油机有限公司,"400-0536-049 400-0536-049",林经理,潍坊市潍城区
10,"2018-10-11 02:51:49",潍坊柴油机6110机油泵,潍坊柴油机6110机油泵,潍柴发动,潍坊华诚柴油机有限公司,,2105/490/4100/4105/6105/6110,台,,,山东-潍坊,生产厂家,潍坊华诚柴油机有限公司,"400-0536-049 400-0536-049",林经理,潍坊市潍城区
11,"2018-10-11 02:52:10",供应奥迪A4冷气泵原装拆,,A4,广州捷程汽配,,奥迪,1,,,广东-广州,汽配商,广州捷程汽配,"15018459490 020-26269930",叶桀,广州市白云大道北78号陈田湛隆汽配城兴隆区
12,"2018-10-11 02:52:30",柴油发动机2110水泵,柴油发动机2110水泵,潍柴发动,潍坊华诚柴油机有限公司,,2105/490/4100/4105/6105/6110,台,,,山东-潍坊,生产厂家,潍坊华诚柴油机有限公司,"400-0536-049 400-0536-049",林经理,潍坊市潍城区
13,"2018-10-11 02:52:45",潍坊柴油发动机4110柴,潍坊柴油发动机4110柴,潍柴发动,潍坊华诚柴油机有限公司,,2105/490/4100/4105/6105/6110,台,,,山东-潍坊,生产厂家,潍坊华诚柴油机有限公司,"400-0536-049 400-0536-049",林经理,潍坊市潍城区
14,"2018-10-11 02:52:59",雷克萨斯LS400方向机,,丰田,广州路翔汽车配件有限公司,,日车系,个,,,广东-广州,汽配商,广州路翔汽车配件有限公司,"020-26275619 020-28040356","林 跃",广州市白云区陈田湛隆汽配城78号
15,"2018-10-11 02:53:13",雷克萨斯CT200方向机,,丰田,广州路翔汽车配件有限公司,,日车系,个,,,广东-广州,汽配商,广州路翔汽车配件有限公司,"020-26275619 020-28040356","林 跃",广州市白云区陈田湛隆汽配城78号
16,"2018-10-11 02:53:28",柴油发动机4108柴油泵,柴油发动机4108柴油泵,潍柴发动,潍坊华诚柴油机有限公司,,2105/490/4100/4105/6105/6110,台,,,山东-潍坊,生产厂家,潍坊华诚柴油机有限公司,"400-0536-049 400-0536-049",林经理,潍坊市潍城区
17,"2018-10-11 02:53:43",供应捷豹XK助力泵原装拆,XK,XK,广州捷程汽配,,捷豹,1,,,广东-广州,汽配商,广州捷程汽配,"15018459490 020-26269930",叶桀,广州市白云大道北78号陈田湛隆汽配城兴隆区
18,"2018-10-11 02:54:01",潍柴6126柴油机机油泵,潍柴6126柴油机机油泵,潍柴发动,潍坊华诚柴油机有限公司,,2105/490/4100/4105/6105/6110,台,,,山东-潍坊,生产厂家,潍坊华诚柴油机有限公司,"400-0536-049 400-0536-049",林经理,潍坊市潍城区
19,"2018-10-11 02:54:18",发动机6113机油泵,发动机6113机油泵,潍柴发动,潍坊华诚柴油机有限公司,,2105/490/4100/4105/6105/6110,台,,,山东-潍坊,生产厂家,潍坊华诚柴油机有限公司,"400-0536-049 400-0536-049",林经理,潍坊市潍城区
20,"2018-10-11 02:54:38",6105柴油发动机柴油泵,6105柴油发动机柴油泵,潍柴发动,潍坊华诚柴油机有限公司,,2105/490/4100/4105/6105/6110,台,,,山东-潍坊,生产厂家,潍坊华诚柴油机有限公司,"400-0536-049 400-0536-049",林经理,潍坊市潍城区
21,"2018-10-11 02:54:55",4110柴油机柴油泵潍柴,4110柴油机柴油泵潍柴,潍柴发动,潍坊华诚柴油机有限公司,,2105/490/4100/4105/6105/6110,台,,,山东-潍坊,生产厂家,潍坊华诚柴油机有限公司,"400-0536-049 400-0536-049",林经理,潍坊市潍城区
22,"2018-10-11 02:55:10",潍柴4100柴油泵,潍柴4100柴油泵,潍柴发动,潍坊华诚柴油机有限公司,,2105/490/4100/4105/6105/6110,台,,,山东-潍坊,生产厂家,潍坊华诚柴油机有限公司,"400-0536-049 400-0536-049",林经理,潍坊市潍城区
23,"2018-10-11 02:55:27",4108柴油机高压油泵潍,4108柴油机高压油泵潍,潍柴发动,潍坊华诚柴油机有限公司,,2105/490/4100/4105/6105/6110,台,,,山东-潍坊,生产厂家,潍坊华诚柴油机有限公司,"400-0536-049 400-0536-049",林经理,潍坊市潍城区
24,"2018-10-11 02:55:42",潍坊柴油发动机4100高,潍坊柴油发动机4100高,潍柴发动,潍坊华诚柴油机有限公司,,2105/490/4100/4105/6105/6110,台,,,山东-潍坊,生产厂家,潍坊华诚柴油机有限公司,"400-0536-049 400-0536-049",林经理,潍坊市潍城区
25,"2018-10-11 02:56:01",宝马730水泵原装拆车件,宝马730水泵,730,广州百邦汽配有限公司,,宝马,个,,,广东-广州,汽配商,广州百邦汽配有限公司,"020-37310121 020-37310121",陈成,广州市白云大道北78号陈田湛隆汽配城兴隆区
26,"2018-10-11 02:56:19",供应奥迪A6助力泵原装拆,,A6,广州捷程汽配,,奥迪,1,,,广东-广州,汽配商,广州捷程汽配,"15018459490 020-26269930",叶桀,广州市白云大道北78号陈田湛隆汽配城兴隆区
27,"2018-10-11 02:56:33",潍柴2105柴油机水泵,潍柴2105柴油机水泵,潍柴发动,潍坊华诚柴油机有限公司,,2105/490/4100/4105/6105/6110,台,,,山东-潍坊,生产厂家,潍坊华诚柴油机有限公司,"400-0536-049 400-0536-049",林经理,潍坊市潍城区
28,"2018-10-11 02:56:47",2105发动机水泵潍柴,2105发动机水泵潍柴,潍柴发动,潍坊华诚柴油机有限公司,,2105/490/4100/4105/6105/6110,台,,,山东-潍坊,生产厂家,潍坊华诚柴油机有限公司,"400-0536-049 400-0536-049",林经理,潍坊市潍城区
29,"2018-10-11 02:57:04",4100柴油机高压油泵潍,4100柴油机高压油泵潍,潍柴发动,潍坊华诚柴油机有限公司,,2105/490/4100/4105/6105/6110,台,,,山东-潍坊,生产厂家,潍坊华诚柴油机有限公司,"400-0536-049 400-0536-049",林经理,潍坊市潍城区
30,"2018-10-11 02:57:18",电子燃油油泵QSX15,4935094,qsx1,杭州萧山康联发电设备经营部,,康明斯,,,,浙江-杭州,汽配商,杭州萧山康联发电设备经营部,13819486169,龙先生,浙江省杭州市
31,"2018-10-11 02:57:32",6110柴油发动机高压油,6110柴油发动机高压油,潍柴发动,潍坊华诚柴油机有限公司,,2105/490/4100/4105/6105/6110,台,,,山东-潍坊,生产厂家,潍坊华诚柴油机有限公司,"400-0536-049 400-0536-049",林经理,潍坊市潍城区
32,"2018-10-11 02:57:48",潍坊6113发动机机油泵,潍坊6113发动机机油泵,潍柴发动,潍坊华诚柴油机有限公司,,2105/490/4100/4105/6105/6110,台,,,山东-潍坊,生产厂家,潍坊华诚柴油机有限公司,"400-0536-049 400-0536-049",林经理,潍坊市潍城区
33,"2018-10-11 02:58:06",潍柴柴油机4105机油泵,潍柴柴油机4105机油泵,潍柴发动,潍坊华诚柴油机有限公司,,2105/490/4100/4105/6105/6110,台,,,山东-潍坊,生产厂家,潍坊华诚柴油机有限公司,"400-0536-049 400-0536-049",林经理,潍坊市潍城区
34,"2018-10-11 02:58:21",潍柴490柴油机机油泵,潍柴490柴油机机油泵,潍柴发动,潍坊华诚柴油机有限公司,,2105/490/4100/4105/6105/6110,台,,,山东-潍坊,生产厂家,潍坊华诚柴油机有限公司,"400-0536-049 400-0536-049",林经理,潍坊市潍城区
35,"2018-10-11 02:58:39",柴油发动机6126水泵,柴油发动机6126水泵,潍柴发动,潍坊华诚柴油机有限公司,,2105/490/4100/4105/6105/6110,台,,,山东-潍坊,生产厂家,潍坊华诚柴油机有限公司,"400-0536-049 400-0536-049",林经理,潍坊市潍城区
36,"2018-10-11 02:58:54",2110柴油机柴油泵潍柴,2110柴油机柴油泵潍柴,潍柴发动,潍坊华诚柴油机有限公司,,2105/490/4100/4105/6105/6110,台,,,山东-潍坊,生产厂家,潍坊华诚柴油机有限公司,"400-0536-049 400-0536-049",林经理,潍坊市潍城区
37,"2018-10-11 02:59:13",6113发动机高压油泵潍,6113发动机高压油泵潍,潍柴发动,潍坊华诚柴油机有限公司,,2105/490/4100/4105/6105/6110,台,,,山东-潍坊,生产厂家,潍坊华诚柴油机有限公司,"400-0536-049 400-0536-049",林经理,潍坊市潍城区
38,"2018-10-11 02:59:30",490发动机柴油泵潍坊,490发动机柴油泵潍坊,潍柴发动,潍坊华诚柴油机有限公司,,2105/490/4100/4105/6105/6110,台,,,山东-潍坊,生产厂家,潍坊华诚柴油机有限公司,"400-0536-049 400-0536-049",林经理,潍坊市潍城区
39,"2018-10-11 02:59:49",4110柴油发动机柴油泵,4110柴油发动机柴油泵,潍柴发动,潍坊华诚柴油机有限公司,,2105/490/4100/4105/6105/6110,台,,,山东-潍坊,生产厂家,潍坊华诚柴油机有限公司,"400-0536-049 400-0536-049",林经理,潍坊市潍城区
40,"2018-10-11 03:00:04",6113发动机机油泵潍柴,6113发动机机油泵潍柴,潍柴发动,潍坊华诚柴油机有限公司,,2105/490/4100/4105/6105/6110,台,,,山东-潍坊,生产厂家,潍坊华诚柴油机有限公司,"400-0536-049 400-0536-049",林经理,潍坊市潍城区
41,"2018-10-11 03:00:22",水泵,"06F 121 011",C6/B,埇聚奥迪汽配,德国原厂,AD,个,,,安徽-宿州,汽配商,埇聚奥迪汽配,18133266565,于跃,安徽省宿州市南关汽配城11栋120号
42,"2018-10-11 03:00:36",B813汽油泵插头,"4B0 973 724",B813,埇聚奥迪汽配,,AD,,,,安徽-宿州,汽配商,埇聚奥迪汽配,18133266565,于跃,安徽省宿州市南关汽配城11栋120号
43,"2018-10-11 03:00:53",汽油泵总成,"8K0 919 051",B813,埇聚奥迪汽配,,AD,,,,安徽-宿州,汽配商,埇聚奥迪汽配,18133266565,于跃,安徽省宿州市南关汽配城11栋120号
44,"2018-10-11 03:01:09",机油泵链条盖板,"06D 103 340",C62.,埇聚奥迪汽配,,AD,,,,安徽-宿州,汽配商,埇聚奥迪汽配,18133266565,于跃,安徽省宿州市南关汽配城11栋120号
45,"2018-10-11 03:01:23",汽油泵控制器,"4H0 906 093",A8D4,埇聚奥迪汽配,,AD,,,,安徽-宿州,汽配商,埇聚奥迪汽配,18133266565,于跃,安徽省宿州市南关汽配城11栋120号
46,"2018-10-11 03:01:41",汽油泵,"4H0 906 089",A8D4,埇聚奥迪汽配,,AD,个,,,安徽-宿州,汽配商,埇聚奥迪汽配,18133266565,于跃,安徽省宿州市南关汽配城11栋120号
47,"2018-10-11 03:02:00",真空泵,"06E 145 100",C63.,埇聚奥迪汽配,,AD,,,,安徽-宿州,汽配商,埇聚奥迪汽配,18133266565,于跃,安徽省宿州市南关汽配城11栋120号
48,"2018-10-11 03:02:16",ABS泵,"4FD 614 517",C6,埇聚奥迪汽配,,AD,,,,安徽-宿州,汽配商,埇聚奥迪汽配,18133266565,于跃,安徽省宿州市南关汽配城11栋120号
49,"2018-10-11 03:02:31",真空泵密封垫,"06D 145 117",C62.,埇聚奥迪汽配,,AD,个,,,安徽-宿州,汽配商,埇聚奥迪汽配,18133266565,于跃,安徽省宿州市南关汽配城11栋120号
50,"2018-10-11 03:02:47",汽油泵,"4G0 919 051",C7,埇聚奥迪汽配,,AD,,,,安徽-宿州,汽配商,埇聚奥迪汽配,18133266565,于跃,安徽省宿州市南关汽配城11栋120号
51,"2018-10-11 03:03:04",助力泵皮带轮,"06D 145 255",C6/A,埇聚奥迪汽配,,AD,个,,,安徽-宿州,汽配商,埇聚奥迪汽配,18133266565,于跃,安徽省宿州市南关汽配城11栋120号
52,"2018-10-11 03:03:20",水泵,SBB5LW,B5,埇聚奥迪汽配,,AD,个,,,安徽-宿州,汽配商,埇聚奥迪汽配,18133266565,于跃,安徽省宿州市南关汽配城11栋120号
53,"2018-10-11 03:03:35",490柴油机高压油泵潍坊,490柴油机高压油泵潍坊,潍柴发动,潍坊华诚柴油机有限公司,,2105/490/4100/4105/6105/6110,台,,,山东-潍坊,生产厂家,潍坊华诚柴油机有限公司,"400-0536-049 400-0536-049",林经理,潍坊市潍城区
54,"2018-10-11 03:03:52",柴油发动机2105高压油,柴油发动机2105高压油,潍柴发动,潍坊华诚柴油机有限公司,,2105/490/4100/4105/6105/6110,台,,,山东-潍坊,生产厂家,潍坊华诚柴油机有限公司,"400-0536-049 400-0536-049",林经理,潍坊市潍城区
55,"2018-10-11 03:04:06",柴油发动机4105水泵,柴油发动机4105水泵,潍柴发动,潍坊华诚柴油机有限公司,,2105/490/4100/4105/6105/6110,台,,,山东-潍坊,生产厂家,潍坊华诚柴油机有限公司,"400-0536-049 400-0536-049",林经理,潍坊市潍城区
56,"2018-10-11 03:04:22",潍柴发动机4102机油泵,潍柴发动机4102机油泵,潍柴发动,潍坊华诚柴油机有限公司,,2105/490/4100/4105/6105/6110,台,,,山东-潍坊,生产厂家,潍坊华诚柴油机有限公司,"400-0536-049 400-0536-049",林经理,潍坊市潍城区
57,"2018-10-11 03:04:36",柴油发动机4100高压油,柴油发动机4100高压油,潍柴发动,潍坊华诚柴油机有限公司,,2105/490/4100/4105/6105/6110,台,,,山东-潍坊,生产厂家,潍坊华诚柴油机有限公司,"400-0536-049 400-0536-049",林经理,潍坊市潍城区
58,"2018-10-11 03:04:54",4102柴油发动机柴油泵,4102柴油发动机柴油泵,潍柴发动,潍坊华诚柴油机有限公司,,2105/490/4100/4105/6105/6110,台,,,山东-潍坊,生产厂家,潍坊华诚柴油机有限公司,"400-0536-049 400-0536-049",林经理,潍坊市潍城区
59,"2018-10-11 03:05:12",6126发动机机油泵潍坊,6126发动机机油泵潍坊,潍柴发动,潍坊华诚柴油机有限公司,,2105/490/4100/4105/6105/6110,台,,,山东-潍坊,生产厂家,潍坊华诚柴油机有限公司,"400-0536-049 400-0536-049",林经理,潍坊市潍城区
60,"2018-10-11 03:05:26",柴油发动机6113水泵,柴油发动机6113水泵,潍柴发动,潍坊华诚柴油机有限公司,,2105/490/4100/4105/6105/6110,台,,,山东-潍坊,生产厂家,潍坊华诚柴油机有限公司,"400-0536-049 400-0536-049",林经理,潍坊市潍城区
61,"2018-10-11 03:05:44",2110发动机水泵潍柴,2110发动机水泵潍柴,潍柴发动,潍坊华诚柴油机有限公司,,2105/490/4100/4105/6105/6110,台,,,山东-潍坊,生产厂家,潍坊华诚柴油机有限公司,"400-0536-049 400-0536-049",林经理,潍坊市潍城区
62,"2018-10-11 03:06:00",潍坊柴油发动机6105机,潍坊柴油发动机6105机,潍柴发动,潍坊华诚柴油机有限公司,,2105/490/4100/4105/6105/6110,台,,,山东-潍坊,生产厂家,潍坊华诚柴油机有限公司,"400-0536-049 400-0536-049",林经理,潍坊市潍城区
63,"2018-10-11 03:06:17",潍柴柴油机4100柴油泵,潍柴柴油机4100柴油泵,潍柴发动,潍坊华诚柴油机有限公司,,2105/490/4100/4105/6105/6110,台,,,山东-潍坊,生产厂家,潍坊华诚柴油机有限公司,"400-0536-049 400-0536-049",林经理,潍坊市潍城区
64,"2018-10-11 03:06:34",潍柴柴油发动机4110水,潍柴柴油发动机4110水,潍柴发动,潍坊华诚柴油机有限公司,,2105/490/4100/4105/6105/6110,台,,,山东-潍坊,生产厂家,潍坊华诚柴油机有限公司,"400-0536-049 400-0536-049",林经理,潍坊市潍城区
65,"2018-10-11 03:06:53",潍柴4105发动机机油泵,潍柴4105发动机机油泵,潍柴发动,潍坊华诚柴油机有限公司,,2105/490/4100/4105/6105/6110,台,,,山东-潍坊,生产厂家,潍坊华诚柴油机有限公司,"400-0536-049 400-0536-049",林经理,潍坊市潍城区
66,"2018-10-11 03:07:09",潍柴2105柴油发动机水,潍柴2105柴油发动机水,潍柴发动,潍坊华诚柴油机有限公司,,2105/490/4100/4105/6105/6110,台,,,山东-潍坊,生产厂家,潍坊华诚柴油机有限公司,"400-0536-049 400-0536-049",林经理,潍坊市潍城区
67,"2018-10-11 03:07:25",6126柴油机柴油泵潍柴,6126柴油机柴油泵潍柴,潍柴发动,潍坊华诚柴油机有限公司,,2105/490/4100/4105/6105/6110,台,,,山东-潍坊,生产厂家,潍坊华诚柴油机有限公司,"400-0536-049 400-0536-049",林经理,潍坊市潍城区
68,"2018-10-11 03:07:43",490柴油发动机高压油泵,490柴油发动机高压油泵,潍柴发动,潍坊华诚柴油机有限公司,,2105/490/4100/4105/6105/6110,台,,,山东-潍坊,生产厂家,潍坊华诚柴油机有限公司,"400-0536-049 400-0536-049",林经理,潍坊市潍城区
69,"2018-10-11 03:07:59",潍坊6126发动机高压油,潍坊6126发动机高压油,潍柴发动,潍坊华诚柴油机有限公司,,2105/490/4100/4105/6105/6110,台,,,山东-潍坊,生产厂家,潍坊华诚柴油机有限公司,"400-0536-049 400-0536-049",林经理,潍坊市潍城区
70,"2018-10-11 03:08:16",潍柴发动机6105高压油,潍柴发动机6105高压油,潍柴发动,潍坊华诚柴油机有限公司,,2105/490/4100/4105/6105/6110,台,,,山东-潍坊,生产厂家,潍坊华诚柴油机有限公司,"400-0536-049 400-0536-049",林经理,潍坊市潍城区
71,"2018-10-11 03:08:40",潍坊6113柴油发动机柴,潍坊6113柴油发动机柴,潍柴发动,潍坊华诚柴油机有限公司,,2105/490/4100/4105/6105/6110,台,,,山东-潍坊,生产厂家,潍坊华诚柴油机有限公司,"400-0536-049 400-0536-049",林经理,潍坊市潍城区
72,"2018-10-11 03:08:59",潍柴6126高压油泵,潍柴6126高压油泵,潍柴发动,潍坊华诚柴油机有限公司,,2105/490/4100/4105/6105/6110,台,,,山东-潍坊,生产厂家,潍坊华诚柴油机有限公司,"400-0536-049 400-0536-049",林经理,潍坊市潍城区
73,"2018-10-11 03:09:16",奔驰ML300钢圈，打气,,奔驰ML,广州路翔汽车配件有限公司,,奔驰,个,,,广东-广州,汽配商,广州路翔汽车配件有限公司,"020-26275619 020-28040356","林 跃",广州市白云区陈田湛隆汽配城78号
74,"2018-10-11 03:09:31",潍柴6126柴油发动机水,潍柴6126柴油发动机水,潍柴发动,潍坊华诚柴油机有限公司,,2105/490/4100/4105/6105/6110,台,,,山东-潍坊,生产厂家,潍坊华诚柴油机有限公司,"400-0536-049 400-0536-049",林经理,潍坊市潍城区
75,"2018-10-11 03:09:49",潍柴4105柴油发动机水,潍柴4105柴油发动机水,潍柴发动,潍坊华诚柴油机有限公司,,2105/490/4100/4105/6105/6110,台,,,山东-潍坊,生产厂家,潍坊华诚柴油机有限公司,"400-0536-049 400-0536-049",林经理,潍坊市潍城区
76,"2018-10-11 03:10:08",潍柴6113发动机高压油,潍柴6113发动机高压油,潍柴发动,潍坊华诚柴油机有限公司,,2105/490/4100/4105/6105/6110,台,,,山东-潍坊,生产厂家,潍坊华诚柴油机有限公司,"400-0536-049 400-0536-049",林经理,潍坊市潍城区
77,"2018-10-11 03:10:27",水星水箱，水泵，中网等汽,,水星,广州路翔汽车配件有限公司,,福特,个,,,广东-广州,汽配商,广州路翔汽车配件有限公司,"020-26275619 020-28040356","林 跃",广州市白云区陈田湛隆汽配城78号
78,"2018-10-11 03:10:42",沃尔沃XC90冷气泵，减,,沃尔沃X,广州路翔汽车配件有限公司,,沃尔沃,个,,,广东-广州,汽配商,广州路翔汽车配件有限公司,"020-26275619 020-28040356","林 跃",广州市白云区陈田湛隆汽配城78号
79,"2018-10-11 03:11:01",沃尔沃XC90刹车总泵，,,沃尔沃X,广州路翔汽车配件有限公司,,沃尔沃,个,,,广东-广州,汽配商,广州路翔汽车配件有限公司,"020-26275619 020-28040356","林 跃",广州市白云区陈田湛隆汽配城78号
80,"2018-10-11 03:11:15",沃尔沃XC90冷气泵，涡,,沃尔沃X,广州路翔汽车配件有限公司,,沃尔沃,个,,,广东-广州,汽配商,广州路翔汽车配件有限公司,"020-26275619 020-28040356","林 跃",广州市白云区陈田湛隆汽配城78号
81,"2018-10-11 03:11:30",助力泵油壶,"ZLBYH YXV3",悦翔V3,兰州卡邦汽车配件销售有限公司,,长安,个,,,甘肃-兰州,汽配商,兰州卡邦汽车配件销售有限公司,"0931-4675640 09314675640",赵泽源,甘肃省兰州市南山路鱼儿沟11号11-A二楼13号
82,"2018-10-11 03:11:46",真空泵带助力器,B301057-0200,CX20,兰州卡邦汽车配件销售有限公司,,长安,个,,,甘肃-兰州,汽配商,兰州卡邦汽车配件销售有限公司,"0931-4675640 09314675640",赵泽源,甘肃省兰州市南山路鱼儿沟11号11-A二楼13号
83,"2018-10-11 03:12:03",后刹车分泵,B301063-0400,CX20,兰州卡邦汽车配件销售有限公司,,长安,个,,,甘肃-兰州,汽配商,兰州卡邦汽车配件销售有限公司,"0931-4675640 09314675640",赵泽源,甘肃省兰州市南山路鱼儿沟11号11-A二楼13号
84,"2018-10-11 03:12:20","后刹车分泵 L","B501 (L)",B501,兰州卡邦汽车配件销售有限公司,,长安,个,,,甘肃-兰州,汽配商,兰州卡邦汽车配件销售有限公司,"0931-4675640 09314675640",赵泽源,甘肃省兰州市南山路鱼儿沟11号11-A二楼13号
85,"2018-10-11 03:12:39","后刹车分泵 R",B501,B501,兰州卡邦汽车配件销售有限公司,,长安,个,,,甘肃-兰州,汽配商,兰州卡邦汽车配件销售有限公司,"0931-4675640 09314675640",赵泽源,甘肃省兰州市南山路鱼儿沟11号11-A二楼13号
86,"2018-10-11 03:12:57","后刹车分泵 R",CTCSC14181-R,悦翔V3,兰州卡邦汽车配件销售有限公司,,长安,个,,,甘肃-兰州,汽配商,兰州卡邦汽车配件销售有限公司,"0931-4675640 09314675640",赵泽源,甘肃省兰州市南山路鱼儿沟11号11-A二楼13号
87,"2018-10-11 03:13:16","后刹车分泵 L",CTCSC14181-G,悦翔V3,兰州卡邦汽车配件销售有限公司,,长安,个,,,甘肃-兰州,汽配商,兰州卡邦汽车配件销售有限公司,"0931-4675640 09314675640",赵泽源,甘肃省兰州市南山路鱼儿沟11号11-A二楼13号
88,"2018-10-11 03:13:34",真空泵带助力器,B501059-0200,B501,兰州卡邦汽车配件销售有限公司,,长安,个,,,甘肃-兰州,汽配商,兰州卡邦汽车配件销售有限公司,"0931-4675640 09314675640",赵泽源,甘肃省兰州市南山路鱼儿沟11号11-A二楼13号
89,"2018-10-11 03:13:51","前刹车分泵 R",B501063-0601,B501,兰州卡邦汽车配件销售有限公司,,长安,个,,,甘肃-兰州,汽配商,兰州卡邦汽车配件销售有限公司,"0931-4675640 09314675640",赵泽源,甘肃省兰州市南山路鱼儿沟11号11-A二楼13号
90,"2018-10-11 03:14:08",离合器分离轴承(离合器分,CAB21,悦翔/V,兰州卡邦汽车配件销售有限公司,,长安,只,,,甘肃-兰州,汽配商,兰州卡邦汽车配件销售有限公司,"0931-4675640 09314675640",赵泽源,甘肃省兰州市南山路鱼儿沟11号11-A二楼13号
91,"2018-10-11 03:14:27",机油泵,8-97069738-N,TFR5,兰州卡邦汽车配件销售有限公司,,五十铃,个,,,甘肃-兰州,汽配商,兰州卡邦汽车配件销售有限公司,"0931-4675640 09314675640",赵泽源,甘肃省兰州市南山路鱼儿沟11号11-A二楼13号
92,"2018-10-11 03:14:44",助力泵,H16010-0500,cs35,兰州卡邦汽车配件销售有限公司,,长安,个,,,甘肃-兰州,汽配商,兰州卡邦汽车配件销售有限公司,"0931-4675640 09314675640",赵泽源,甘肃省兰州市南山路鱼儿沟11号11-A二楼13号
93,"2018-10-11 03:15:00",前刹车分泵L,S101062-0100,CS35,兰州卡邦汽车配件销售有限公司,,长安,个,,,甘肃-兰州,汽配商,兰州卡邦汽车配件销售有限公司,"0931-4675640 09314675640",赵泽源,甘肃省兰州市南山路鱼儿沟11号11-A二楼13号
94,"2018-10-11 03:15:18",前刹车分泵R,S101062-0101,CS35,兰州卡邦汽车配件销售有限公司,,长安,个,,,甘肃-兰州,汽配商,兰州卡邦汽车配件销售有限公司,"0931-4675640 09314675640",赵泽源,甘肃省兰州市南山路鱼儿沟11号11-A二楼13号
95,"2018-10-11 03:15:35",后刹车分泵L,S101063-0101,CS35,兰州卡邦汽车配件销售有限公司,,长安,个,,,甘肃-兰州,汽配商,兰州卡邦汽车配件销售有限公司,"0931-4675640 09314675640",赵泽源,甘肃省兰州市南山路鱼儿沟11号11-A二楼13号
96,"2018-10-11 03:15:52",后刹车分泵R,S101063-0100,CS35,兰州卡邦汽车配件销售有限公司,,长安,个,,,甘肃-兰州,汽配商,兰州卡邦汽车配件销售有限公司,"0931-4675640 09314675640",赵泽源,甘肃省兰州市南山路鱼儿沟11号11-A二楼13号
97,"2018-10-11 03:16:08",助力泵皮带,ZLBPD,TFS,兰州卡邦汽车配件销售有限公司,,五十铃,只,,,甘肃-兰州,汽配商,兰州卡邦汽车配件销售有限公司,"0931-4675640 09314675640",赵泽源,甘肃省兰州市南山路鱼儿沟11号11-A二楼13号
98,"2018-10-11 03:16:25",离合器分泵,LHQFB,TFR,兰州卡邦汽车配件销售有限公司,,五十铃,只,,,甘肃-兰州,汽配商,兰州卡邦汽车配件销售有限公司,"0931-4675640 09314675640",赵泽源,甘肃省兰州市南山路鱼儿沟11号11-A二楼13号
99,"2018-10-11 03:16:43",离合器总泵,LHQZC,TFR,兰州卡邦汽车配件销售有限公司,,五十铃,只,,,甘肃-兰州,汽配商,兰州卡邦汽车配件销售有限公司,"0931-4675640 09314675640",赵泽源,甘肃省兰州市南山路鱼儿沟11号11-A二楼13号
100,"2018-10-11 03:17:01",奔驰泵车离合器压盘三件套,A222503801,奔驰泵车,广州霏律顿贸易有限公司,本公司主要供应离合器，离合器盖产品及配件，适用于斯堪尼亚，沃尔沃，奔驰，雷诺，郑州宇通，厦门金旅，厦门金龙，海格客车系列，质量保证，欢迎来电咨询洽谈。,奔驰,套,,,广东-广州,重型汽车配件,广州霏律顿贸易有限公司,"18664619257 020-37238781",胡意,广州市天河区天源路409号东益汽配城C03档
