chengshi_x_shicai_baojia.id,chengshi.id,chengshi.ts,chengshi.title,shicai_baojia.id,shicai_baojia.ts,shicai_baojia.title,shicai_baojia.guige,shicai_baojia.jiage,shicai_baojia.gongsi,shicai_baojia.chandi,shicai_baojia.shijian,shicai_baojia.qidingliang,shicai_baojia.chanpin_yongtu,shicai_baojia.zhuying_chanpin,shicai_baojia.gongsi_dizhi,shicai_baojia.lianxiren,shicai_baojia.youzheng_bianma,shicai_baojia.dianhua,shicai_baojia.shouji,shicai_baojia.chaunzhen,shicai_baojia.email
1,1,"2018-09-29 03:45:12",福建,1,"2018-09-29 04:56:41",紫星灰钻,600＊1200＊2．5,185元/平方米,福鼎市惠明石业有限公司,福鼎,2018-05-19,,,"福鼎黑珍珠黑G684，沙漠棕宝金石，福寿红，鸡血红，寿宁红等石材。 首页 公司简介 产品展示 产品价格 求购信息 工程案例 公司图片 人才招聘 在线留言 联系我们 产品分类 全部产品 产品价格 现货信息 产品搜索 function so(){if(document.getElementById(""searchtext"").value!="""") window.location.href=""search.aspx?Key=""+document.getElementById(""searchtext"").valu",,,,,,,
2,1,"2018-09-29 03:45:12",福建,2,"2018-09-29 04:56:41",福鼎黑光面,600＊600＊30,205元/平方米,福鼎市惠明石业有限公司,福鼎,2018-05-19,,,"福鼎黑珍珠黑G684，沙漠棕宝金石，福寿红，鸡血红，寿宁红等石材。 首页 公司简介 产品展示 产品价格 求购信息 工程案例 公司图片 人才招聘 在线留言 联系我们 产品分类 全部产品 产品价格 现货信息 产品搜索 function so(){if(document.getElementById(""searchtext"").value!="""") window.location.href=""search.aspx?Key=""+document.getElementById(""searchtext"").valu",,,,,,,
3,1,"2018-09-29 03:45:12",福建,3,"2018-09-29 04:56:41",青石,600＊600＊20,85元/平方米,福鼎市惠明石业有限公司,,2018-05-19,,,"福鼎黑珍珠黑G684，沙漠棕宝金石，福寿红，鸡血红，寿宁红等石材。 首页 公司简介 产品展示 产品价格 求购信息 工程案例 公司图片 人才招聘 在线留言 联系我们 产品分类 全部产品 产品价格 现货信息 产品搜索 function so(){if(document.getElementById(""searchtext"").value!="""") window.location.href=""search.aspx?Key=""+document.getElementById(""searchtext"").valu",,,,,,,
4,1,"2018-09-29 03:45:12",福建,4,"2018-09-29 04:56:41",福鼎黑石材,60＊60＊2,150元/平方米,福鼎市惠明石业有限公司,,2018-05-19,,,"福鼎黑珍珠黑G684，沙漠棕宝金石，福寿红，鸡血红，寿宁红等石材。 首页 公司简介 产品展示 产品价格 求购信息 工程案例 公司图片 人才招聘 在线留言 联系我们 产品分类 全部产品 产品价格 现货信息 产品搜索 function so(){if(document.getElementById(""searchtext"").value!="""") window.location.href=""search.aspx?Key=""+document.getElementById(""searchtext"").valu",,,,,,,
5,1,"2018-09-29 03:45:12",福建,5,"2018-09-29 04:56:41",皇室啡,600＊1800＊25,215元/平方米,福鼎市惠明石业有限公司,福鼎,2018-05-19,,,"福鼎黑珍珠黑G684，沙漠棕宝金石，福寿红，鸡血红，寿宁红等石材。 首页 公司简介 产品展示 产品价格 求购信息 工程案例 公司图片 人才招聘 在线留言 联系我们 产品分类 全部产品 产品价格 现货信息 产品搜索 function so(){if(document.getElementById(""searchtext"").value!="""") window.location.href=""search.aspx?Key=""+document.getElementById(""searchtext"").valu",,,,,,,
6,1,"2018-09-29 03:45:12",福建,6,"2018-09-29 04:56:41",宝石蓝石材,600＊1200＊25,160元/平方米,福鼎市惠明石业有限公司,福鼎,2018-05-19,,,"福鼎黑珍珠黑G684，沙漠棕宝金石，福寿红，鸡血红，寿宁红等石材。 首页 公司简介 产品展示 产品价格 求购信息 工程案例 公司图片 人才招聘 在线留言 联系我们 产品分类 全部产品 产品价格 现货信息 产品搜索 function so(){if(document.getElementById(""searchtext"").value!="""") window.location.href=""search.aspx?Key=""+document.getElementById(""searchtext"").valu",,,,,,,
7,1,"2018-09-29 03:45:12",福建,7,"2018-09-29 04:56:41",福鼎黑G684,1000＊2000＊3,480元/平方米,福鼎市惠明石业有限公司,福鼎,2018-05-19,,,"福鼎黑珍珠黑G684，沙漠棕宝金石，福寿红，鸡血红，寿宁红等石材。 首页 公司简介 产品展示 产品价格 求购信息 工程案例 公司图片 人才招聘 在线留言 联系我们 产品分类 全部产品 产品价格 现货信息 产品搜索 function so(){if(document.getElementById(""searchtext"").value!="""") window.location.href=""search.aspx?Key=""+document.getElementById(""searchtext"").valu",,,,,,,
8,1,"2018-09-29 03:45:12",福建,8,"2018-09-29 04:56:41",珍珠黑,600＊900＊20,165元/平方米,福鼎市惠明石业有限公司,,2018-05-19,,,"福鼎黑珍珠黑G684，沙漠棕宝金石，福寿红，鸡血红，寿宁红等石材。 首页 公司简介 产品展示 产品价格 求购信息 工程案例 公司图片 人才招聘 在线留言 联系我们 产品分类 全部产品 产品价格 现货信息 产品搜索 function so(){if(document.getElementById(""searchtext"").value!="""") window.location.href=""search.aspx?Key=""+document.getElementById(""searchtext"").valu",,,,,,,
9,1,"2018-09-29 03:45:12",福建,9,"2018-09-29 04:56:41",沙漠棕石材,600＊900＊25,135元/平方米,福鼎市惠明石业有限公司,,2018-05-19,,,"福鼎黑珍珠黑G684，沙漠棕宝金石，福寿红，鸡血红，寿宁红等石材。 首页 公司简介 产品展示 产品价格 求购信息 工程案例 公司图片 人才招聘 在线留言 联系我们 产品分类 全部产品 产品价格 现货信息 产品搜索 function so(){if(document.getElementById(""searchtext"").value!="""") window.location.href=""search.aspx?Key=""+document.getElementById(""searchtext"").valu",,,,,,,
10,1,"2018-09-29 03:45:12",福建,10,"2018-09-29 04:56:41",宝金石,600＊1200＊25,135元/平方米,福鼎市惠明石业有限公司,,2018-05-19,,,"福鼎黑珍珠黑G684，沙漠棕宝金石，福寿红，鸡血红，寿宁红等石材。 首页 公司简介 产品展示 产品价格 求购信息 工程案例 公司图片 人才招聘 在线留言 联系我们 产品分类 全部产品 产品价格 现货信息 产品搜索 function so(){if(document.getElementById(""searchtext"").value!="""") window.location.href=""search.aspx?Key=""+document.getElementById(""searchtext"").valu",,,,,,,
11,1,"2018-09-29 03:45:12",福建,11,"2018-09-29 04:56:41",雅典棕石材,600＊900＊25,125元/平方米,福鼎市惠明石业有限公司,,2018-05-19,,,"福鼎黑珍珠黑G684，沙漠棕宝金石，福寿红，鸡血红，寿宁红等石材。 首页 公司简介 产品展示 产品价格 求购信息 工程案例 公司图片 人才招聘 在线留言 联系我们 产品分类 全部产品 产品价格 现货信息 产品搜索 function so(){if(document.getElementById(""searchtext"").value!="""") window.location.href=""search.aspx?Key=""+document.getElementById(""searchtext"").valu",,,,,,,
12,1,"2018-09-29 03:45:12",福建,12,"2018-09-29 04:56:41",黄金麻石材,600＊900＊25,115元/平方米,福鼎市惠明石业有限公司,,2018-05-19,,,"福鼎黑珍珠黑G684，沙漠棕宝金石，福寿红，鸡血红，寿宁红等石材。 首页 公司简介 产品展示 产品价格 求购信息 工程案例 公司图片 人才招聘 在线留言 联系我们 产品分类 全部产品 产品价格 现货信息 产品搜索 function so(){if(document.getElementById(""searchtext"").value!="""") window.location.href=""search.aspx?Key=""+document.getElementById(""searchtext"").valu",,,,,,,
13,1,"2018-09-29 03:45:12",福建,13,"2018-09-29 04:56:41",小蓝宝石材,60＊900＊25,125元/平方米,福鼎市惠明石业有限公司,,2018-05-19,,,"福鼎黑珍珠黑G684，沙漠棕宝金石，福寿红，鸡血红，寿宁红等石材。 首页 公司简介 产品展示 产品价格 求购信息 工程案例 公司图片 人才招聘 在线留言 联系我们 产品分类 全部产品 产品价格 现货信息 产品搜索 function so(){if(document.getElementById(""searchtext"").value!="""") window.location.href=""search.aspx?Key=""+document.getElementById(""searchtext"").valu",,,,,,,
14,1,"2018-09-29 03:45:12",福建,14,"2018-09-29 04:56:41",蝴蝶蓝石材,600＊900＊25,98元/平方米,福鼎市惠明石业有限公司,,2018-05-19,,,"福鼎黑珍珠黑G684，沙漠棕宝金石，福寿红，鸡血红，寿宁红等石材。 首页 公司简介 产品展示 产品价格 求购信息 工程案例 公司图片 人才招聘 在线留言 联系我们 产品分类 全部产品 产品价格 现货信息 产品搜索 function so(){if(document.getElementById(""searchtext"").value!="""") window.location.href=""search.aspx?Key=""+document.getElementById(""searchtext"").valu",,,,,,,
15,1,"2018-09-29 03:45:12",福建,15,"2018-09-29 04:56:41",G684福鼎黑石材,800＊800＊20,195元/平方米,福鼎市惠明石业有限公司,,2018-05-19,,,"福鼎黑珍珠黑G684，沙漠棕宝金石，福寿红，鸡血红，寿宁红等石材。 首页 公司简介 产品展示 产品价格 求购信息 工程案例 公司图片 人才招聘 在线留言 联系我们 产品分类 全部产品 产品价格 现货信息 产品搜索 function so(){if(document.getElementById(""searchtext"").value!="""") window.location.href=""search.aspx?Key=""+document.getElementById(""searchtext"").valu",,,,,,,
385,1,"2018-09-29 03:45:12",福建,385,"2018-09-29 05:07:13",卡尔啡石材,600＊900＊25,135元/平方米,福鼎市惠明石业有限公司,,2018-05-19,,,"福鼎黑珍珠黑G684，沙漠棕宝金石，福寿红，鸡血红，寿宁红等石材。 首页 公司简介 产品展示 产品价格 求购信息 工程案例 公司图片 人才招聘 在线留言 联系我们 产品分类 全部产品 产品价格 现货信息 产品搜索 function so(){if(document.getElementById(""searchtext"").value!="""") window.location.href=""search.aspx?Key=""+document.getElementById(""searchtext"").valu",,,,,,,
386,1,"2018-09-29 03:45:12",福建,386,"2018-09-29 05:07:13",金沙黄石材,600＊900＊25,135元/平方米,福鼎市惠明石业有限公司,,2018-05-19,,,"福鼎黑珍珠黑G684，沙漠棕宝金石，福寿红，鸡血红，寿宁红等石材。 首页 公司简介 产品展示 产品价格 求购信息 工程案例 公司图片 人才招聘 在线留言 联系我们 产品分类 全部产品 产品价格 现货信息 产品搜索 function so(){if(document.getElementById(""searchtext"").value!="""") window.location.href=""search.aspx?Key=""+document.getElementById(""searchtext"").valu",,,,,,,
387,1,"2018-09-29 03:45:12",福建,387,"2018-09-29 05:07:13",G684火烧面石材,800＊800＊20,185元/平方米,福建省福鼎市仓辉石材有限公司,福建福鼎,2018-05-19,,,"专业生产G684福鼎黑 首页 公司简介 产品展示 产品价格 求购信息 工程案例 公司图片 人才招聘 在线留言 联系我们 产品分类 G684福鼎黑火烧面 G684福鼎黑亚光面 G684福鼎黑光面 G684福鼎黑龙眼面 G684福鼎黑荔枝面 G684福鼎黑自然面 G684福鼎黑产品包装 G684福鼎黑广告画册 G684福鼎黑皮革面 G684福鼎黑拉丝面 G684福鼎黑菠萝面 G684福鼎黑喷沙面 G684福鼎黑火烧水冲面 G684福鼎黑火烧滚石面 G684福鼎黑异型加工 G684福鼎黑厚板地铺路沿 G684福",,,,,,,
388,1,"2018-09-29 03:45:12",福建,388,"2018-09-29 05:07:13",G684火烧面石材,600＊600＊20,155元/平方米,福建省福鼎市仓辉石材有限公司,福建福鼎,2018-05-19,,,"专业生产G684福鼎黑 首页 公司简介 产品展示 产品价格 求购信息 工程案例 公司图片 人才招聘 在线留言 联系我们 产品分类 G684福鼎黑火烧面 G684福鼎黑亚光面 G684福鼎黑光面 G684福鼎黑龙眼面 G684福鼎黑荔枝面 G684福鼎黑自然面 G684福鼎黑产品包装 G684福鼎黑广告画册 G684福鼎黑皮革面 G684福鼎黑拉丝面 G684福鼎黑菠萝面 G684福鼎黑喷沙面 G684福鼎黑火烧水冲面 G684福鼎黑火烧滚石面 G684福鼎黑异型加工 G684福鼎黑厚板地铺路沿 G684福",,,,,,,
389,1,"2018-09-29 03:45:12",福建,389,"2018-09-29 05:07:13",墨金刚大板,2920＊1890＊18,500元/平方米,福建省南安市禧通贸易有限公司,津巴布韦,2018-05-14,"1 平方米",台面,墨金刚，黑色花岗岩,福建泉州市水头镇世纪大道澳盛大厦806室,吴煌煌,,86-0595-86008773,18750550502,86-0595-86008773,dxzhou-stone@163．com
390,1,"2018-09-29 03:45:12",福建,390,"2018-09-29 05:07:13",永定红,600X、、X25mm,80元/平方米,福建大山石业有限公司,龙岩永定,2018-05-01,,,"永定红石材,福建永定红，G696石材，永定红供应商，永定红，G696， 首页 公司简介 产品展示 产品价格 供应信息 求购信息 工程案例 公司图片 在线留言 联系我们 产品分类 花岗岩 全部产品 产品价格 现货信息 产品搜索 function so(){if(document.getElementById(""searchtext"").value!="""") window.location.href=""search.aspx?Key=""+document.getElementById(""searchtext""",,,,,,,
391,1,"2018-09-29 03:45:12",福建,391,"2018-09-29 05:07:13","石材栏杆 石雕栏杆 栏板石雕 石材围栏",按图纸,900元/米,九龙星石业发展有限公司,福建惠安,2018-04-29,"5 米",防护、美化、艺术欣赏,"石雕工艺品 石材装饰 城市雕塑 花岗岩 大理石",福建泉州市惠安县台商投资区洛阳镇万安路805号,朱泊川,362100,86-0595-22687018,18959798969,86--,1642613213@qq．com
392,1,"2018-09-29 03:45:12",福建,392,"2018-09-29 05:07:13","石雕水钵 喷泉雕塑 石雕喷泉 水钵厂家",按图纸,85000元/件,九龙星石业发展有限公司,福建惠安,2018-04-29,"1 件","喷泉 装饰 美观 增加大气湿度","石雕工艺品 石材装饰 城市雕塑 花岗岩 大理石",福建泉州市惠安县台商投资区洛阳镇万安路805号,朱泊川,362100,86-0595-22687018,18959798969,86--,1642613213@qq．com
393,1,"2018-09-29 03:45:12",福建,393,"2018-09-29 05:07:13","石雕观音 厂家供应 8米观音雕像 白石观",按需,85000元/件,九龙星石业发展有限公司,福建惠安,2018-04-29,"1 件",祈福膜拜,"石雕工艺品 石材装饰 城市雕塑 花岗岩 大理石",福建泉州市惠安县台商投资区洛阳镇万安路805号,朱泊川,362100,86-0595-22687018,18959798969,86--,1642613213@qq．com
394,1,"2018-09-29 03:45:12",福建,394,"2018-09-29 05:07:13","黄锈石水钵 黄锈石喷水池 黄锈石喷泉",按需,85000元/件,九龙星石业发展有限公司,福建惠安,2018-04-29,"1 件",建筑装饰,"石雕工艺品 石材装饰 城市雕塑 花岗岩 大理石",福建泉州市惠安县台商投资区洛阳镇万安路805号,朱泊川,362100,86-0595-22687018,18959798969,86--,1642613213@qq．com
395,1,"2018-09-29 03:45:12",福建,395,"2018-09-29 05:07:13","石雕花钵 街道花钵 景观花钵 园林花钵",按图纸,1200元/件,九龙星石业发展有限公司,福建惠安,2018-04-29,"4 件",种植、美化、艺术欣赏,"石雕工艺品 石材装饰 城市雕塑 花岗岩 大理石",福建泉州市惠安县台商投资区洛阳镇万安路805号,朱泊川,362100,86-0595-22687018,18959798969,86--,1642613213@qq．com
396,1,"2018-09-29 03:45:12",福建,396,"2018-09-29 05:07:13","石雕龙柱 石雕龙柱厂家 专业生产订做",按需,85000元/件,九龙星石业发展有限公司,福建惠安,2018-04-29,"1 件",建筑装饰，艺术欣赏，文化传承,"石雕工艺品 石材装饰 城市雕塑 花岗岩 大理石",福建泉州市惠安县台商投资区洛阳镇万安路805号,朱泊川,362100,86-0595-22687018,18959798969,86--,1642613213@qq．com
397,1,"2018-09-29 03:45:12",福建,397,"2018-09-29 05:07:13",山西黑,,180元/平方米,华恒石材,山西,2018-03-22,,,"山西黑、河北黑、墓碑 首页 公司简介 产品展示 产品价格 供应信息 求购信息 工程案例 公司图片 在线留言 联系我们 产品分类 花岗岩 墓碑 全部产品 产品价格 现货信息 产品搜索 function so(){if(document.getElementById(""searchtext"").value!="""") window.location.href=""search.aspx?Key=""+document.getElementById(""searchtext"").value;else alert(""请填",,,,,,,
398,1,"2018-09-29 03:45:12",福建,398,"2018-09-29 03:42:42","大理石花钵 福建白麻花钵 黄锈石花钵图",按照客户要求,500元/件,福建泉州市九龙星石材有限公司,福建泉州,2018-03-15,,,,,,,,,,
399,1,"2018-09-29 03:45:12",福建,399,"2018-09-29 03:42:42","石雕花钵水钵 欧式户外景观花钵摆件",按照客户要求,850元/件,福建泉州市九龙星石材有限公司,福建泉州,2018-03-15,,,,,,,,,,
402,1,"2018-09-29 03:45:12",福建,402,"2018-09-29 03:42:45","石材水钵 石雕花岗岩跌水钵 石水钵厂家",按照客户要求,800元/件,福建泉州市九龙星石材有限公司,福建泉州,2018-03-15,,,,,,,,,,
403,1,"2018-09-29 03:45:12",福建,403,"2018-09-29 03:42:45","石头风水球 室内小型流水风水球定制 石",按照客户要求,0元/件,福建泉州市九龙星石材有限公司,福建,2018-03-15,,,,,,,,,,
404,1,"2018-09-29 03:45:12",福建,404,"2018-09-29 03:42:45","石雕风水球 天然石头风水球雕刻 2016最",按照客户要求,8000元/件,福建泉州市九龙星石材有限公司,福建,2018-03-15,,,,,,,,,,
405,1,"2018-09-29 03:45:12",福建,405,"2018-09-29 05:07:15",路沿石,100＊50＊20,850元/立方米,福建省万达石材有限公司,福建罗源,2018-03-11,"14 立方米",外墙，地铺，广场，市政道路等,"罗源红,G664,路沿石,墓碑,火烧板,工程板",福建福州市罗源县西兰墩厝开发区,张祥辉,,86-0591-26921066,13489128599,86-0591-26925885,982523673@QQ．COM
406,1,"2018-09-29 03:45:12",福建,406,"2018-09-29 05:07:15","罗源红G664 规格板",600＊600＊20,34元/平方米,福建省万达石材有限公司,福建罗源,2018-03-11,"500 平方米",外墙，地铺，广场，市政道路等,"罗源红,G664,路沿石,墓碑,火烧板,工程板",福建福州市罗源县西兰墩厝开发区,张祥辉,,86-0591-26921066,13489128599,86-0591-26925885,982523673@QQ．COM
407,1,"2018-09-29 03:45:12",福建,407,"2018-09-29 05:07:15","罗源红 G664 光面毛光板",180＊60＊1．8,31元/平方米,福建省万达石材有限公司,福建,2018-03-11,"500 平方米",外墙，地铺，广场，市政道路等,"罗源红,G664,路沿石,墓碑,火烧板,工程板",福建福州市罗源县西兰墩厝开发区,张祥辉,,86-0591-26921066,13489128599,86-0591-26925885,982523673@QQ．COM
408,1,"2018-09-29 03:45:12",福建,408,"2018-09-29 05:07:15",罗源红路沿石,950＊300＊150,800元/立方米,福建省万达石材有限公司,福建罗源,2018-03-11,"14 立方米",外墙，地铺，广场，市政道路等,"罗源红,G664,路沿石,墓碑,火烧板,工程板",福建福州市罗源县西兰墩厝开发区,张祥辉,,86-0591-26921066,13489128599,86-0591-26925885,982523673@QQ．COM
409,1,"2018-09-29 03:45:12",福建,409,"2018-09-29 05:07:15",罗源红火烧板,600＊300＊30,32元/平方米,福建省万达石材有限公司,福建,2018-03-11,"450 平方米",外墙，地铺，广场，市政道路等,"罗源红,G664,路沿石,墓碑,火烧板,工程板",福建福州市罗源县西兰墩厝开发区,张祥辉,,86-0591-26921066,13489128599,86-0591-26925885,982523673@QQ．COM
410,1,"2018-09-29 03:45:12",福建,410,"2018-09-29 05:07:15","罗源红G664 光面 磨光板",180＊60＊1．5,285元/平方米,福建省万达石材有限公司,福建罗源,2018-03-11,"800 平方米",外墙，地铺，广场，市政道路等,"罗源红,G664,路沿石,墓碑,火烧板,工程板",福建福州市罗源县西兰墩厝开发区,张祥辉,,86-0591-26921066,13489128599,86-0591-26925885,982523673@QQ．COM
411,1,"2018-09-29 03:45:12",福建,411,"2018-09-29 05:07:15","G654 50MM 磨光毛板","50MM 磨光毛板",70元/平方米,福建省鹏腾石材有限公司,漳州长泰,2018-02-28,平方米,,批发石材；花岗岩；大理石,福建漳州市林墩工业区,林先生,363904,86-0596-8299871,13306967840,86-0596-8267840,pengteng2006@163．com
412,1,"2018-09-29 03:45:12",福建,412,"2018-09-29 05:07:15","黄锈石 30MM 磨光毛板",30MM磨光毛板,70元/平方米,福建省鹏腾石材有限公司,漳州长泰,2018-02-28,平方米,,批发石材；花岗岩；大理石,福建漳州市林墩工业区,林先生,363904,86-0596-8299871,13306967840,86-0596-8267840,pengteng2006@163．com
413,1,"2018-09-29 03:45:12",福建,413,"2018-09-29 05:07:15","G654 20MM 磨光毛板",20MM磨光毛板,50元/平方米,福建省鹏腾石材有限公司,漳州长泰,2018-02-28,平方米,,批发石材；花岗岩；大理石,福建漳州市林墩工业区,林先生,363904,86-0596-8299871,13306967840,86-0596-8267840,pengteng2006@163．com
414,1,"2018-09-29 03:45:12",福建,414,"2018-09-29 05:07:15","G654 25MM磨光毛板","25MM 磨光毛板",55元/平方米,福建省鹏腾石材有限公司,漳州长泰,2018-02-28,平方米,,批发石材；花岗岩；大理石,福建漳州市林墩工业区,林先生,363904,86-0596-8299871,13306967840,86-0596-8267840,pengteng2006@163．com
415,1,"2018-09-29 03:45:12",福建,415,"2018-09-29 03:42:47",芝麻黑,300＊600＊15,60元/平方米,三海石业,福建林墩,2018-01-17,,,,,,,,,,
416,1,"2018-09-29 03:45:12",福建,416,"2018-09-29 03:42:47",背景墙,按尺寸定制,00000元/平方米,源隆石材,福建水头,2018-01-15,,,,,,,,,,
417,1,"2018-09-29 03:45:12",福建,417,"2018-09-29 03:42:47",水刀拼花,按尺寸定制,00000元/平方米,源隆石材,福建水头,2018-01-15,,,,,,,,,,
418,1,"2018-09-29 03:45:12",福建,418,"2018-09-29 03:42:47",爵士白,正常板,108元/平方米,仁豪石材有限公司,水头,2018-01-14,,,,,,,,,,
419,1,"2018-09-29 03:45:12",福建,419,"2018-09-29 03:42:47",香妃玉兰,正常板,188元/平方米,仁豪石材有限公司,水头,2018-01-14,,,,,,,,,,
420,1,"2018-09-29 03:45:12",福建,420,"2018-09-29 03:42:47",西班牙米黄,正常班,98元/平方米,仁豪石材有限公司,福建,2018-01-14,,,,,,,,,,
421,1,"2018-09-29 03:45:12",福建,421,"2018-09-29 03:42:47",中欧米黄,正常板,128起元/平方米,仁豪石材有限公司,福建水头,2018-01-14,,,,,,,,,,
422,1,"2018-09-29 03:45:12",福建,422,"2018-09-29 03:42:47",奥特曼,正常板,128起元/平方米,仁豪石材有限公司,福建水头,2018-01-14,,,,,,,,,,
423,1,"2018-09-29 03:45:12",福建,423,"2018-09-29 03:42:47",新莎安娜（闪电米黄）,正常板,118起元/平方米,仁豪石材有限公司,福建水头,2018-01-14,,,,,,,,,,
424,1,"2018-09-29 03:45:12",福建,424,"2018-09-29 03:42:47",新卡曼,正常板,108元/平方米,仁豪石材有限公司,福建水头,2018-01-14,,,,,,,,,,
425,1,"2018-09-29 03:45:12",福建,425,"2018-09-29 03:42:47",香奈金,正常板,118元/平方米,仁豪石材有限公司,福建水头,2018-01-14,,,,,,,,,,
426,1,"2018-09-29 03:45:12",福建,426,"2018-09-29 03:42:47",香妃米黄,正常板,128元/平方米,仁豪石材有限公司,福建水头,2018-01-14,,,,,,,,,,
427,1,"2018-09-29 03:45:12",福建,427,"2018-09-29 03:42:47",松香玉,正常板,168元/平方米,仁豪石材有限公司,福建水头,2018-01-14,,,,,,,,,,
428,1,"2018-09-29 03:45:12",福建,428,"2018-09-29 03:42:47",深啡网,正常板,118元/平方米,仁豪石材有限公司,福建水头,2018-01-14,,,,,,,,,,
429,1,"2018-09-29 03:45:12",福建,429,"2018-09-29 03:42:47",浅啡网,正常板,99元/平方米,仁豪石材有限公司,福建水头,2018-01-14,,,,,,,,,,
442,1,"2018-09-29 03:45:12",福建,442,"2018-09-29 03:42:48",木纹玉,正常板,168元/平方米,仁豪石材有限公司,福建水头,2018-01-14,,,,,,,,,,
443,1,"2018-09-29 03:45:12",福建,443,"2018-09-29 03:42:48",卡曼,正常板,99元/平方米,仁豪石材有限公司,福建水头,2018-01-14,,,,,,,,,,
444,1,"2018-09-29 03:45:12",福建,444,"2018-09-29 03:42:48",灰玫瑰,正常板,128元/平方米,仁豪石材有限公司,福建水头,2018-01-14,,,,,,,,,,
445,1,"2018-09-29 03:45:12",福建,445,"2018-09-29 03:42:50",皇室啡,条板,0元/平方米,南安市鸿河石材,福建水头,2018-01-05,,,,,,,,,,
446,1,"2018-09-29 03:45:12",福建,446,"2018-09-29 03:42:50",星空黑,条板,0元/平方米,南安市鸿河石材,福建水头,2018-01-05,,,,,,,,,,
447,1,"2018-09-29 03:45:12",福建,447,"2018-09-29 03:42:50",英国棕红底,0,0元/平方米,南安市鸿河石材,印度,2018-01-05,,,,,,,,,,
448,1,"2018-09-29 03:45:12",福建,448,"2018-09-29 03:42:50",幻影蓝,各种规格,0元/平方米,南安市鸿河石材,乌克兰,2018-01-05,,,,,,,,,,
449,1,"2018-09-29 03:45:12",福建,449,"2018-09-29 03:42:50",蓝珍珠,各种规格,0元/平方米,南安市鸿河石材,挪威,2018-01-05,,,,,,,,,,
450,1,"2018-09-29 03:45:12",福建,450,"2018-09-29 03:42:50",皇家啡珠,各种尺寸,0元/平方米,南安市鸿河石材,福建水头,2018-01-05,,,,,,,,,,
451,1,"2018-09-29 03:45:12",福建,451,"2018-09-29 03:42:50",印度红玫瑰,,0元/平方米,南安市鸿河石材,印度,2018-01-05,,,,,,,,,,
452,1,"2018-09-29 03:45:12",福建,452,"2018-09-29 03:42:50",绿星,,0元/平方米,南安市鸿河石材,挪威,2018-01-05,,,,,,,,,,
453,1,"2018-09-29 03:45:12",福建,453,"2018-09-29 03:42:50",银珠,1800－3200,0元/平方米,南安市鸿河石材,挪威,2018-01-05,,,,,,,,,,
454,1,"2018-09-29 03:45:12",福建,454,"2018-09-29 03:42:50",红钻,条板,0元/平方米,南安市鸿河石材,福建水头,2018-01-05,,,,,,,,,,
455,1,"2018-09-29 03:45:12",福建,455,"2018-09-29 03:42:50",啡钻,0,0元/平方米,南安市鸿河石材,,2018-01-05,,,,,,,,,,
456,1,"2018-09-29 03:45:12",福建,456,"2018-09-29 03:42:50",红棕,条板,0元/平方米,南安市鸿河石材,福建水头,2018-01-05,,,,,,,,,,
457,1,"2018-09-29 03:45:12",福建,457,"2018-09-29 03:42:50",英国棕,条板,0元/平方米,南安市鸿河石材,福建水头,2018-01-05,,,,,,,,,,
458,1,"2018-09-29 03:45:12",福建,458,"2018-09-29 05:07:27",福鼎黑,300×600×30,170元/平方米,福鼎市汇丰石材,福鼎,2017-12-26,"150 平方米",地铺，干挂,福鼎黑，珍珠黑，福寿红，福建青,福建宁德市福鼎市白琳镇金山工业区汇丰石材厂,杨,,86--,13559917183,86--,181421589@139．com
459,1,"2018-09-29 03:45:12",福建,459,"2018-09-29 03:42:50",大量云多拉灰、古堡灰特价处理,都是大料,158元/平方米,顺石石材,土耳其,2017-12-15,,,,,,,,,,
460,1,"2018-09-29 03:45:12",福建,460,"2018-09-29 03:42:52",2000平1．8厚老矿白玉兰特价处理,各个规格,200元/平方米,顺石石材,土耳其,2017-12-06,,,,,,,,,,
461,1,"2018-09-29 03:45:12",福建,461,"2018-09-29 03:42:52",200平精品翡翠白玉，松青白玉特价处理,2200×1400,200左右元/平方米,顺石石材,缅甸,2017-12-06,,,,,,,,,,
462,1,"2018-09-29 03:45:12",福建,462,"2018-09-29 03:42:52",2000平老矿白玉兰特价处理1．8厚,各种尺寸,200左右元/平方米,顺石石材,土耳其,2017-12-06,,,,,,,,,,
463,1,"2018-09-29 03:45:12",福建,463,"2018-09-29 03:42:52",法国石灰石,300x300x280,288元/平方米,罗衡石业,法国,2017-12-05,,,,,,,,,,
464,1,"2018-09-29 03:45:12",福建,464,"2018-09-29 03:42:52",法国米黄荒料,300x300x280,888元/立方米,罗衡石业,法国,2017-12-05,,,,,,,,,,
465,1,"2018-09-29 03:45:12",福建,465,"2018-09-29 03:42:52",法国砂岩荒料,300x300x280,888元/立方米,罗衡石业,法国,2017-12-05,,,,,,,,,,
466,1,"2018-09-29 03:45:12",福建,466,"2018-09-29 05:07:32",承接，石材设计，效果图，施工图，下料,,1元/平方米,惠明石材装饰设计有限公司,福建泉州惠安,2017-11-24,"1 平方米",承接，石材设计，效果图，施工图，下料放样，预算，,石材设计，效果图，施工图，下料放样，预算，结算,福建泉州市惠安县建筑业发展大厦一号楼7层,陈志杰,362100,86-0595-87250330,15060612505,86--,178550655@qq．com
467,1,"2018-09-29 03:45:12",福建,467,"2018-09-29 03:42:52",灰姑娘,2400×1800×18㎜,100元/平方米,广宏石业,福建水头,2017-11-21,,,,,,,,,,
468,1,"2018-09-29 03:45:12",福建,468,"2018-09-29 05:07:32",霸王花·啡慕斯·金钱花·灰姑娘,,6000元/立方米,弘鑫石材,,2017-11-21,,,"霸王花，啡慕斯，金钱花，金镶玉，大板.荒料 首页 公司简介 产品展示 产品价格 供应信息 求购信息 工程案例 公司图片 在线留言 联系我们 产品分类 霸王花 金钱花 啡慕斯 金镶玉 金镶玉 全部产品 产品价格 现货信息 产品搜索 function so(){if(document.getElementById(""searchtext"").value!="""") window.location.href=""search.aspx?Key=""+document.getElementById(""searchtex",,,,,,,
469,1,"2018-09-29 03:45:12",福建,469,"2018-09-29 03:42:52",G688芝麻灰火烧面干挂板,600×600×30mm,85元/平方米,厦门龙腾顺石业有限责任公司,福建漳浦,2017-11-09,,,,,,,,,,
470,1,"2018-09-29 03:45:12",福建,470,"2018-09-29 03:42:52",黄金麻,1800＊600＊25,1元/平方米,金亿石材,随州,2017-11-08,,,,,,,,,,
471,1,"2018-09-29 03:45:12",福建,471,"2018-09-29 03:42:52",随州白麻,1800＊600＊25,1元/平方米,金亿石材,随州,2017-11-08,,,,,,,,,,
472,1,"2018-09-29 03:45:12",福建,472,"2018-09-29 03:42:52",卡基诺金（卡奇诺金）,1800＊600＊25,1元/平方米,金亿石材,湖北,2017-11-08,,,,,,,,,,
473,1,"2018-09-29 03:45:12",福建,473,"2018-09-29 03:42:52",皇室香槟,1800＊600＊25,1元/平方米,金亿石材,福建,2017-11-08,,,,,,,,,,
474,1,"2018-09-29 03:45:12",福建,474,"2018-09-29 03:42:52",皇室香槟,,1元/平方米,金亿石材,福建,2017-11-08,,,,,,,,,,
475,1,"2018-09-29 03:45:12",福建,475,"2018-09-29 03:42:53",金典凤凰,,200元/平方米,福建崇祥石材有限公司,,2017-11-08,,,,,,,,,,
476,1,"2018-09-29 03:45:12",福建,476,"2018-09-29 05:07:33",栏杆,600－－－120－－－120,18元/米,豪顺石业,,2017-10-27,"100 米",,栏杆，圆球，火烧板。,福建南安市福建省南安市石井镇，延平大道泉兴楼。,李永辉,,86--,15179398911,86--,15179398911@139．com
477,1,"2018-09-29 03:45:12",福建,477,"2018-09-29 03:42:53",白玉兰,,4200元/吨,联盈石业,,2017-10-15,,,,,,,,,,
478,1,"2018-09-29 03:45:12",福建,478,"2018-09-29 03:42:53",芝麻黑烧面,,40元/平方米,长泰县秋伟石业,,2017-10-05,,,,,,,,,,
479,1,"2018-09-29 03:45:12",福建,479,"2018-09-29 05:07:33",石材夹具吊钳石板夹板材吊具大板吊夹钳,6寸,255元/件,中国峰發石材夹具,福建水头,2017-10-01,"1 件",吊装搬运,石材夹具吊钳,福建泉州市海联创业园,苏经理,,86-0595-86980000,13489300503,86-8698-4664497,13489300503@139．com
480,1,"2018-09-29 03:45:12",福建,480,"2018-09-29 05:07:33",石材夹具吊钳石板夹板材吊具大板吊夹钳,进口板夹,1450元/台,中国峰發石材夹具,福建水头,2017-10-01,"1 台",吊装搬运,石材夹具吊钳,福建泉州市海联创业园,苏经理,,86-0595-86980000,13489300503,86-8698-4664497,13489300503@139．com
481,1,"2018-09-29 03:45:12",福建,481,"2018-09-29 05:07:33",石材夹具吊钳石板夹板材吊具大板吊夹钳,23寸,330元/件,中国峰發石材夹具,福建水头,2017-10-01,"1 件",石材吊装搬运,石材夹具吊钳,福建泉州市海联创业园,苏经理,,86-0595-86980000,13489300503,86-8698-4664497,13489300503@139．com
482,1,"2018-09-29 03:45:12",福建,482,"2018-09-29 03:42:53",新雪花白,,100元/平方米,火星石业,,2017-09-18,,,,,,,,,,
483,1,"2018-09-29 03:45:12",福建,483,"2018-09-29 03:42:53",新雪花白,,100元/平方米,火星石业,,2017-09-18,,,,,,,,,,
