image.id,image.ts,supermarket.id,supermarket.ts,supermarket.title,supermarket.address,supermarket.overall_rating,supermarket.cuisine,supermarket.meals,supermarket.restaurant_features,supermarket.good_for,supermarket.phone
1,"2018-04-13 03:20:30",1,"2018-04-13 03:20:30","Times Supermarket","3350 Lower Honoapiilani Rd, Lahaina, Maui, Hawaii",4.5,,Lunch,"Takeout, Parking Available, Wheelchair Accessible","Kids, Families with children",
2,"2018-04-13 03:20:30",1,"2018-04-13 03:20:30","Times Supermarket","3350 Lower Honoapiilani Rd, Lahaina, Maui, Hawaii",4.5,,Lunch,"Takeout, Parking Available, Wheelchair Accessible","Kids, Families with children",
3,"2018-04-13 03:20:30",1,"2018-04-13 03:20:30","Times Supermarket","3350 Lower Honoapiilani Rd, Lahaina, Maui, Hawaii",4.5,,Lunch,"Takeout, Parking Available, Wheelchair Accessible","Kids, Families with children",
4,"2018-04-13 03:20:36",2,"2018-04-13 03:20:36","Food Pantry","2370 Kuhio Ave, Honolulu, Oahu, Hawaii",4.0,,,,,"+1 808-923-9831"
5,"2018-04-13 03:20:36",2,"2018-04-13 03:20:36","Food Pantry","2370 Kuhio Ave, Honolulu, Oahu, Hawaii",4.0,,,,,"+1 808-923-9831"
6,"2018-04-13 03:20:36",2,"2018-04-13 03:20:36","Food Pantry","2370 Kuhio Ave, Honolulu, Oahu, Hawaii",4.0,,,,,"+1 808-923-9831"
7,"2018-04-13 03:20:36",2,"2018-04-13 03:20:36","Food Pantry","2370 Kuhio Ave, Honolulu, Oahu, Hawaii",4.0,,,,,"+1 808-923-9831"
8,"2018-04-13 03:20:36",2,"2018-04-13 03:20:36","Food Pantry","2370 Kuhio Ave, Honolulu, Oahu, Hawaii",4.0,,,,,"+1 808-923-9831"
9,"2018-04-13 03:20:36",2,"2018-04-13 03:20:36","Food Pantry","2370 Kuhio Ave, Honolulu, Oahu, Hawaii",4.0,,,,,"+1 808-923-9831"
10,"2018-04-13 03:20:36",2,"2018-04-13 03:20:36","Food Pantry","2370 Kuhio Ave, Honolulu, Oahu, Hawaii",4.0,,,,,"+1 808-923-9831"
11,"2018-04-13 03:20:36",2,"2018-04-13 03:20:36","Food Pantry","2370 Kuhio Ave, Honolulu, Oahu, Hawaii",4.0,,,,,"+1 808-923-9831"
12,"2018-04-13 03:20:36",2,"2018-04-13 03:20:36","Food Pantry","2370 Kuhio Ave, Honolulu, Oahu, Hawaii",4.0,,,,,"+1 808-923-9831"
13,"2018-04-13 03:20:39",3,"2018-04-13 03:20:39","Triton Supermarket Diner","2715 Collins Ave, Miami Beach, Florida",4.0,,"Lunch, Brunch, Breakfast, Dinner","Takeout, Wheelchair Accessible","Families with children","+1 305-534-4774"
14,"2018-04-13 03:20:39",3,"2018-04-13 03:20:39","Triton Supermarket Diner","2715 Collins Ave, Miami Beach, Florida",4.0,,"Lunch, Brunch, Breakfast, Dinner","Takeout, Wheelchair Accessible","Families with children","+1 305-534-4774"
15,"2018-04-13 03:20:39",3,"2018-04-13 03:20:39","Triton Supermarket Diner","2715 Collins Ave, Miami Beach, Florida",4.0,,"Lunch, Brunch, Breakfast, Dinner","Takeout, Wheelchair Accessible","Families with children","+1 305-534-4774"
16,"2018-04-13 03:20:39",3,"2018-04-13 03:20:39","Triton Supermarket Diner","2715 Collins Ave, Miami Beach, Florida",4.0,,"Lunch, Brunch, Breakfast, Dinner","Takeout, Wheelchair Accessible","Families with children","+1 305-534-4774"
17,"2018-04-13 03:20:39",3,"2018-04-13 03:20:39","Triton Supermarket Diner","2715 Collins Ave, Miami Beach, Florida",4.0,,"Lunch, Brunch, Breakfast, Dinner","Takeout, Wheelchair Accessible","Families with children","+1 305-534-4774"
18,"2018-04-13 03:20:43",4,"2018-04-13 03:20:43","El Nuevo Siglo Supermarket","1305 SW 8th St Fl 33135, Miami, Florida",4.5,,"Breakfast, Lunch, Dinner","Takeout, Seating, Waitstaff","Families with children",
19,"2018-04-13 03:20:43",4,"2018-04-13 03:20:43","El Nuevo Siglo Supermarket","1305 SW 8th St Fl 33135, Miami, Florida",4.5,,"Breakfast, Lunch, Dinner","Takeout, Seating, Waitstaff","Families with children",
20,"2018-04-13 03:20:43",4,"2018-04-13 03:20:43","El Nuevo Siglo Supermarket","1305 SW 8th St Fl 33135, Miami, Florida",4.5,,"Breakfast, Lunch, Dinner","Takeout, Seating, Waitstaff","Families with children",
21,"2018-04-13 03:20:43",4,"2018-04-13 03:20:43","El Nuevo Siglo Supermarket","1305 SW 8th St Fl 33135, Miami, Florida",4.5,,"Breakfast, Lunch, Dinner","Takeout, Seating, Waitstaff","Families with children",
22,"2018-04-13 03:20:43",4,"2018-04-13 03:20:43","El Nuevo Siglo Supermarket","1305 SW 8th St Fl 33135, Miami, Florida",4.5,,"Breakfast, Lunch, Dinner","Takeout, Seating, Waitstaff","Families with children",
23,"2018-04-13 03:20:43",4,"2018-04-13 03:20:43","El Nuevo Siglo Supermarket","1305 SW 8th St Fl 33135, Miami, Florida",4.5,,"Breakfast, Lunch, Dinner","Takeout, Seating, Waitstaff","Families with children",
24,"2018-04-13 03:20:56",8,"2018-04-13 03:20:56","Supermarket Acapulco Tropical","3525 1st St, Bradenton, Florida",4.5,,"Lunch, Breakfast, Dinner","Takeout, Seating, Wheelchair Accessible","Kids, Families with children","+1 941-744-1034"
25,"2018-04-13 03:20:56",8,"2018-04-13 03:20:56","Supermarket Acapulco Tropical","3525 1st St, Bradenton, Florida",4.5,,"Lunch, Breakfast, Dinner","Takeout, Seating, Wheelchair Accessible","Kids, Families with children","+1 941-744-1034"
26,"2018-04-13 03:20:56",8,"2018-04-13 03:20:56","Supermarket Acapulco Tropical","3525 1st St, Bradenton, Florida",4.5,,"Lunch, Breakfast, Dinner","Takeout, Seating, Wheelchair Accessible","Kids, Families with children","+1 941-744-1034"
27,"2018-04-13 03:20:56",8,"2018-04-13 03:20:56","Supermarket Acapulco Tropical","3525 1st St, Bradenton, Florida",4.5,,"Lunch, Breakfast, Dinner","Takeout, Seating, Wheelchair Accessible","Kids, Families with children","+1 941-744-1034"
28,"2018-04-13 03:20:56",8,"2018-04-13 03:20:56","Supermarket Acapulco Tropical","3525 1st St, Bradenton, Florida",4.5,,"Lunch, Breakfast, Dinner","Takeout, Seating, Wheelchair Accessible","Kids, Families with children","+1 941-744-1034"
29,"2018-04-13 03:20:56",8,"2018-04-13 03:20:56","Supermarket Acapulco Tropical","3525 1st St, Bradenton, Florida",4.5,,"Lunch, Breakfast, Dinner","Takeout, Seating, Wheelchair Accessible","Kids, Families with children","+1 941-744-1034"
30,"2018-04-13 03:20:56",8,"2018-04-13 03:20:56","Supermarket Acapulco Tropical","3525 1st St, Bradenton, Florida",4.5,,"Lunch, Breakfast, Dinner","Takeout, Seating, Wheelchair Accessible","Kids, Families with children","+1 941-744-1034"
31,"2018-04-13 03:20:56",8,"2018-04-13 03:20:56","Supermarket Acapulco Tropical","3525 1st St, Bradenton, Florida",4.5,,"Lunch, Breakfast, Dinner","Takeout, Seating, Wheelchair Accessible","Kids, Families with children","+1 941-744-1034"
32,"2018-04-13 03:20:56",8,"2018-04-13 03:20:56","Supermarket Acapulco Tropical","3525 1st St, Bradenton, Florida",4.5,,"Lunch, Breakfast, Dinner","Takeout, Seating, Wheelchair Accessible","Kids, Families with children","+1 941-744-1034"
33,"2018-04-13 03:21:11",11,"2018-04-13 03:21:11","El Patron Supermarket","1455 US Highway 17 S, Bartow, Florida",4.5,,,,,"+1 863-533-4600"
34,"2018-04-13 03:21:11",11,"2018-04-13 03:21:11","El Patron Supermarket","1455 US Highway 17 S, Bartow, Florida",4.5,,,,,"+1 863-533-4600"
35,"2018-04-13 03:21:11",11,"2018-04-13 03:21:11","El Patron Supermarket","1455 US Highway 17 S, Bartow, Florida",4.5,,,,,"+1 863-533-4600"
36,"2018-04-13 03:21:11",11,"2018-04-13 03:21:11","El Patron Supermarket","1455 US Highway 17 S, Bartow, Florida",4.5,,,,,"+1 863-533-4600"
37,"2018-04-13 03:21:11",11,"2018-04-13 03:21:11","El Patron Supermarket","1455 US Highway 17 S, Bartow, Florida",4.5,,,,,"+1 863-533-4600"
38,"2018-04-13 03:21:11",11,"2018-04-13 03:21:11","El Patron Supermarket","1455 US Highway 17 S, Bartow, Florida",4.5,,,,,"+1 863-533-4600"
39,"2018-04-13 03:21:11",11,"2018-04-13 03:21:11","El Patron Supermarket","1455 US Highway 17 S, Bartow, Florida",4.5,,,,,"+1 863-533-4600"
40,"2018-04-13 03:21:11",11,"2018-04-13 03:21:11","El Patron Supermarket","1455 US Highway 17 S, Bartow, Florida",4.5,,,,,"+1 863-533-4600"
41,"2018-04-13 03:21:15",12,"2018-04-13 03:21:15","Apple Tree Supermarket","1225 Amsterdam Ave, New York City, New York",4.0,,"Breakfast, Lunch, Dinner",,,"+1 212-865-8840"
42,"2018-04-13 03:21:15",12,"2018-04-13 03:21:15","Apple Tree Supermarket","1225 Amsterdam Ave, New York City, New York",4.0,,"Breakfast, Lunch, Dinner",,,"+1 212-865-8840"
43,"2018-04-13 03:21:20",13,"2018-04-13 03:21:20","Times Supermarkets","590 Kailua Rd, Honolulu, Oahu, Hawaii",4.0,,,"Wheelchair Accessible",,"+1 808-266-4004"
44,"2018-04-13 03:21:20",13,"2018-04-13 03:21:20","Times Supermarkets","590 Kailua Rd, Honolulu, Oahu, Hawaii",4.0,,,"Wheelchair Accessible",,"+1 808-266-4004"
45,"2018-04-13 03:21:20",13,"2018-04-13 03:21:20","Times Supermarkets","590 Kailua Rd, Honolulu, Oahu, Hawaii",4.0,,,"Wheelchair Accessible",,"+1 808-266-4004"
46,"2018-04-13 03:21:20",13,"2018-04-13 03:21:20","Times Supermarkets","590 Kailua Rd, Honolulu, Oahu, Hawaii",4.0,,,"Wheelchair Accessible",,"+1 808-266-4004"
47,"2018-04-13 03:21:40",18,"2018-04-13 03:21:40","Greenland Supermarket","6850 Spring Mountain Rd, Las Vegas, Nevada",4.5,,,,,"+1 702-459-7878"
48,"2018-04-13 03:21:40",18,"2018-04-13 03:21:40","Greenland Supermarket","6850 Spring Mountain Rd, Las Vegas, Nevada",4.5,,,,,"+1 702-459-7878"
49,"2018-04-13 03:21:40",18,"2018-04-13 03:21:40","Greenland Supermarket","6850 Spring Mountain Rd, Las Vegas, Nevada",4.5,,,,,"+1 702-459-7878"
50,"2018-04-13 03:21:40",18,"2018-04-13 03:21:40","Greenland Supermarket","6850 Spring Mountain Rd, Las Vegas, Nevada",4.5,,,,,"+1 702-459-7878"
51,"2018-04-13 03:21:40",18,"2018-04-13 03:21:40","Greenland Supermarket","6850 Spring Mountain Rd, Las Vegas, Nevada",4.5,,,,,"+1 702-459-7878"
52,"2018-04-13 03:21:40",18,"2018-04-13 03:21:40","Greenland Supermarket","6850 Spring Mountain Rd, Las Vegas, Nevada",4.5,,,,,"+1 702-459-7878"
53,"2018-04-13 03:21:40",18,"2018-04-13 03:21:40","Greenland Supermarket","6850 Spring Mountain Rd, Las Vegas, Nevada",4.5,,,,,"+1 702-459-7878"
54,"2018-04-13 03:21:40",18,"2018-04-13 03:21:40","Greenland Supermarket","6850 Spring Mountain Rd, Las Vegas, Nevada",4.5,,,,,"+1 702-459-7878"
55,"2018-04-13 03:21:40",18,"2018-04-13 03:21:40","Greenland Supermarket","6850 Spring Mountain Rd, Las Vegas, Nevada",4.5,,,,,"+1 702-459-7878"
56,"2018-04-13 03:21:45",19,"2018-04-13 03:21:45","The Best Stop Supermarket","615 Highway 93 N, Scott, Lafayette Parish, Louisiana",4.5,,,,,"+1 337-233-5805"
57,"2018-04-13 03:21:45",19,"2018-04-13 03:21:45","The Best Stop Supermarket","615 Highway 93 N, Scott, Lafayette Parish, Louisiana",4.5,,,,,"+1 337-233-5805"
58,"2018-04-13 03:21:45",19,"2018-04-13 03:21:45","The Best Stop Supermarket","615 Highway 93 N, Scott, Lafayette Parish, Louisiana",4.5,,,,,"+1 337-233-5805"
59,"2018-04-13 03:21:45",19,"2018-04-13 03:21:45","The Best Stop Supermarket","615 Highway 93 N, Scott, Lafayette Parish, Louisiana",4.5,,,,,"+1 337-233-5805"
60,"2018-04-13 03:21:45",19,"2018-04-13 03:21:45","The Best Stop Supermarket","615 Highway 93 N, Scott, Lafayette Parish, Louisiana",4.5,,,,,"+1 337-233-5805"
61,"2018-04-13 03:21:45",19,"2018-04-13 03:21:45","The Best Stop Supermarket","615 Highway 93 N, Scott, Lafayette Parish, Louisiana",4.5,,,,,"+1 337-233-5805"
62,"2018-04-13 03:21:45",19,"2018-04-13 03:21:45","The Best Stop Supermarket","615 Highway 93 N, Scott, Lafayette Parish, Louisiana",4.5,,,,,"+1 337-233-5805"
63,"2018-04-13 03:21:45",19,"2018-04-13 03:21:45","The Best Stop Supermarket","615 Highway 93 N, Scott, Lafayette Parish, Louisiana",4.5,,,,,"+1 337-233-5805"
64,"2018-04-13 03:21:45",19,"2018-04-13 03:21:45","The Best Stop Supermarket","615 Highway 93 N, Scott, Lafayette Parish, Louisiana",4.5,,,,,"+1 337-233-5805"
65,"2018-04-13 03:21:55",22,"2018-04-13 03:21:55","Best Stop Supermarket","615 Highway 93 N, Scott, Lafayette Parish, Louisiana",4.5,,"Lunch, Dinner","Takeout, Wheelchair Accessible","Families with children, Kids","+1 337-233-5805"
66,"2018-04-13 03:21:55",22,"2018-04-13 03:21:55","Best Stop Supermarket","615 Highway 93 N, Scott, Lafayette Parish, Louisiana",4.5,,"Lunch, Dinner","Takeout, Wheelchair Accessible","Families with children, Kids","+1 337-233-5805"
67,"2018-04-13 03:21:55",22,"2018-04-13 03:21:55","Best Stop Supermarket","615 Highway 93 N, Scott, Lafayette Parish, Louisiana",4.5,,"Lunch, Dinner","Takeout, Wheelchair Accessible","Families with children, Kids","+1 337-233-5805"
68,"2018-04-13 03:21:55",22,"2018-04-13 03:21:55","Best Stop Supermarket","615 Highway 93 N, Scott, Lafayette Parish, Louisiana",4.5,,"Lunch, Dinner","Takeout, Wheelchair Accessible","Families with children, Kids","+1 337-233-5805"
69,"2018-04-13 03:21:55",22,"2018-04-13 03:21:55","Best Stop Supermarket","615 Highway 93 N, Scott, Lafayette Parish, Louisiana",4.5,,"Lunch, Dinner","Takeout, Wheelchair Accessible","Families with children, Kids","+1 337-233-5805"
70,"2018-04-13 03:21:55",22,"2018-04-13 03:21:55","Best Stop Supermarket","615 Highway 93 N, Scott, Lafayette Parish, Louisiana",4.5,,"Lunch, Dinner","Takeout, Wheelchair Accessible","Families with children, Kids","+1 337-233-5805"
71,"2018-04-13 03:21:55",22,"2018-04-13 03:21:55","Best Stop Supermarket","615 Highway 93 N, Scott, Lafayette Parish, Louisiana",4.5,,"Lunch, Dinner","Takeout, Wheelchair Accessible","Families with children, Kids","+1 337-233-5805"
72,"2018-04-13 03:21:55",22,"2018-04-13 03:21:55","Best Stop Supermarket","615 Highway 93 N, Scott, Lafayette Parish, Louisiana",4.5,,"Lunch, Dinner","Takeout, Wheelchair Accessible","Families with children, Kids","+1 337-233-5805"
73,"2018-04-13 03:21:55",22,"2018-04-13 03:21:55","Best Stop Supermarket","615 Highway 93 N, Scott, Lafayette Parish, Louisiana",4.5,,"Lunch, Dinner","Takeout, Wheelchair Accessible","Families with children, Kids","+1 337-233-5805"
74,"2018-04-13 03:22:00",23,"2018-04-13 03:22:00","Seafood City Supermarket","8955 Mira Mesa Blvd, San Diego, California",3.0,,"Breakfast, Lunch, Dinner",Takeout,"Families with children",
75,"2018-04-13 03:22:00",23,"2018-04-13 03:22:00","Seafood City Supermarket","8955 Mira Mesa Blvd, San Diego, California",3.0,,"Breakfast, Lunch, Dinner",Takeout,"Families with children",
76,"2018-04-13 03:22:00",23,"2018-04-13 03:22:00","Seafood City Supermarket","8955 Mira Mesa Blvd, San Diego, California",3.0,,"Breakfast, Lunch, Dinner",Takeout,"Families with children",
77,"2018-04-13 03:22:00",23,"2018-04-13 03:22:00","Seafood City Supermarket","8955 Mira Mesa Blvd, San Diego, California",3.0,,"Breakfast, Lunch, Dinner",Takeout,"Families with children",
78,"2018-04-13 03:22:00",23,"2018-04-13 03:22:00","Seafood City Supermarket","8955 Mira Mesa Blvd, San Diego, California",3.0,,"Breakfast, Lunch, Dinner",Takeout,"Families with children",
79,"2018-04-13 03:22:05",24,"2018-04-13 03:22:05","Riverside Supermarket","491 S Main St, Boerne, Texas",4.5,,"Lunch, Dinner","Takeout, Seating, Wheelchair Accessible","Families with children","+1 830-249-2546"
80,"2018-04-13 03:22:07",25,"2018-04-13 03:22:07","United Supermarkets Arena","1701 Indiana Ave, Lubbock, Texas",4.5,,,,,"+1 806-742-7362"
81,"2018-04-13 03:22:07",25,"2018-04-13 03:22:07","United Supermarkets Arena","1701 Indiana Ave, Lubbock, Texas",4.5,,,,,"+1 806-742-7362"
82,"2018-04-13 03:22:07",25,"2018-04-13 03:22:07","United Supermarkets Arena","1701 Indiana Ave, Lubbock, Texas",4.5,,,,,"+1 806-742-7362"
83,"2018-04-13 03:22:07",25,"2018-04-13 03:22:07","United Supermarkets Arena","1701 Indiana Ave, Lubbock, Texas",4.5,,,,,"+1 806-742-7362"
84,"2018-04-13 03:22:07",25,"2018-04-13 03:22:07","United Supermarkets Arena","1701 Indiana Ave, Lubbock, Texas",4.5,,,,,"+1 806-742-7362"
85,"2018-04-13 03:22:07",25,"2018-04-13 03:22:07","United Supermarkets Arena","1701 Indiana Ave, Lubbock, Texas",4.5,,,,,"+1 806-742-7362"
86,"2018-04-13 03:22:07",25,"2018-04-13 03:22:07","United Supermarkets Arena","1701 Indiana Ave, Lubbock, Texas",4.5,,,,,"+1 806-742-7362"
87,"2018-04-13 03:22:07",25,"2018-04-13 03:22:07","United Supermarkets Arena","1701 Indiana Ave, Lubbock, Texas",4.5,,,,,"+1 806-742-7362"
88,"2018-04-13 03:22:07",25,"2018-04-13 03:22:07","United Supermarkets Arena","1701 Indiana Ave, Lubbock, Texas",4.5,,,,,"+1 806-742-7362"
89,"2018-04-13 03:22:10",26,"2018-04-13 03:22:10","Z Deli Discount Supermarket","803 8th Ave, New York City, New York",4.5,,"Breakfast, Lunch, Dinner, Brunch","Takeout, Seating, Delivery","Families with children, Kids","+1 212-315-1659"
90,"2018-04-13 03:22:10",26,"2018-04-13 03:22:10","Z Deli Discount Supermarket","803 8th Ave, New York City, New York",4.5,,"Breakfast, Lunch, Dinner, Brunch","Takeout, Seating, Delivery","Families with children, Kids","+1 212-315-1659"
91,"2018-04-13 03:22:10",26,"2018-04-13 03:22:10","Z Deli Discount Supermarket","803 8th Ave, New York City, New York",4.5,,"Breakfast, Lunch, Dinner, Brunch","Takeout, Seating, Delivery","Families with children, Kids","+1 212-315-1659"
92,"2018-04-13 03:22:10",26,"2018-04-13 03:22:10","Z Deli Discount Supermarket","803 8th Ave, New York City, New York",4.5,,"Breakfast, Lunch, Dinner, Brunch","Takeout, Seating, Delivery","Families with children, Kids","+1 212-315-1659"
93,"2018-04-13 03:22:10",26,"2018-04-13 03:22:10","Z Deli Discount Supermarket","803 8th Ave, New York City, New York",4.5,,"Breakfast, Lunch, Dinner, Brunch","Takeout, Seating, Delivery","Families with children, Kids","+1 212-315-1659"
94,"2018-04-13 03:22:10",26,"2018-04-13 03:22:10","Z Deli Discount Supermarket","803 8th Ave, New York City, New York",4.5,,"Breakfast, Lunch, Dinner, Brunch","Takeout, Seating, Delivery","Families with children, Kids","+1 212-315-1659"
95,"2018-04-13 03:22:16",28,"2018-04-13 03:22:16","Han Ah Reum Supermarket","25 W 32nd St, New York City, New York",4.0,,,,,"+1 212-695-3283"
96,"2018-04-13 03:22:16",28,"2018-04-13 03:22:16","Han Ah Reum Supermarket","25 W 32nd St, New York City, New York",4.0,,,,,"+1 212-695-3283"
97,"2018-04-13 03:22:16",28,"2018-04-13 03:22:16","Han Ah Reum Supermarket","25 W 32nd St, New York City, New York",4.0,,,,,"+1 212-695-3283"
98,"2018-04-13 03:22:16",28,"2018-04-13 03:22:16","Han Ah Reum Supermarket","25 W 32nd St, New York City, New York",4.0,,,,,"+1 212-695-3283"
99,"2018-04-13 03:22:25",62,"2018-04-13 03:22:25","Greenland Supermarket","6850 Spring Mountain Rd, Las Vegas, Nevada",5.0,,,,,"+1 702-459-7878"
100,"2018-04-13 03:22:37",65,"2018-04-13 03:22:37","Bourque's Supermarket","581 N Saizon St, Port Barre, Louisiana",4.0,,,,,"+1 337-585-6261"
