book.id,book.ts,book.title,book.isbn_13,book.list_price,book.comments,book.summary,book.condition,book.provider,book.provider_rating,book.author,book.book_edition,book.isbn,book.publisher
301,"2018-03-29 03:37:37","Organizational Behavior",9780133507645,$227.80,,"Robbins, Stephen P. is the author of 'Organizational Behavior', published 2014 under ISBN 9780133507645 and ISBN 0133507645.",,,,"Robbins, Stephen P., Judge, Timothy A.",16,0133507645,"Pearson Education"
302,"2018-03-29 03:37:41","International Business",9780133457230,$227.80,,"Daniels, John is the author of 'International Business', published 2014 under ISBN 9780133457230 and ISBN 0133457230.",,,,"Daniels, John, Radebaugh, Lee, Sullivan, Daniel",15,0133457230,"Pearson Education"
303,"2018-03-29 03:37:50","Fundamentals of Management : Essential Concepts and Applications",9780133499919,$205.80,,"Robbins, Stephen P. is the author of 'Fundamentals of Management : Essential Concepts and Applications', published 2014 under ISBN 9780133499919 and ISBN 013349991X.",,,,"Robbins, Stephen P., De Cenzo, David A., Coulter, Mary",9,013349991X,"Pearson Education"
304,"2018-03-29 03:37:54","Small Business Management : An Entrepreneur's Guidebook",9780078029097,$220.00,,"Byrd is the author of 'Small Business Management : An Entrepreneur's Guidebook', published 2012 under ISBN 9780078029097 and ISBN 0078029090.",,,,"Byrd, Megginson",7,0078029090,"McGraw-Hill Companies, The"
305,"2018-03-29 03:37:58","Introduction to Operations Research with Student Access Card",9781259162985,,"ALTERNATE EDITION: ***International Edition***Soft cover/Paperback*** Textbook printed in English. ***Brand New***. Most international edition has different ISBN and Cover design. Some book may show sales disclaimer such as """"Not for Sale or Restricted in US"""" on the cover page but it is absolutely legal to use. All textbook arrives within 5-7business days. Please provides valid phone number with your order with easy delivery.""","Hillier is the author of 'Introduction to Operations Research with Student Access Card', published 2014 under ISBN 9781259162985 and ISBN 1259162982.",New,"EverydayLowPrice Contact",77%,Hillier,10,1259162982,"McGraw-Hill Higher Education"
306,"2018-03-29 03:37:59","Marketing Management (4th Edition)",9780136074892,$202.67,,"Winer is the author of 'Marketing Management (4th Edition)', published 2010 under ISBN 9780136074892 and ISBN 0136074898.",,,,"Winer, Winer, Russ, Dhar, Ravi",4,0136074898,"Prentice Hall"
307,"2018-03-29 03:38:10","Developing Management Skills (8th Edition)",9780136121008,$151.33,,"David A Whetton and Kim S Cameron wrote this copy of Developing Management Skills in 2010, and it was published by Prentice Hall. If you want to enjoy this eighth edition of the text book, make sure you buy cheap Developing Management Skills copies now for affordable prices, thanks to our convenient website, which stocks pre-owned copies of lots of different books. Save money when you buy or rent Developing Management Skills online - try it today and see how much you could save in the process. With lots of copies of this and other books to rent or buy, you will always find what you need. Whetten, David A. is the author of 'Developing Management Skills (8th Edition)', published 2010 under ISBN 9780136121008 and ISBN 0136121004.",,,,"Whetten, David A., Cameron, Kim S.",8,0136121004,"Prentice Hall"
308,"2018-03-29 03:38:14","Advertising and IMC : Principles and Practice",9780133506884,$266.20,,"Moriarty, Sandra is the author of 'Advertising and IMC : Principles and Practice', published 2014 under ISBN 9780133506884 and ISBN 0133506886.",,,,"Moriarty, Sandra, Mitchell, Nancy, Wells, William D.",10,0133506886,"Pearson Education"
309,"2018-03-29 03:38:24","Human Resource Management with Premium Content Access Card",9780077602963,,,"Bernardin, H. John is the author of 'Human Resource Management with Premium Content Access Card', published 2012 under ISBN 9780077602963 and ISBN 007760296X.",,,,"Bernardin, H. John",6,007760296X,"McGraw-Hill Higher Education"
310,"2018-03-29 03:38:30","MP Consumer Behavior with DDB Data Disk",9780077645557,,,"If you are looking for the 12th edition of this textbook published by McGraw-Hill Higher Education in 2012, you are in luck. You can now buy MP Consumer Behavior with DDB Data Disk online from Valore Books, written by Delbert Hawkins and David Mothersbaugh. We specialize in offering the cheapest prices on previously owned text books such as this one, which delves into the behavior of consumers and is ideal for students of business and economics. Sell your MP Consumer Behavior with DDB Data Disk book back once you are finished and earn back some cash too if you wish. Hawkins, Delbert is the author of 'MP Consumer Behavior with DDB Data Disk', published 2012 under ISBN 9780077645557 and ISBN 0077645553.",,,,"Hawkins, Delbert, Mothersbaugh, David",12,0077645553,"McGraw-Hill Higher Education"
311,"2018-03-29 03:38:36","An Introduction to Management Science: Quantitative Approaches to Decision Making, Revised (...",9781111532222,$254.95,,"Buy An Introduction to Management Science: Quantitative Approaches to Decision Making, Revised (with Microsoft Project and Printed Access Card) online now. This text book was written by David R Anderson, Dennis J Sweeney, Thomas A Williams, Jeffrey D Camm and R Kipp Martin. It was published in 2011 by South-Western College Pub and now you can buy An Introduction to Management Science: Quantitative Approaches to Decision Making, Revised (with Microsoft Project and Printed Access Card) for cheap prices from our website in its 13th revised edition. Our buyback system means we regularly have affordable copies of this and many other college text books, so don't miss out. David R. Anderson is the author of 'An Introduction to Management Science: Quantitative Approaches to Decision Making, Revised (with Microsoft Project and Printed Access Card)', published 2011 under ISBN 9781111532222 and ISBN 1111532222.",,,,"David R. Anderson, Dennis J. Sweeney, Thomas A. Williams, Jeffrey D. Camm, R. Kipp Martin",13,1111532222,"South-Western College Pub"
312,"2018-03-29 03:38:39","Purchasing and Supply Management",9780078024092,,,"Johnson is the author of 'Purchasing and Supply Management', published 2014 under ISBN 9780078024092 and ISBN 0078024099.",,,,"Johnson, Leenders, Flynn",15,0078024099,"McGraw-Hill Higher Education"
313,"2018-03-29 03:38:45","Law, Business and Society",9780078023866,,,"Mcadams is the author of 'Law, Business and Society', published 2014 under ISBN 9780078023866 and ISBN 0078023866.",,,,Mcadams,,0078023866,"McGraw-Hill Higher Education"
314,"2018-03-29 03:38:48","Fundamentals of Financial Accounting",9780078025914,,,"Phillips is the author of 'Fundamentals of Financial Accounting', published 2015 under ISBN 9780078025914 and ISBN 0078025915.",,,,"Phillips, Libby, Libby",,0078025915,"McGraw-Hill Higher Education"
315,"2018-03-29 03:38:58","The Mind and Heart of the Negotiator",9780132543866,$104.00,,"Thompson, Leigh is the author of 'The Mind and Heart of the Negotiator' with ISBN 9780132543866 and ISBN 0132543869.",,,,"Thompson, Leigh","United Sta",0132543869,"Pearson Prentice Hall"
316,"2018-03-29 03:39:03","Fundamentals of Human Resource Management",9780073530468,$143.35,"A used book that may have some cosmetic wear (i.e. shelf-wear, slightly torn or missing dust jacket, dented corner, pages may include limited notes and highlighting) All text in great shape!","This is an authority source on contemporary human resources management. It is a bestselling text for human resources students and a comprehensive coverage of current practice and policy practiced by all managers in a business setting. Students will not only learn about the latest human resources management theory but will be able to relate this back to practical situations with the help of enlightening case studies. It is written in an engaging and user-friendly style that aids in the comprehension of a constantly changing subject. We offer a wide online range of cheap human resources textbooks of a high calibre to buy or rent by semester. Noe, Raymond Andrew is the author of 'Fundamentals of Human Resource Management' with ISBN 9780073530468 and ISBN 0073530468.",Acceptable,"Clean Earth Books Contact",83%,"Noe, Raymond Andrew, Hollenbeck, John R., Gerhart, Barry",4,0073530468,Irwin/McGraw-Hill
317,"2018-03-29 03:39:12","Purchasing and Supply Chain Management",9780538476423,$202.95,,"Monczka, Robert M. is the author of 'Purchasing and Supply Chain Management', published 2011 under ISBN 9780538476423 and ISBN 0538476427.",,,,"Monczka, Robert M., Handfield, Robert B., Giunipero, Larry C.",5,0538476427,"South-Western College/West"
318,"2018-03-29 03:39:25","Global Investments",9780321527707,$156.20,,"This title provides accessible coverage of international capital markets using numerous examples to illustrate the applications of concepts and theories. It reflects the understanding that the distinction between domestic and international is no longer relevant and that asset management is global.Solnik, Bruno is the author of 'Global Investments', published 2008 under ISBN 9780321527707 and ISBN 0321527704.",,,,"Solnik, Bruno, McLeavey, Dennis, C. F. A. Staff",6,0321527704,"Addison Wesley"
319,"2018-03-29 03:39:30","Essentials of Marketing Management",9780078028786,$152.50,,"Marshall, Greg W. is the author of 'Essentials of Marketing Management', published 2010 under ISBN 9780078028786 and ISBN 0078028787.",,,,"Marshall, Greg W., Johnston, Mark W.","1st Editio",0078028787,Irwin/McGraw-Hill
320,"2018-03-29 03:39:38","The Leadership Experience",9781439042113,$198.95,,"This textbook certainly provides the theory and practical applications for students to learn how to become effective and successful leaders. It is up to the students to take what they can from this and their studies to bring these theories to life in the real world. Its content is very accessible despite being a very authoritative book and students will assimilate its concepts with ease. It uses great examples to show students how to learn the essential skills and outlook necessary to succeed as leaders. This can be obtained at a discounted textbook rate along with similar leadership textbooks whether you want to buy or rent. Daft, Richard L. is the author of 'The Leadership Experience', published 2010 under ISBN 9781439042113 and ISBN 143904211X.",,,,"Daft, Richard L.",5,143904211X,"South-Western College Pub"
321,"2018-03-29 03:39:43","Introduction to Materials Management (7th Edition)",9780131376700,$137.40,,"Arnold, J. R. Tony is the author of 'Introduction to Materials Management (7th Edition)', published 2011 under ISBN 9780131376700 and ISBN 0131376705.",,,,"Arnold, J. R. Tony, Chapman, Stephen N., Clive, Lloyd M.",7,0131376705,"Prentice Hall"
322,"2018-03-29 03:39:46","Labor Economics",9780073511368,$170.44,,"Borjas, George J. is the author of 'Labor Economics', published 2009 under ISBN 9780073511368 and ISBN 0073511366.",,,,"Borjas, George J.",5,0073511366,McGraw-Hill/Irwin
323,"2018-03-29 03:39:52",Macroeconomics,9780133455496,$214.20,,"Hubbard, R. Glenn is the author of 'Macroeconomics', published 2013 under ISBN 9780133455496 and ISBN 0133455491.",,,,"Hubbard, R. Glenn, O'Brien, Anthony Patrick",5,0133455491,"Pearson Education"
324,"2018-03-29 03:39:54","Contemporary Management",9780078112690,,,"Gareth Jones is the author of 'Contemporary Management', published 2010 under ISBN 9780078112690 and ISBN 0078112699.",,,,"Gareth Jones, Jennifer George",7,0078112699,McGraw-Hill/Irwin
325,"2018-03-29 03:40:07","Financial Management: Theory & Practice (with Thomson ONE - Business School Edition 1-Year P...",9781439078099,$255.95,,"Here you can buy Financial Management: Theory and Practice (with Thomson ONE - Business School Edition 1-Year Printed Access Card) online at an affordable and discounted price. Financial Management: Theory and Practice (with Thomson ONE - Business School Edition 1-Year Printed Access Card) used copies are discounted and written by Eugene F Brigham and Michael C Ehrhardt. This is the 13th edition and it was originally published by South-Western College Pub in 2010. Now is the best time to get Financial Management: Theory and Practice (with Thomson ONE - Business School Edition 1-Year Printed Access Card) for cheap prices, so you can further your studies at an affordable price. Eugene F. Brigham is the author of 'Financial Management: Theory & Practice (with Thomson ONE - Business School Edition 1-Year Printed Access Card)', published 2010 under ISBN 9781439078099 and ISBN 1439078092.",,,,"Eugene F. Brigham, Michael C. Ehrhardt",13,1439078092,"South-Western College Pub"
326,"2018-03-29 03:40:12","Cost-Benefit Analysis",9780137002696,$130.60,,"Boardman, Anthony is the author of 'Cost-Benefit Analysis', published 2010 under ISBN 9780137002696 and ISBN 0137002696.",,,,"Boardman, Anthony, Greenberg, David, Vining, Aidan","4th Revise",0137002696,"Prentice Hall"
327,"2018-03-29 03:40:16","Transportation: A Supply Chain Perspective",9780324789195,$218.95,,"John J Coyle, Robert A Novack and Edward J Bardi are the co-authors of Transportation: A Supply Chain Perspective. Used copies can easily be bought in previously owned condition from our popular discounted marketplace today. Make sure you have the ability to buy Transportation: A Supply Chain Perspective online now and get your copy of the text book published by South-Western College Pub in 2010. This is the 7th edition to be released so even if you own an earlier copy, sell back to us now and buy or rent this updated one. Valore Books makes it easy to get the best deals daily. Coyle, John J. is the author of 'Transportation: A Supply Chain Perspective', published 2010 under ISBN 9780324789195 and ISBN 032478919X.",,,,"Coyle, John J., Novack, Robert A., Bardi, Edward J.",7,032478919X,"South-Western College Pub"
328,"2018-03-29 03:40:25","Designing And Managing The Supply Chain",9780073341521,$134.38,"All orders ship SAME or NEXT business day. Expedited shipments will be received in 1-5 business days within the United States. We proudly ship to APO/FPO addresses. 100% Satisfaction Guaranteed!","David Simchi-Levi teaches at Massachusetts Institute of Technology.Simchi-Levi, David is the author of 'Designing And Managing The Supply Chain ', published 2007 under ISBN 9780073341521 and ISBN 0073341525.","Very Good","TextbookRush Contact",92%,"Simchi-Levi, David, Kaminsky, Philip, Simchi-Levi, Edith",,0073341525,"McGraw-Hill College"
329,"2018-03-29 03:40:40","Launching New Ventures : An Entrepreneurial Approach (with Management CourseMate with eBook ...",9780538481793,$316.95,,"Allen, Kathleen R. is the author of 'Launching New Ventures : An Entrepreneurial Approach (with Management CourseMate with eBook Printed Access Card)', published 2011 under ISBN 9780538481793 and ISBN 053848179X.",,,,"Allen, Kathleen R.",6,053848179X,"Cengage South-Western"
330,"2018-03-29 03:40:44","Fundamentals of Financial Management, Concise Edition (with Thomson ONE - Business School Ed...",9780538477116,$174.95,,"This financial management textbook is based on excellent research and case studies that students will understand. It is written in a clear and concise way enlightening students on the growing complexities of financial management and corporate finance especially as the financial world changes before our eyes. Concepts are discussed clearly in a very student-friendly manner and it contains many study tools and applications to aid comprehension and retention. Cheap financial management textbooks are available to buy or rent in good condition from our extensive lists online. Brigham, Eugene F. is the author of 'Fundamentals of Financial Management, Concise Edition (with Thomson ONE - Business School Edition)', published 2011 under ISBN 9780538477116 and ISBN 0538477113.",,,,"Brigham, Eugene F., Houston, Joel F.",7,0538477113,"South-Western College Pub"
331,"2018-03-29 03:40:49","The Strategy and Tactics of Pricing",9780136106814,$91.50,,"Nagle, Thomas is the author of 'The Strategy and Tactics of Pricing', published 2010 under ISBN 9780136106814 and ISBN 0136106811.",,,,"Nagle, Thomas, Hogan, John, Zale, Joseph","5th Revise",0136106811,"Prentice Hall"
332,"2018-03-29 03:40:52","Supply Chain Management (4th Edition)",9780136080404,$174.67,,"Chopra, Sunil is the author of 'Supply Chain Management (4th Edition)', published 2009 under ISBN 9780136080404 and ISBN 0136080405.",,,,"Chopra, Sunil, Meindl, Peter",4,0136080405,"Prentice Hall"
333,"2018-03-29 03:41:14","Financial Statement Analysis and Valuation",9781618530097,,,"Peter Easton, Mary Lea McAnally and Gregory Sommers co-authored Financial Statement Analysis and Valuation in 2012, and this 3rd edition is now available for you to buy or rent from us. Published by Cambridge Business Publishers, cheap Financial Statement Analysis and Valuation copies can be bought from our website today. With previously owned copies available to keep down the costs of studying business and economics courses, this is the best way to get the book you want at a price you can afford. Buy Financial Statement Analysis and Valuation online here today and find out why other students already choose us for their text books. Easton, Peter is the author of 'Financial Statement Analysis and Valuation', published 2012 under ISBN 9781618530097 and ISBN 1618530097.",,,,"Easton, Peter, McAnally, Mary Lea, Sommers, Gregory",3,1618530097,"Cambridge Business Publishers"
334,"2018-03-29 03:41:22","Lesikar's Business Communication: Connecting in a Digital World",9780073377797,$213.45,"ALTERNATE EDITION: Brand New, 12 edition, , color Printing, Softcover International Edition. **Different ISBN and Cover design from US edition but offer same content and paper quality as that of domestic US edition** P.O. Box please provide phone number.","Lesikar, Raymond V. is the author of 'Lesikar's Business Communication: Connecting in a Digital World', published 2010 under ISBN 9780073377797 and ISBN 0073377791.",New,"PackofBooks Contact",63%,"Lesikar, Raymond V., Flatley, Marie E., Rentz, Kathryn",12,0073377791,McGraw-Hill/Irwin
335,"2018-03-29 03:41:29","Principles of Marketing",9780132167123,$257.20,,"As an introduction to the principles of marketing for college students this textbook is very comprehensive. It not only covers all the key concepts of marketing but it delivers it in a very accessible way that students will identify with. The application of marketing in the real business world is something students want to get to grips with and this textbook does not fail to deliver. The examples and case studies used are tangible and students will learn a lot about marketing applications. If you are looking to buy or rent your textbook for this subject we have many excellent quality cheap marketing textbooks on offer. Kotler, Philip is the author of 'Principles of Marketing', published 2011 under ISBN 9780132167123 and ISBN 0132167123.",,,,"Kotler, Philip, Armstrong, Gary","14th editi",0132167123,"Prentice Hall"
336,"2018-03-29 03:43:44","Concepts, Strategic Management and Competitive Advantage (3rd Edition)",9780136094944,$129.67,,"Barney, Jay is the author of 'Concepts, Strategic Management and Competitive Advantage (3rd Edition)', published 2009 under ISBN 9780136094944 and ISBN 0136094945.",,,,"Barney, Jay, Hesterly, William",3,0136094945,"Prentice Hall"
337,"2018-03-29 03:43:48","Understanding Business",9780073511702,$40.03,"New US Edition Textbook, Ships with Emailed Tracking from USA","If you want to learn more about business and management, make sure you buy Understanding Business online here now. We specialize in discounted copies of the best college textbooks you can find. This one was written by William Nickels, James McHugh and Susan McHugh, and was published in 2009 by McGraw-Hill/Irwin. If you want to buy or rent Understanding Business online today, you can get this 9th edition copy with lots of new material when compared to the first edition. Previously owned copies will save you money, so start saving today. Use our buyback system later on as well if you wish. William Nickels is the author of 'Understanding Business', published 2009 under ISBN 9780073511702 and ISBN 0073511706.",New,"BOOKHUT Contact",87%,"William Nickels, James McHugh, Susan McHugh",9,0073511706,McGraw-Hill/Irwin
338,"2018-03-29 03:44:29","Operations Management (10th Edition)",9780136119418,$200.00,,"This is an ideal textbook for general business students who want to take a look at how operations management works. It is a thorough introduction to the concepts and applications of operations management and is written in a friendly and engaging style. College students are put through exercises that allow them to apply their knowledge to real world examples and problems. It provides a detailed perspective of how firms operate in the real world on a national and global scale. We offer and buy back many top quality cheap business textbooks to students who can choose to sell, buy or rent copies by semester. Heizer, Jay H. is the author of 'Operations Management (10th Edition)', published 2010 under ISBN 9780136119418 and ISBN 0136119417.",,,,"Heizer, Jay H., Render, Barry, Cook, Lori",10,0136119417,"Prentice Hall"
339,"2018-03-29 03:44:31","Small Business Management",9781111532871,$212.95,"Excellent condition. Ships from California.","College business students across the country use this key textbook to master the theories behind small business management. An excellent textbook written to ease comprehension it covers the complexities of studying this subject in a modern day setting. By using tangible examples and case studies it enlightens students on crucial aspects of small business management. We have many recommended cheaply priced business management textbooks available on our list available to rent or buy. Selling textbooks is also an option for cash strapped students looking to recover costs through our buyback service. Longenecker, Justin G. (Justin G. Longenecker) is the author of 'Small Business Management', published 2011 under ISBN 9781111532871 and ISBN 1111532877.",New,"Elite Textbooks Contact",100%,"Longenecker, Justin G. (Justin G. Longenecker), Petty, J. William, Palich, Leslie E.",016,1111532877,"South-Western College Pub"
340,"2018-03-29 03:44:35","Introduction to Hospitality Management",9780135061381,$105.00,,"Walker, John is the author of 'Introduction to Hospitality Management', published 2009 under ISBN 9780135061381 and ISBN 0135061385.",,,,"Walker, John",3,0135061385,"Prentice Hall Professional Technical Ref"
341,"2018-03-29 03:44:39","Practical Management Science (with Decision Sciences CourseMate Printed Access Card)",9781111531317,$228.95,,"Winston, Wayne L. is the author of 'Practical Management Science (with Decision Sciences CourseMate Printed Access Card)', published 2011 under ISBN 9781111531317 and ISBN 1111531315.",,,,"Winston, Wayne L., Albright, S. Christian",4,1111531315,"South-Western College Pub"
342,"2018-03-29 03:44:43","Modern Food Service Purchasing: Business Essentials to Procurement",9781418039646,$78.95,,"Robert B. Garlough is a Chef Emeritus at The Secchia Institute for Culinary Education at Grand Rapids Community College in Grand Rapids, Michigan. He is also a Partner of My Chef, Inc., located in Naperville, Illinois.Garlough, Robert B. is the author of 'Modern Food Service Purchasing: Business Essentials to Procurement', published 2010 under ISBN 9781418039646 and ISBN 1418039640.",,,,"Garlough, Robert B.",1,1418039640,"Cengage Learning"