qiye.id,qiye.ts,qiye.title,qiye.jingying_moshi,qiye.gongsi_chenglishijian,qiye.gongsi_dizhi,qiye.gongsi_jianjie,qiye.quancheng,qiye.zhuce_diqu,qiye.zhuying_chanpin,qiye.zhuce_ziben,qiye.zhucedi,qiye.fading_daibiaoren,qiye.jiagong_fangshi,qiye.youbian,qiye.zhuye,qiye.zhuyao_shichang,qiye.zhuyao_kehu,qiye.suoshu_hangye,qiye.qiye_leixing,qiye.zhuying_hangye,qiye.lianxiren,qiye.dianhua,qiye.shouji
201,"2018-06-24 22:12:27",天成网络科技有限公司,经销批发,2005,"江苏 无锡市 著名品牌电脑，网络监控，防盗报警系统等","天成网络科技有限公司是无锡专业的网络视频监控产品; 电脑产品; 网络视频监控; 智能电话报警系统; 品牌电脑代理; 电脑组装; 网络布线; 网络维护经销批发服务提供商。公司注册于2005，注册资本有人民币80万元，员工人数5 - 10 人，专业的团队、技术、产品、服务是和您合作的基础，您的电话就是对我们最大的支持，您给我一个电话，我还您一个真诚的合作，我司联系人周天成 先生 （项目经理）。",天成网络科技有限公司,无锡,"网络视频监控产品; 电脑产品; 网络视频监控; 智能电话报警系统; 品牌电脑代理; 电脑组装; 网络布线; 网络维护",人民币80万元,无锡,,,,,,,,,,"周天成 先生 （项目经理）",0510-88648256,待开放
202,"2018-06-24 22:12:29",辉煌锁业,经销批发,未登记,"内蒙古 呼和浩特市新城区 地震局对面","辉煌锁业是专业承揽校园保险柜; 集成监控系统; 集成防盗报警系统的经销批发企业。辉煌锁业具有一支开拓进取，尊重科学，懂技术会管理，善于开拓市场，诚实守信，以客户要求为己任，充分发扬团队精神的员工队伍，员工人数达。自成立以来辉煌锁业不断钻研，力求稳妥，对多种经销批发方式的利弊进行了大量指标的采集、整理、统计、分析和综合对比，力服务最佳化。选择我们就是选择专业！",辉煌锁业,,"校园保险柜; 集成监控系统; 集成防盗报警系统",人民币0万元,,,,,,,,,,,李晓辉,0471-2273250,待开放
203,"2018-06-24 22:12:32",包头市科恒力电讯器材商行,经销批发,2000,"内蒙古 包头市东河区 南门外大街东河海德电脑城5区27号/6区15号","包头市科恒力电讯器材商行是一家以经销批发对讲机; 智能楼宇对讲系统; 集成防盗报警系统; 集成监控系统; 程控电话交换机为主的企业，公司办公地址位于内蒙古 包头市东河区 南门外大街东河海德电脑城5区27号/6区15号。包头市科恒力电讯器材商行秉承“诚信、专业”的经营理念,坚持用户至上、质量第一，经过不断的努力和超越已经成为一家在行业内具有相当规模、较大影响力、发展迅速的企业之一。希望广大企业、消费者与我们联系、洽谈，我们会用优秀的产品和服务让您满意！",包头市科恒力电讯器材商行,内蒙古/包头市,"对讲机; 智能楼宇对讲系统; 集成防盗报警系统; 集成监控系统; 程控电话交换机",人民币0万元,内蒙古/包头市,,,,,,,,,,"小金 女士 （销售部）",0472-6997109,
204,"2018-06-24 22:12:34",天津清大新干线科技发展有限公司,经销批发,未登记,"天津 天津市 鞍山西道340号","天津清大新干线科技发展有限公司，主要经营指纹锁; IC卡锁; 一卡通管理系统; 监控摄象机; 无线红外报警; 监控系统集成; 防盗报警系统集成; 技术咨询; 互联网服务.; 电子商务.; 管理咨询.。业务联系人是麦泰克 先生 （业务经理），公司注册资本人民币50万元。我公司的办公地址位于天津 天津市 鞍山西道340号，我们有优秀的产品和专业的销售和技术团队，我们为客户提供优秀的产品、良好的技术支持、健全的售后服务，天津清大新干线科技发展有限公司是人民币50万元行业知名企业，如果您对我公司的产品服务有兴趣，请来电或上门咨询。",天津清大新干线科技发展有限公司,,"指纹锁; IC卡锁; 一卡通管理系统; 监控摄象机; 无线红外报警; 监控系统集成; 防盗报警系统集成; 技术咨询; 互联网服务.; 电子商务.; 管理咨询.",人民币50万元,,,,,,,,,,,"麦泰克 先生 （业务经理）",22-27423813,待开放
205,"2018-06-24 22:12:35",上海宁程智能科技有限公司总部,其他,2006,"上海 上海市嘉定区 金沙江西路1555弄393号1层A座109室","上海宁程智能科技有限公司总部是上海市嘉定区金沙江西路1555弄393号1层A座109室专业的监控安装维修; 门禁安装维修; 网络电话安装维护; 电子巡更; 一卡通管理系统; 集成防盗报警系统; 综合布线系统; 智能对讲系统; LED及大屏显示系统; 整体机房系统; 智能家居系统; 楼宇自控系统其他服务提供商。公司注册于2006，注册资本有人民币50万元，员工人数11 - 50 人，专业的团队、技术、产品、服务是和您合作的基础，您的电话就是对我们最大的支持，您给我一个电话，我还您一个真诚的合作，我司联系人孙峰 先生 （项目经理）。",上海宁程智能科技有限公司总部,上海市嘉定区金沙江西路1555弄393号1层A座109室,"监控安装维修; 门禁安装维修; 网络电话安装维护; 电子巡更; 一卡通管理系统; 集成防盗报警系统; 综合布线系统; 智能对讲系统; LED及大屏显示系统; 整体机房系统; 智能家居系统; 楼宇自控系统",人民币50万元,上海市嘉定区金沙江西路1555弄393号1层A座109室,孙峰,,,,,,,,,"孙峰 先生 （项目经理）",021-66260886,待开放
206,"2018-06-24 22:12:38",上海优周电子科技有限公司沈阳公司,生产加工,未登记,"辽宁 沈阳市和平区 和平区三好街华强电子市场C座2506室","上海优周电子科技有限公司沈阳公司位于市区，上海优周电子科技有限公司沈阳公司主要经营：电话报警设备; 集成防盗报警系统; 探头;感应器; 门磁;窗磁; 个人报警器; 接警;报警; 防盗报警。上海优周电子科技有限公司沈阳公司有完善的质量保证体系，通过了所有合作伙伴的高标准质检及认可。为开拓市场，实现互惠互利，我们将本着“价格，质量”双优，“诚信，服务”共赢的经营理念，竭诚为广大客户服务。我们公司本着“不争价格最低，但求质量最好”的原则，竭诚为国内外用户提供优质的产品及诚信的服务。",上海优周电子科技有限公司沈阳公司,,"电话报警设备; 集成防盗报警系统; 探头;感应器; 门磁;窗磁; 个人报警器; 接警;报警; 防盗报警",人民币0万元,,,,,,,,,,,"钟明 先生 （经理）",024-83893968,待开放
207,"2018-06-24 22:12:42",南京迪佛电子系统工程有限公司,生产加工,2005-01-07,"江苏 南京市 应天西路72号505","南京迪佛电子系统工程有限公司，主要经营LED电子显示屏; 楼宇智能化; 智能化小区; 闭路电视\监控系统; 电子显示屏; LED电子屏\防盗系统; LED显示屏; 显示屏\消防报警系统; 电子屏\广播系统; 电子屏幕\公共广播系统; 全彩屏\报警系统; 全彩屏幕\监控系统; 智能化弱电系统集成; 弱电系统集成; 系统集成布线; 消防系统\集成监控系统; 智能化系统; 智能化系统集成; 智能小区\集成防盗报警系统; 弱电工程\防盗报警系统。业务联系人是朱磊 先生 （经理），公司注册资本人民币100万元。我公司的办公地址位于江苏 南京市 应天西路72号505，我们有优秀的产品和专业的销售和技术团队，我们为客户提供优秀的产品、良好的技术支持、健全的售后服务，南京迪佛电子系统工程有限公司是人民币100万元行业知名企业，如果您对我公司的产品服务有兴趣，请来电或上门咨询。",南京迪佛电子系统工程有限公司,"中国 江苏 南京市","LED电子显示屏; 楼宇智能化; 智能化小区; 闭路电视\监控系统; 电子显示屏; LED电子屏\防盗系统; LED显示屏; 显示屏\消防报警系统; 电子屏\广播系统; 电子屏幕\公共广播系统; 全彩屏\报警系统; 全彩屏幕\监控系统; 智能化弱电系统集成; 弱电系统集成; 系统集成布线; 消防系统\集成监控系统; 智能化系统; 智能化系统集成; 智能小区\集成防盗报警系统; 弱电工程\防盗报警系统",人民币100万元,"中国 江苏 南京市",王绍禄,,,,,,,,,"朱磊 先生 （经理）",025-51783958,待开放
208,"2018-06-24 22:12:42",南京感知网络科技有限公司,生产加工,2011,"江苏 南京市玄武区 珠江路88号新世界中心B座916","南京感知网络科技有限公司，于2011在中国 江苏 南京注册成立，我公司以生产加工的经营模式主营网络监控摄像机; 监控器材; 防盗;报警器材; 集成防盗报警系统; 高清监控。我公司拥有专业的技术和销售团队，员工人数501 - 1000 人，实力雄厚注册资本人民币3万元。南京感知网络科技有限公司是南京市玄武区知名企业，办公地址为江苏 南京市玄武区 珠江路88号新世界中心B座916，如果您对我们的产品、技术或服务有兴趣，随时欢迎您的来电或上门咨询。",南京感知网络科技有限公司,"中国 江苏 南京","网络监控摄像机; 监控器材; 防盗;报警器材; 集成防盗报警系统; 高清监控",人民币3万元,"中国 江苏 南京",马恪举,来图加工,,,,,,,,"李清华 先生 （总经理）",025-84529001,待开放
209,"2018-06-24 22:12:43",北京安创明圣科技发展有限公司呼市分公司,,未登记,内蒙古呼和浩特赛罕区新华东街长安金座E座2-904室,"北京安创明圣科技发展有限公司呼市分公司是一家以集成防盗报警系统为主的企业，公司办公地址位于内蒙古呼和浩特赛罕区新华东街长安金座E座2-904室。北京安创明圣科技发展有限公司呼市分公司秉承“诚信、专业”的经营理念,坚持用户至上、质量第一，经过不断的努力和超越已经成为一家在行业内具有相当规模、较大影响力、发展迅速的企业之一。希望广大企业、消费者与我们联系、洽谈，我们会用优秀的产品和服务让您满意！",北京安创明圣科技发展有限公司呼市分公司,内蒙古自治区,集成防盗报警系统,,内蒙古自治区,,,010000,www.niemengdzwl.com,,,,私营独资企业,"影音电器配件, 集成防盗报警系统",,0471-6658605,待开放
210,"2018-06-24 22:12:46",大连佳兴电子公司一部,经销批发,1990,"辽宁 大连市 中山区中山路124号","大连佳兴电子公司一部是一家以经销批发闭路监控; 监视器; 集成防盗报警系统; 电话报警设备; 掌纹考勤; 考勤机; 指纹考勤; 闭路监控; 监控摄像机; 监视器; 集成防盗报警系统; 电话报警设备; 门禁考勤系统; 对讲机为主的企业，公司办公地址位于辽宁 大连市 中山区中山路124号。大连佳兴电子公司一部秉承“诚信、专业”的经营理念,坚持用户至上、质量第一，经过不断的努力和超越已经成为一家在行业内具有相当规模、较大影响力、发展迅速的企业之一。希望广大企业、消费者与我们联系、洽谈，我们会用优秀的产品和服务让您满意！",大连佳兴电子公司一部,大连,"闭路监控; 监视器; 集成防盗报警系统; 电话报警设备; 掌纹考勤; 考勤机; 指纹考勤; 闭路监控; 监控摄像机; 监视器; 集成防盗报警系统; 电话报警设备; 门禁考勤系统; 对讲机",人民币100万元,大连,唐红波,,,,,,,,,"唐红波 先生 （经理）",411-82936702,待开放
211,"2018-06-24 22:12:51",上海前展电子科技有限公司,生产加工,未登记,"上海 上海市 浦东新区下盐路800号 8号2楼","上海前展电子科技有限公司是专业承揽集成防盗报警系统; 防人体屏蔽软标签; DR标签; 服装防盗扣; 声磁和射频防盗的生产加工企业。上海前展电子科技有限公司具有一支开拓进取，尊重科学，懂技术会管理，善于开拓市场，诚实守信，以客户要求为己任，充分发扬团队精神的员工队伍，员工人数达101 - 200 人。自成立以来上海前展电子科技有限公司不断钻研，力求稳妥，对多种生产加工方式的利弊进行了大量指标的采集、整理、统计、分析和综合对比，力服务最佳化。选择我们就是选择专业！",上海前展电子科技有限公司,,"集成防盗报警系统; 防人体屏蔽软标签; DR标签; 服装防盗扣; 声磁和射频防盗",人民币0万元,,,来样加工,,,,,,,,"陈晶晶 女士 （销售经理）",021-60970688,待开放
212,"2018-06-24 22:12:53",南京多泰电子科技有限责任公司,生产加工,2001,"江苏 南京市江宁区 江宁滨江开发区飞鹰路28号","南京多泰电子科技有限责任公司，主要经营单片机; 集成防盗报警系统; 保险柜; 发射器; 接收器; 个人报警器; 其他防盗; 报警器材及系统。业务联系人是邹攀 先生 （销售），公司注册资本人民币5万元。我公司的办公地址位于江苏 南京市江宁区 江宁滨江开发区飞鹰路28号，我们有优秀的产品和专业的销售和技术团队，我们为客户提供优秀的产品、良好的技术支持、健全的售后服务，南京多泰电子科技有限责任公司是人民币5万元行业知名企业，如果您对我公司的产品服务有兴趣，请来电或上门咨询。",南京多泰电子科技有限责任公司,"中国 江苏 南京","单片机; 集成防盗报警系统; 保险柜; 发射器; 接收器; 个人报警器; 其他防盗; 报警器材及系统",人民币5万元,"中国 江苏 南京",,来料加工,,,,,,,,"邹攀 先生 （销售）",025-8487,待开放
213,"2018-06-24 22:12:53",北京聚英翱翔电子有限公司,生产加工,2007,"北京 北京市海淀区 知春路118号知春大厦A座1202室","北京聚英翱翔电子有限公司，于2007在中国 北京注册成立，我公司以生产加工的经营模式主营采集传输一体化RTU; GPRS DTU; 数据采集卡; 远程控制工程; 物联网系统; GPS卫星定位; 系统集成监控; 三表集抄; 管网;热网;油井监控; GPS车辆监控系统; 无线传输产品; 微功耗GPRS测控终端; 485分布式数据采集模块; CAN通讯卡; 集成防盗报警系统。我公司拥有专业的技术和销售团队，员工人数11 - 50 人，实力雄厚注册资本人民币50万元。北京聚英翱翔电子有限公司是北京市海淀区知名企业，办公地址为北京 北京市海淀区 知春路118号知春大厦A座1202室，如果您对我们的产品、技术或服务有兴趣，随时欢迎您的来电或上门咨询。",北京聚英翱翔电子有限公司,"中国 北京","采集传输一体化RTU; GPRS DTU; 数据采集卡; 远程控制工程; 物联网系统; GPS卫星定位; 系统集成监控; 三表集抄; 管网;热网;油井监控; GPS车辆监控系统; 无线传输产品; 微功耗GPRS测控终端; 485分布式数据采集模块; CAN通讯卡; 集成防盗报警系统",人民币50万元,"中国 北京",张翃鹏,OEM加工,,,,,,,,"王伟 女士 （主管）",010-82899821,待开放
214,"2018-06-24 22:12:57",大同市启明星科技有限公司,,未登记,山西太原太原市长治路王村小区,"如果您需要黑板; 投影机; 公共广播系统; 集成防盗报警系统的，找大同市启明星科技有限公司就可以了，大同市启明星科技有限公司以专业的服务、精良的技术（设备）为您提供一流的服务。大同市启明星科技有限公司拥有丰富的经验，注册资本达0拥有较为雄厚的行业实力，立足于太原为您提供专业的服务。拿起电话，交个诚意的朋友，做桩稳赚的生意。",大同市启明星科技有限公司,山西省,"黑板; 投影机; 公共广播系统; 集成防盗报警系统",,山西省,,,030000,www.tyqmx.com,,,,私营有限责任公司,其他书写板、擦,刘经理,0351-5240610,待开放
215,"2018-06-24 22:13:01",山西省华远智信科技有限公司,其他,未登记,山西省太原市高新区,"山西省华远智信科技有限公司是一家以其他集成防盗报警系统; 其他工控系统及装备为主的企业，公司办公地址位于山西省太原市高新区。山西省华远智信科技有限公司秉承“诚信、专业”的经营理念,坚持用户至上、质量第一，经过不断的努力和超越已经成为一家在行业内具有相当规模、较大影响力、发展迅速的企业之一。希望广大企业、消费者与我们联系、洽谈，我们会用优秀的产品和服务让您满意！",山西省华远智信科技有限公司,山西省,"集成防盗报警系统; 其他工控系统及装备",,山西省,,其他,030000,,,,,私营合伙企业,"工控电脑产品, 其他工控系统及装备, 安防监控设备",郑先生,,待开放
216,"2018-06-24 22:13:05",山西和正装饰材料有限公司,,未登记,山西太原市茂盛装饰城5号501室,"山西和正装饰材料有限公司，主要经营金属建材; 其他窗; 集成防盗报警系统; 其他防盗;报警器材及系统。业务联系人是孙小龙，公司注册资本0。我公司的办公地址位于山西太原市茂盛装饰城5号501室，我们有优秀的产品和专业的销售和技术团队，我们为客户提供优秀的产品、良好的技术支持、健全的售后服务，山西和正装饰材料有限公司是0行业知名企业，如果您对我公司的产品服务有兴趣，请来电或上门咨询。",山西和正装饰材料有限公司,山西省,"金属建材; 其他窗; 集成防盗报警系统; 其他防盗;报警器材及系统",,山西省,,,030000,www.hezhengsxl.cn,,,,私营有限责任公司,保温、隔热材料,孙小龙,0351-7059809,待开放
217,"2018-06-24 22:13:08",微邦（上海）信息技术有限公司,生产加工,未登记,"上海 上海市普陀区 财富时代大厦8层","微邦（上海）信息技术有限公司，主要经营集成防盗报警系统; 接警;报警主机; 电子围栏。业务联系人是王建东 先生 （经理），我公司的办公地址位于上海 上海市普陀区 财富时代大厦8层，我们有优秀的产品和专业的销售和技术团队，我们为客户提供优秀的产品、良好的技术支持、健全的售后服务，微邦（上海）信息技术有限公司是人民币0万元行业知名企业，如果您对我公司的产品服务有兴趣，请来电或上门咨询。",微邦（上海）信息技术有限公司,,"集成防盗报警系统; 接警;报警主机; 电子围栏",人民币0万元,,,ODM加工,,,,,,,,"王建东 先生 （经理）",021-62268983,待开放
218,"2018-06-24 22:13:12",上海努诺环保科技有限公司,经销批发,2004,"上海 上海市 黄浦区河南中路521号203室","上海努诺环保科技有限公司位于上海，上海努诺环保科技有限公司主要经营：工程施工; 工程规划; 数字监控; 防盗报警; 可视对讲; 楼宇智能; 一卡通管理系统; 综合布线; 交换机; 监控摄像机; 集成监控系统; 集成防盗报警系统; 电子巡更; 对讲系统; 门禁系统; 旧房翻新; 新房装修。上海努诺环保科技有限公司有完善的质量保证体系，通过了所有合作伙伴的高标准质检及认可。为开拓市场，实现互惠互利，我们将本着“价格，质量”双优，“诚信，服务”共赢的经营理念，竭诚为广大客户服务。我们公司本着“不争价格最低，但求质量最好”的原则，竭诚为国内外用户提供优质的产品及诚信的服务。",上海努诺环保科技有限公司,上海,"工程施工; 工程规划; 数字监控; 防盗报警; 可视对讲; 楼宇智能; 一卡通管理系统; 综合布线; 交换机; 监控摄像机; 集成监控系统; 集成防盗报警系统; 电子巡更; 对讲系统; 门禁系统; 旧房翻新; 新房装修",人民币50万元,上海,戴宗(先生),,,,,,,,,"戴宗 先生 （经理）",021-65845047,待开放
219,"2018-06-24 22:13:12",苏州英塔数字保全系统软件有限公司（市场部）,商业服务,2004,"江苏 吴江市 云梨路1333号","苏州英塔数字保全系统软件有限公司（市场部）位于江苏，苏州英塔数字保全系统软件有限公司（市场部）主要经营：监控设备; 集成防盗报警系统。苏州英塔数字保全系统软件有限公司（市场部）有完善的质量保证体系，通过了所有合作伙伴的高标准质检及认可。为开拓市场，实现互惠互利，我们将本着“价格，质量”双优，“诚信，服务”共赢的经营理念，竭诚为广大客户服务。我们公司本着“不争价格最低，但求质量最好”的原则，竭诚为国内外用户提供优质的产品及诚信的服务。",苏州英塔数字保全系统软件有限公司（市场部）,江苏,"监控设备; 集成防盗报警系统",人民币500万元,江苏,,,,,,,,,,"罗小姐 女士 （市场部）",0512-63132110,待开放
220,"2018-06-24 22:13:13",广州讯讯通科技有限公司,商业服务,1998,"广东 广州市 天河软件园","广州讯讯通科技有限公司，是广州市知名公司，我们以商业服务的方式主要经营集成防盗报警系统; 监控器材及系统; 楼宇对讲设备; 门禁考勤器材及系统; 公共广播系统@; 防雷避雷产品; 智能卡; 防伪技术产品@。我们有优秀的产品和专业的销售及技术团队，我们为客户提供优秀的产品、良好的技术支持、健全的售后服务。广州讯讯通科技有限公司办公地址为广东 广州市 天河软件园，员工人数有11 - 50 人，如果您对我们的产品或服务感兴趣，欢迎您联系我司的阳艳红 女士 （业务主管）了解具体情况。",广州讯讯通科技有限公司,广州,"集成防盗报警系统; 监控器材及系统; 楼宇对讲设备; 门禁考勤器材及系统; 公共广播系统@; 防雷避雷产品; 智能卡; 防伪技术产品@",人民币100万元,广州,,,,,,,,,,"阳艳红 女士 （业务主管）",020-38860003,待开放
221,"2018-06-24 22:13:13",天津市兆龙软件开发有限公司,生产加工,19990401,滨海高新区华苑产业区海泰发展六道6号海泰绿色产业基地K2座2门601室-1,"天津市兆龙软件开发有限公司是专业承揽行业专用软件; 安全防护产品项目合作; 集成防盗报警系统的生产加工企业。天津市兆龙软件开发有限公司具有一支开拓进取，尊重科学，懂技术会管理，善于开拓市场，诚实守信，以客户要求为己任，充分发扬团队精神的员工队伍，员工人数达7。自成立以来天津市兆龙软件开发有限公司不断钻研，力求稳妥，对多种生产加工方式的利弊进行了大量指标的采集、整理、统计、分析和综合对比，力服务最佳化。选择我们就是选择专业！",天津市兆龙软件开发有限公司,天津市,"行业专用软件; 安全防护产品项目合作; 集成防盗报警系统",200万人民币元,天津市,王致新,生产加工,300384,www.megedragon.com,"大陆, 中东, 全球",设计院、消防设备厂商,数码、电脑,有限责任公司,"行业专用软件, 安全防护产品项目合作",雪娇,022-85689418,待开放
222,"2018-06-24 22:13:16",天津宝轩创安电子科技有限公司,商业服务,20141125,天津市滨海新区古林街世纪花园3-2,"天津宝轩创安电子科技有限公司是天津市专业的视频采集卡; 集成防盗报警系统商业服务服务提供商。公司注册于20141125，注册资本有50万人民币元，员工人数10，专业的团队、技术、产品、服务是和您合作的基础，您的电话就是对我们最大的支持，您给我一个电话，我还您一个真诚的合作，我司联系人潘先生。",天津宝轩创安电子科技有限公司,天津市,"视频采集卡; 集成防盗报警系统",50万人民币元,天津市,潘家斌,商业服务,300270,,,新厂房、新楼盘、新酒店旅馆,,有限责任公司,"网络工程, 对讲机, 声讯系统, 通信器材代理加盟",潘先生,022-63259721,待开放
223,"2018-06-24 22:13:17",邯郸市宏宇铁路电器有限公司,生产加工,2003-04-07,"河北 邯郸市 中华南４号院西侧","邯郸市宏宇铁路电器有限公司位于中国 河北 邯郸，邯郸市宏宇铁路电器有限公司主要经营：铁路道口报警器; 道口报警器\接触器触头\触头; 报警器\换档板; 铁路器材\安全标志; 铁路报警器\开关电源; 交通设备器材; 轨道设备\内燃继电器; 铁路设备\交通安全标志; 轨道交通设备器材; 交通设备\电子换档板; 轨道交通\内燃机车继电器; 道口拦木机; 集成防盗报警系统; 防盗报警系统; 防盗系统\继电器; 跳线\矮二显信号机遮沿; 盗报警系统\瓷管电阻\电阻; 集成防盗\信号机构; 轨道接续线; 接续线\遮沿。邯郸市宏宇铁路电器有限公司有完善的质量保证体系，通过了所有合作伙伴的高标准质检及认可。为开拓市场，实现互惠互利，我们将本着“价格，质量”双优，“诚信，服务”共赢的经营理念，竭诚为广大客户服务。我们公司本着“不争价格最低，但求质量最好”的原则，竭诚为国内外用户提供优质的产品及诚信的服务。",邯郸市宏宇铁路电器有限公司,"中国 河北 邯郸","铁路道口报警器; 道口报警器\接触器触头\触头; 报警器\换档板; 铁路器材\安全标志; 铁路报警器\开关电源; 交通设备器材; 轨道设备\内燃继电器; 铁路设备\交通安全标志; 轨道交通设备器材; 交通设备\电子换档板; 轨道交通\内燃机车继电器; 道口拦木机; 集成防盗报警系统; 防盗报警系统; 防盗系统\继电器; 跳线\矮二显信号机遮沿; 盗报警系统\瓷管电阻\电阻; 集成防盗\信号机构; 轨道接续线; 接续线\遮沿",人民币50万元,"中国 河北 邯郸",高峰,,,,,,,,,"高和平 先生 （总经理）",0310-6028018/7420989,待开放
224,"2018-06-24 22:13:21",上海毅钧商贸有限公司(分公司）,经销批发,2002,"上海 上海市 逸仙路1238弄6号401室","自2002上海毅钧商贸有限公司(分公司）注册以来，上海毅钧商贸有限公司(分公司）一直秉承“诚信、专业”的经营理念,坚持用户至上、质量第一，服务了一批又一批的客户。公司以丰富的经销批发经验，为您提供芯片; 集成防盗报警系统; 集成电路; 手电筒; 镇流器; 玩具; 报警设备; 火警探测的经销批发。选择我们就是选择诚信，我司吕敏 女士 （销售）随时期待您的电话。",上海毅钧商贸有限公司(分公司）,中国　　上海,"芯片; 集成防盗报警系统; 集成电路; 手电筒; 镇流器; 玩具; 报警设备; 火警探测",人民币200万元,中国　　上海,马剑桦,,,,,,,,,"吕敏 女士 （销售）",021-55390673,待开放
225,"2018-06-24 22:13:24",北京航天智慧科技发展有限公司,生产加工,2000,"北京 北京市 丰台区云岗路198号","北京航天智慧科技发展有限公司，主要经营压力/扭矩传感器; 动力/照明节能设备; 集成防盗报警系统的生产加工，在北京市丰台区云岗路198号成立于2000，注册资本达人民币500万元。公司位于北京 北京市 丰台区云岗路198号，拥有专业的产品、服务和技术人员，公司员工有，为您提供专业的服务。北京航天智慧科技发展有限公司坚定以诚信为本，选择我们就是选择诚信。网络信息看千遍，不如一个电话细致入微的为您介绍，欢迎来电。",北京航天智慧科技发展有限公司,北京市丰台区云岗路198号,"压力/扭矩传感器; 动力/照明节能设备; 集成防盗报警系统",人民币500万元,北京市丰台区云岗路198号,,,,,,,,,,"陈英斌 先生 （总经理）",010-51156288,待开放
226,"2018-06-24 22:13:27",重庆驰目科技有限公司,贸易型,2011-01-13,重庆市江北区观音桥街道镇洋河二村路73号3幢12-7,"重庆驰目科技有限公司，于2011-01-13在重庆市注册成立，我公司以贸易型的经营模式主营网络交换机; 摄录一体机; 集成防盗报警系统。我公司拥有专业的技术和销售团队，员工人数50，实力雄厚注册资本100万人民币元。重庆驰目科技有限公司是重庆市知名企业，办公地址为重庆市江北区观音桥街道镇洋河二村路73号3幢12-7，如果您对我们的产品、技术或服务有兴趣，随时欢迎您的来电或上门咨询。",重庆驰目科技有限公司,重庆市,"网络交换机; 摄录一体机; 集成防盗报警系统",100万人民币元,重庆市,程世兵,贸易型,400000,,—,—,,有限责任公司,"檐口线脚, 网络交换机, 安全防护产品项目合作, 路由器",赖贞君,023-67869933,待开放
227,"2018-06-24 22:13:29",上海捷创科技有限公司,生产加工,2000,"上海 上海市 长宁区中山西路1265弄18号1005室","如果您需要IC卡片; 置物柜管制; 门禁; 考勤; 就餐消费; 智能一卡通系统; 弱电集成系统; 浴室淋浴管制器; 电子巡更机; 各式电子锁; 通道闸; 监控数码录像; 自动控制BA; 网络布线; 公共广播系统; 集成防盗报警系统; 环保生态AOA水处理系统的生产加工，找上海捷创科技有限公司就可以了，上海捷创科技有限公司以专业的服务、精良的技术（设备）为您提供一流的生产加工服务。上海捷创科技有限公司成立于2000拥有丰富的生产加工经验，注册资本达人民币50万元拥有较为雄厚的行业实力，立足于上海为您提供专业的服务。拿起电话，交个诚意的朋友，做桩稳赚的生意。",上海捷创科技有限公司,上海,"IC卡片; 置物柜管制; 门禁; 考勤; 就餐消费; 智能一卡通系统; 弱电集成系统; 浴室淋浴管制器; 电子巡更机; 各式电子锁; 通道闸; 监控数码录像; 自动控制BA; 网络布线; 公共广播系统; 集成防盗报警系统; 环保生态AOA水处理系统",人民币50万元,上海,王珏珍,,,,,,,,,"王晓俊 女士 （经理）",21-32094643,
228,"2018-06-24 22:13:33",昆山市花桥镇新龙腾智能电子产品经营部,经销批发,2010,"江苏 昆山市 花桥镇花安路183号赛格电子市场3-3k37","昆山市花桥镇新龙腾智能电子产品经营部是专业承揽安防器材; 监控报警; 弱点工程; 门禁系统; 计算机系统集成; 防盗报警系统; 公共广播系统; 综合布线系统; 楼宇对讲系统的经销批发企业。昆山市花桥镇新龙腾智能电子产品经营部具有一支开拓进取，尊重科学，懂技术会管理，善于开拓市场，诚实守信，以客户要求为己任，充分发扬团队精神的员工队伍，员工人数达。自成立以来昆山市花桥镇新龙腾智能电子产品经营部不断钻研，力求稳妥，对多种经销批发方式的利弊进行了大量指标的采集、整理、统计、分析和综合对比，力服务最佳化。选择我们就是选择专业！",昆山市花桥镇新龙腾智能电子产品经营部,江苏省昆山市花桥镇,"安防器材; 监控报警; 弱点工程; 门禁系统; 计算机系统集成; 防盗报警系统; 公共广播系统; 综合布线系统; 楼宇对讲系统",人民币0万元,江苏省昆山市花桥镇,,,,,,,,,,"吴彪 先生 （负责人）",0512-50110988,待开放
229,"2018-06-24 22:13:35",北京市京安天下智能安防器材制造厂(招商中心),生产加工,2003,"北京 北京市 丰台区王佐镇南岗洼742号京安工业园","北京市京安天下智能安防器材制造厂(招商中心)位于北京市，北京市京安天下智能安防器材制造厂(招商中心)主要经营：防盗报警器; 汽车防盗报警器; 燃气泄漏报警器; 防盗报警器; 家用防盗报警器; 门磁; 可视对讲; 周边器材; 集成防盗报警系统; 监控器材; 监控摄像头; 数码摄像机。北京市京安天下智能安防器材制造厂(招商中心)有完善的质量保证体系，通过了所有合作伙伴的高标准质检及认可。为开拓市场，实现互惠互利，我们将本着“价格，质量”双优，“诚信，服务”共赢的经营理念，竭诚为广大客户服务。我们公司本着“不争价格最低，但求质量最好”的原则，竭诚为国内外用户提供优质的产品及诚信的服务。",北京市京安天下智能安防器材制造厂(招商中心),北京市,"防盗报警器; 汽车防盗报警器; 燃气泄漏报警器; 防盗报警器; 家用防盗报警器; 门磁; 可视对讲; 周边器材; 集成防盗报警系统; 监控器材; 监控摄像头; 数码摄像机",人民币1500万元,北京市,翟向兵,,,,,,,,,"张琳 女士 （招商经理）",010-83396968,待开放
230,"2018-06-24 22:13:37",北京金凤佳商贸有限公司,经销批发,2005,"北京 延庆县 北京市崇文区左安门内大街甲1号后院","北京金凤佳商贸有限公司，于2005在北京注册成立，我公司以经销批发的经营模式主营深圳夜狼家居安防系列产品; 烟雾探测器; 报警主机; 家庭防盗系统; 安防器材; 门磁;窗磁 其他防盗; 自动拨号报警器; 集成防盗报警系统; 感应器 接警; 红外探测器; 电话报警设备 探头; 家用防盗器; 探头感应器。我公司拥有专业的技术和销售团队，员工人数51 - 100 人，实力雄厚注册资本人民币100万元。北京金凤佳商贸有限公司是延庆县知名企业，办公地址为北京 延庆县 北京市崇文区左安门内大街甲1号后院，如果您对我们的产品、技术或服务有兴趣，随时欢迎您的来电或上门咨询。",北京金凤佳商贸有限公司,北京,"深圳夜狼家居安防系列产品; 烟雾探测器; 报警主机; 家庭防盗系统; 安防器材; 门磁;窗磁 其他防盗; 自动拨号报警器; 集成防盗报警系统; 感应器 接警; 红外探测器; 电话报警设备 探头; 家用防盗器; 探头感应器",人民币100万元,北京,,,,,,,,,,"吴森明（专售家居安防报警器） 先生 （经理）",010-67144482,待开放
231,"2018-06-24 22:13:41",河北邢台安耐保安防销售公司,经销批发,2009,"河北 邢台市 桥西中兴西路顺泰家园","自2009河北邢台安耐保安防销售公司注册以来，河北邢台安耐保安防销售公司一直秉承“诚信、专业”的经营理念,坚持用户至上、质量第一，服务了一批又一批的客户。公司以丰富的经销批发经验，为您提供监控摄相机; 监视器; 硬盘录像机; 红外线灯; 云台; 监控主机; 电话报警系统; 探头感应器; 门磁窗磁; 集成防盗报警系统; 画面处理器; 编码器的经销批发。选择我们就是选择诚信，我司郝春燕 女士 （经理）随时期待您的电话。",河北邢台安耐保安防销售公司,河北省邢台市,"监控摄相机; 监视器; 硬盘录像机; 红外线灯; 云台; 监控主机; 电话报警系统; 探头感应器; 门磁窗磁; 集成防盗报警系统; 画面处理器; 编码器",人民币0万元,河北省邢台市,,,,,,,,,,"郝春燕 女士 （经理）",0319-2620606,待开放
232,"2018-06-24 22:13:45",重庆泰双商贸有限公司,,未登记,重庆渝北金龙路259号,"重庆泰双商贸有限公司是专业承揽寻呼机; 集成防盗报警系统的企业。重庆泰双商贸有限公司具有一支开拓进取，尊重科学，懂技术会管理，善于开拓市场，诚实守信，以客户要求为己任，充分发扬团队精神的员工队伍，员工人数达0。自成立以来重庆泰双商贸有限公司不断钻研，力求稳妥，对多种方式的利弊进行了大量指标的采集、整理、统计、分析和综合对比，力服务最佳化。选择我们就是选择专业！",重庆泰双商贸有限公司,重庆市,"寻呼机; 集成防盗报警系统",,重庆市,,,401100,,,,,私营合伙企业,寻呼机,孟存华,,待开放
233,"2018-06-24 22:13:48",天津市科威科技有限公司,,未登记,天津河西天津市河西区宾水道,"天津市科威科技有限公司是专业承揽其他智能卡; ; 集成防盗报警系统; 云台的企业。天津市科威科技有限公司具有一支开拓进取，尊重科学，懂技术会管理，善于开拓市场，诚实守信，以客户要求为己任，充分发扬团队精神的员工队伍，员工人数达0。自成立以来天津市科威科技有限公司不断钻研，力求稳妥，对多种方式的利弊进行了大量指标的采集、整理、统计、分析和综合对比，力服务最佳化。选择我们就是选择专业！",天津市科威科技有限公司,天津市,"其他智能卡; ; 集成防盗报警系统; 云台",,天津市,,,300200,,,,,私营有限责任公司,"安防监控设备, 门禁考勤器材及系统, 楼宇对讲设备, 集成防盗报警系统",吴先生,022-88353288,待开放
234,"2018-06-24 22:13:52",广州市格优科技有限公司,生产加工,2004,"广东 广州市海珠区 广州市广州大道南911号中智商务大厦8F","广州市格优科技有限公司，于2004在广东/广州注册成立，我公司以生产加工的经营模式主营集成防盗报警系统; 防盗天线; 防盗扣; 标签。我公司拥有专业的技术和销售团队，员工人数11 - 50 人，实力雄厚注册资本人民币50万元。广州市格优科技有限公司是广州市海珠区知名企业，办公地址为广东 广州市海珠区 广州市广州大道南911号中智商务大厦8F，如果您对我们的产品、技术或服务有兴趣，随时欢迎您的来电或上门咨询。",广州市格优科技有限公司,广东/广州,"集成防盗报警系统; 防盗天线; 防盗扣; 标签",人民币50万元,广东/广州,谭汉松,,,,,,,,,"谭汉松 先生 （总经理）",020-89001908,待开放
235,"2018-06-24 22:13:52",深圳安博士防盗报警重庆总代理,,未登记,重庆市石桥铺太平洋安防市场3c01号,"深圳安博士防盗报警重庆总代理，是重庆市知名公司，我们以的方式主要经营集成防盗报警系统; 家具锁;办公锁。我们有优秀的产品和专业的销售及技术团队，我们为客户提供优秀的产品、良好的技术支持、健全的售后服务。深圳安博士防盗报警重庆总代理办公地址为重庆市石桥铺太平洋安防市场3c01号，员工人数有0，如果您对我们的产品或服务感兴趣，欢迎您联系我司的宋燕飞了解具体情况。",深圳安博士防盗报警重庆总代理,重庆市,"集成防盗报警系统; 家具锁;办公锁",,重庆市,,,400000,www.cq-abs.com/,,,,集体企业,集成防盗报警系统,宋燕飞,023-65294270,待开放
236,"2018-06-24 22:13:54",天津启航威视安防有限公司,贸易型,未登记,天津南开区天津市南开区复康路25号天津教育科学研究院708室,"天津启航威视安防有限公司是专业承揽影音电器配件; 安防监控设备; 安检探测器; 集成防盗报警系统的贸易型企业。天津启航威视安防有限公司具有一支开拓进取，尊重科学，懂技术会管理，善于开拓市场，诚实守信，以客户要求为己任，充分发扬团队精神的员工队伍，员工人数达20。自成立以来天津启航威视安防有限公司不断钻研，力求稳妥，对多种贸易型方式的利弊进行了大量指标的采集、整理、统计、分析和综合对比，力服务最佳化。选择我们就是选择专业！",天津启航威视安防有限公司,天津市,"影音电器配件; 安防监控设备; 安检探测器; 集成防盗报警系统",500万人民币元,天津市,孟庆峰,贸易型,300193,www.qihangweishi.com,—,—,,个人独资企业,"安检探测器, 影音电器配件",王小姐,022-58269952,待开放
237,"2018-06-24 22:13:56",天津启航威视监控安装公司,,未登记,天津南开天津南开区白堤路70号运通科技楼406,"天津启航威视监控安装公司是一家以集成防盗报警系统; 其他防盗;报警器材及系统为主的企业，公司办公地址位于天津南开天津南开区白堤路70号运通科技楼406。天津启航威视监控安装公司秉承“诚信、专业”的经营理念,坚持用户至上、质量第一，经过不断的努力和超越已经成为一家在行业内具有相当规模、较大影响力、发展迅速的企业之一。希望广大企业、消费者与我们联系、洽谈，我们会用优秀的产品和服务让您满意！",天津启航威视监控安装公司,天津市,"集成防盗报警系统; 其他防盗;报警器材及系统",,天津市,,,300100,,,,,个体经营,集成防盗报警系统,王小姐,022-83921390,待开放
238,"2018-06-24 22:14:01",天津市天华炬荣工程装饰有限公司,,未登记,天津市河北区东河沿大街95号,"天津市天华炬荣工程装饰有限公司，主要经营其他工程承包; 冷热水系统; 集成防盗报警系统; 净水器;净水设备。业务联系人是刘经理，公司注册资本0。我公司的办公地址位于天津市河北区东河沿大街95号，我们有优秀的产品和专业的销售和技术团队，我们为客户提供优秀的产品、良好的技术支持、健全的售后服务，天津市天华炬荣工程装饰有限公司是0行业知名企业，如果您对我公司的产品服务有兴趣，请来电或上门咨询。",天津市天华炬荣工程装饰有限公司,天津市,"其他工程承包; 冷热水系统; 集成防盗报警系统; 净水器;净水设备",,天津市,,,300100,,,,,私营股份有限公司,"消防设备, 集成防盗报警系统, 门禁考勤器材及系统, 装潢设计",刘经理,022-26219669,
239,"2018-06-24 22:14:03",天津威凯达科技有限公司,,未登记,天津南开区白堤路70号,"天津威凯达科技有限公司，主要经营安检探测器; 探头;感应器; 集成防盗报警系统; 个人报警器。业务联系人是孟庆峰，公司注册资本0。我公司的办公地址位于天津南开区白堤路70号，我们有优秀的产品和专业的销售和技术团队，我们为客户提供优秀的产品、良好的技术支持、健全的售后服务，天津威凯达科技有限公司是0行业知名企业，如果您对我公司的产品服务有兴趣，请来电或上门咨询。",天津威凯达科技有限公司,天津市,"安检探测器; 探头;感应器; 集成防盗报警系统; 个人报警器",,天津市,,,300100,www.vkinden.com,,,,私营有限责任公司,门禁考勤器材及系统,孟庆峰,,待开放
240,"2018-06-24 22:14:07",广州市宇力信息科技有限公司-销售部,经销批发,未登记,"广东 广州市天河区 黄村东路35号B区458房","广州市宇力信息科技有限公司-销售部是专业承揽集成监控系统; 监控摄像机; 接警;报警主机; 集成防盗报警系统; 探头;感应器松下与爱普生投影机的经销批发企业。广州市宇力信息科技有限公司-销售部具有一支开拓进取，尊重科学，懂技术会管理，善于开拓市场，诚实守信，以客户要求为己任，充分发扬团队精神的员工队伍，员工人数达101 - 200 人。自成立以来广州市宇力信息科技有限公司-销售部不断钻研，力求稳妥，对多种经销批发方式的利弊进行了大量指标的采集、整理、统计、分析和综合对比，力服务最佳化。选择我们就是选择专业！",广州市宇力信息科技有限公司-销售部,,"集成监控系统; 监控摄像机; 接警;报警主机; 集成防盗报警系统; 探头;感应器松下与爱普生投影机",人民币0万元,,,,,,,,,,,"韩永源 先生 （经理）",020-82596960,待开放
241,"2018-06-24 22:14:11",停车场停车场系统停车场管理系统停车场厂家停车场设备深圳南泽集团股份有限公司,生产型,未登记,"广东省深圳市南山区深圳停车场,智能停车场管理系统,停车场厂家","停车场停车场系统停车场管理系统停车场厂家停车场设备深圳南泽集团股份有限公司是专业承揽停车场管理系统;停车场收费系统;停车场系统;停车场道闸;停车场设备;电子巡更系统;停车场一卡通系统;蓝牙停车场系统;停车场智能系统;门禁系统 ;道闸机;电动道闸的生产型企业。停车场停车场系统停车场管理系统停车场厂家停车场设备深圳南泽集团股份有限公司具有一支开拓进取，尊重科学，懂技术会管理，善于开拓市场，诚实守信，以客户要求为己任，充分发扬团队精神的员工队伍，员工人数达300。自成立以来停车场停车场系统停车场管理系统停车场厂家停车场设备深圳南泽集团股份有限公司不断钻研，力求稳妥，对多种生产型方式的利弊进行了大量指标的采集、整理、统计、分析和综合对比，力服务最佳化。选择我们就是选择专业！",停车场停车场系统停车场管理系统停车场厂家停车场设备深圳南泽集团股份有限公司,广东省,"停车场管理系统;停车场收费系统;停车场系统;停车场道闸;停车场设备;电子巡更系统;停车场一卡通系统;蓝牙停车场系统;停车场智能系统;门禁系统 ;道闸机;电动道闸",5000万人民币元,广东省,梁冠,生产型,518000,,"大陆,港澳台地区",工程商，经销商、、、,,私营独资企业,安防,梁冠,,待开放
242,"2018-06-24 22:14:16",北京合巨科技有限公司,商业服务,2008,"内蒙古 包头市 医院信息管理系统","北京合巨科技有限公司是北京市海淀区专业的检验系统; lis; his; 医院信息管理系统商业服务服务提供商。公司注册于2008，员工人数51 - 100 人，专业的团队、技术、产品、服务是和您合作的基础，您的电话就是对我们最大的支持，您给我一个电话，我还您一个真诚的合作，我司联系人宋思源 先生 （DBA）。",北京合巨科技有限公司,北京市海淀区,"检验系统; lis; his; 医院信息管理系统",人民币0万元,北京市海淀区,宋思源,,,,,,,,,"宋思源 先生 （DBA）",0472-2212757,待开放
244,"2018-06-24 22:14:19",上海东尚信息科技有限公司,商业服务,2005,"上海 上海市闵行区 软件产品 MES(工业制造业管理系统)","上海东尚信息科技有限公司是上海松江专业的PDA（终端采集器）; 软件; WMS（仓库管理系统）; MES（制造业管理系统）; Workflow(工作流)商业服务服务提供商。公司注册于2005，注册资本有人民币300万元，员工人数11 - 50 人，专业的团队、技术、产品、服务是和您合作的基础，您的电话就是对我们最大的支持，您给我一个电话，我还您一个真诚的合作，我司联系人罗俊生 先生 （软件工程师）。",上海东尚信息科技有限公司,上海松江,"PDA（终端采集器）; 软件; WMS（仓库管理系统）; MES（制造业管理系统）; Workflow(工作流)",人民币300万元,上海松江,蒋振山,,,,,,,,,"罗俊生 先生 （软件工程师）",021-54132551,待开放
245,"2018-06-24 22:14:23",重庆西湖科技有限公司,商业服务,2005,"重庆 重庆市 酒店管理系统及客房智能控制系统","重庆西湖科技有限公司是一家以商业服务酒店配套产品; 酒店管理系统; 客房智能控制系统; POS点菜系统; 计算机系统集成为主的企业，公司办公地址位于重庆 重庆市 酒店管理系统及客房智能控制系统。重庆西湖科技有限公司秉承“诚信、专业”的经营理念,坚持用户至上、质量第一，经过不断的努力和超越已经成为一家在行业内具有相当规模、较大影响力、发展迅速的企业之一。希望广大企业、消费者与我们联系、洽谈，我们会用优秀的产品和服务让您满意！",重庆西湖科技有限公司,重庆,"酒店配套产品; 酒店管理系统; 客房智能控制系统; POS点菜系统; 计算机系统集成",人民币0万元,重庆,,,,,,,,,,"郑自刚 先生 （负责人）",23-67536123,待开放
247,"2018-06-24 22:14:23",深圳市鼎卓科技有限公司渠道经营部,商业服务,未登记,"中国 广东 深圳市福田区计算机软硬件开发;ERP开发服务;企业管理软件;CRM客户管理系统;OA","深圳市鼎卓科技有限公司渠道经营部是一家以商业服务计算机软硬件开发; ERP开发服务; 企业管理软件; CRM客户管理系统; OA为主的企业，公司办公地址位于中国 广东 深圳市福田区计算机软硬件开发;ERP开发服务;企业管理软件;CRM客户管理系统;OA。深圳市鼎卓科技有限公司渠道经营部秉承“诚信、专业”的经营理念,坚持用户至上、质量第一，经过不断的努力和超越已经成为一家在行业内具有相当规模、较大影响力、发展迅速的企业之一。希望广大企业、消费者与我们联系、洽谈，我们会用优秀的产品和服务让您满意！",深圳市鼎卓科技有限公司渠道经营部,广东省,"计算机软硬件开发; ERP开发服务; 企业管理软件; CRM客户管理系统; OA",50万人民币元,广东省,,商业服务,518000,www.infowin.com.cn,,工厂及制造业，零售、商贸行业,,私营有限责任公司,软件开发;,,0755-85291980,待开放
248,"2018-06-24 22:14:24",深圳春晨科技有限公司（停车场管理系统生产产家）,,未登记,"中国 广东 深圳市 南山区 停车场管理系统","深圳春晨科技有限公司（停车场管理系统生产产家），主要经营停车场管理系统，公司注册资本未知，我公司的办公地址位于中国第一个经济特区，鹏城深圳，中国 广东 深圳市南山区 停车场管理系统，我们有最好的产品和专业的销售和技术团队，我们为客户提供最好的产品、良好的技术支持、健全的售后服务，深圳春晨科技有限公司（停车场管理系统生产产家）是深圳停车场设备行业知名企业，如果您对我公司的产品服务有兴趣，请来电咨询。",深圳春晨科技有限公司（停车场管理系统生产产家）,,停车场管理系统,,,,,518000,,,,停车场设备,,,518000(邮政编码),86-0755-26067644,
249,"2018-06-24 22:14:25",停车场(中国)股份有限公司,,2001年1月1日,深圳市停车场区道闸镇停车场管理系统生产工业园,"深圳市南泽电子有限公司是南泽集团股份有限公司旗下的子公司 招商经理：段谟滋 手机：13699769160，主营项目：沧州停车场系统|嘉兴停车场管理系统|石家庄停车场设备|邯郸最好的停车场系统|中山最好的停车场系统|包头最好的停车场系统|沈阳最好的停车场系统|大连最好的停车场系统|长春最好的停车场系统|湛江最好的停车场系统|哈尔滨最好的停车场系统|大庆最好的停车场系统|杭州最好的停车场系统|湖州最好的停车场系统|合肥最好的停车场系统|徐州最好的停车场系统|福州最好的停车场系统|厦门最好的停车场系统|济南最好的停车场系统|烟台最好的停车场系统|安阳最好的停车场系统|焦作最好的停车场系统|襄樊最好的停车场系统|宜昌最好的停车场系统|长沙最好的停车场系统|岳阳最好的停车场系统|佛山最好的停车场系统|东莞最好的停车场系统|南宁最好的停车场系统|柳州最好的停车场系统|海口最好的停车场系统|三亚最好的停车场系统|威海最好的停车场系统|重庆最好的停车场系统|东营最好的停车场系统|临沂最好的停车场系统|贵阳最好的停车场系统|遵义最好的停车场系统|曲靖最好的停车场系统|玉溪最好的停车场系统|兰州最好的停车场系统|酒泉最好的停车场系统|西宁最好的停车场系统|西安最好的停车场系统|宁夏最好的停车场系统|银川最好的停车场系统|新疆最好的停车场系统|乌鲁木齐最好的停车场系统|太原最好的停车场系统|大同最好的停车场系统| 台州最好的停车场系统|宁波最好的停车场系统| 泉州最好的停车场系统|温州最好的停车场系统| 潍坊最好的停车场系统|济宁智能停车场系统。 深圳道闸|广州道闸|东莞道闸北京道闸上海道闸|惠州道闸|西安道闸|厦门道闸|茂名道闸|清远道闸|阳江道闸|湛江道闸|山东道闸|肇庆道闸西安道闸|温州道闸|南京道闸|杭州道闸|天津道闸|大连道闸|南宁道闸|武汉道闸|长沙道闸|太原道闸|成都道闸|香港道闸|澳门道闸|泉州道闸深圳停车场系统|北京停车场系统|上海停车场系统|广州停车场系统|西安停车场系统|厦门停车场系统|南京停车场系统|杭州停车场系统天津停车场系统|大连停车场系统|南宁停车场系统|桂林停车场系统|贵阳停车场系统|武汉停车场系统||长沙停车场系统|长春停车场系统南昌停车场系统|沈阳停车场系统|济南停车场系统|太原停车场系统|成都停车场系统|香港停车场系统|澳门停车场系统|拉萨停车场系统昆明停车场系统|宁波停车场系统|泉州停车场系统|石家庄停车场系统|乌鲁木齐停车场系统|呼和浩特停车场|石家庄道闸|呼和浩特道闸深圳停车场收费管理系统|广州停车场收费管理系统|北京停车场收费管理系统|上海停车场收费管理系统|深圳市道闸|深圳停车场安全设施中山停车场收费管理系统|惠州停车场收费管理系统|西安停车场收费管理系统|厦门停车场收费管理系统|东莞停车场收费管理系统|深圳巡更棒江门停车场收费管理系统|肇庆停车场收费管理系统|汕头停车场收费管理系统|贵阳停车场收费管理系统|深圳市栅栏 本着“优质产品服务顾客，持续改进增强活力”的质量方针，公司建立有完善的品质管理系统，凭借优越稳定的系统性能及优质的服务，南泽产品备受各企事业单位、基础设施场馆、政府机构、交通运输、住宅小区、商业物业等客户的青睐，成功案例包括国家公安部、人力资源和社会保障部、北京鸟巢停车场、水立方停车场、数码大厦、广州亚运会场馆、云南昆明机场、包头机场、等场， 2008年，南泽停车场系统进驻国家体育馆——鸟巢，为第29届奥运会提供专业、贴心的服务。2010年，南泽停车场进驻广州亚运会体育馆，为广州亚运会提供专业、贴心的服务，解决了亚运会停车场难的问题。南泽电子为中国2008年北京奥运会、2010广州亚运会提供永久性建筑主题馆停车场系统和区位引导系统。 成功案例：【国家重点项目经典案例】 北京鸟巢停车场、水立方停车场、数码大厦、广州亚运会场馆、云南昆明机场、包头机场等等、、、　 　 南泽集团旗下： 深圳市南泽电子有限公司 南泽创新创业商学院 招商经理：段谟滋 免费热线：400-688-6150手机:1369976916015919424401qq: 1024828434南泽总网址:http://www.afccc.comhttp://www.anfang58.com南泽集团网站：www.sznanze.net邮箱：sznanze@qq.com公司地址：深圳市停车场区道闸镇停车场管理系统生产工业园",停车场(中国)股份有限公司,,"出入口收费管理;高速闸门机 ;停车场道闸厂家;中距离停车场管理系统;远距离停车场厂家;蓝牙停车场;数字道闸厂家;高速道闸","港币500 万元（万）",,,,518000,,,,无线微波设备,,,518000(邮政编码),"86-0755-33276616 400-688-6150",待开放