category_2_x_yiliao_qixie.id,category_2.id,category_2.ts,category_2.title,category_1.id,category_1.ts,category_1.title,yiliao_qixie.id,yiliao_qixie.ts,yiliao_qixie.title,yiliao_qixie.gongsi,yiliao_qixie.pinpai,yiliao_qixie.fabu_shijian,yiliao_qixie.didian,yiliao_qixie.chanpin_shuoming,yiliao_qixie.chanpin_guige,yiliao_qixie.guige_xinghao,yiliao_qixie.qiye_leixing,yiliao_qixie.lianxiren,yiliao_qixie.lianxi_dianhua,yiliao_qixie.yixie_zhishu,yiliao_qixie.zhuce_shijian
3366,1,"2018-08-12 22:46:33",呼吸机,1,"2018-08-12 22:19:32",手术设备,3366,"2018-08-13 04:43:19",KD300康都cpap小儿cpap无创呼吸机,上海爱宝家用医疗器械店,,2016-07-22,"上海 宝山区","Keyword：空氧混合器、医用空氧混合仪、医用空氧混合器、新生儿氧气浓度调节仪、Bird Blenders、空气氧气混合器。 相关搜索：空氧混合器价格、医用空氧混合器价格、空氧混合器厂家、新生儿氧浓度调节仪厂家、空气氧气混合器厂家 其他进口品牌：费雪派克、Care Fusion(康尔福盛)",,,生产企业,万女士,86-021-66187008,1718,2012-05-26
3367,1,"2018-08-12 22:46:33",呼吸机,1,"2018-08-12 22:19:32",手术设备,3367,"2018-08-13 04:43:23","伟康单水平 Series A-Flex 全自动呼吸机",上海爱宝家用医疗器械店,,2016-07-22,"上海 宝山区","产品特点： ﹡改良算法使呼吸更舒适 ﹡隐藏的加湿器盒(更美观) ﹡超静音设计 ﹡友好的按钮设计 除此之外，它还具有所有老款伟康C-Flex全自动呼吸机的优点，包括： ﹡智能感应系统可以探测您呼气和吸气节奏，感应呼吸气流变化，包括呼吸暂停、低通气及打鼾，并自动调整到最佳的呼气和吸气压力，使用更舒适 ﹡独创的A-Flex功能，可以在呼气时降低呼吸机气压，经美国布朗大学研究证明，可以极大改善睡眠舒适度 ﹡具有面罩©气报警功能 ﹡自动开关功能，使用方便 ﹡自动和手动模式设计 ﹡背景光设计，方便夜用 ﹡电源采用防脱落设计 ﹡可配合一体化的加温湿化器使用 ﹡粉尘过滤片和超净滤片，具有防尘和防过敏作用 ﹡低噪音 ﹡内置智能存储卡记¼长达9个月的睡眠数据 ﹡海拔压力补偿功能 ﹡可以单独或配合PSG进行压力滴定，具有分夜诊断和治疗功能 ﹡Auto-Trak 数字式自动追踪功能：自动追踪病人ÿ一次呼吸，检测气流受限事件自动调节输出压力，反应灵敏 ﹡A-Flex 呼气减压释放专利技术：自动跟踪患者ÿ一次呼吸，依患者呼气气流变化自动输出可降低的压力，压力可三档调节以达到最佳舒适效果 ﹡初筛诊断及压力滴定：配合血氧监测对疑似OSA患者做出初步诊断并进行压力滴定及治疗 ﹡便携式 Encore Por 智能存储卡（SmART Card）：内置生活质量（FOSQ）记¼使用时间、呼吸事件、压力范Χ等，评估治疗效果，确定最佳治疗压力",,,生产企业,万女士,86-021-66187008,1718,2012-05-26
3368,1,"2018-08-12 22:46:33",呼吸机,1,"2018-08-12 22:19:32",手术设备,3368,"2018-08-13 04:43:24",山东济南家用无创睡眠呼吸机值得信赖.品质保证.批发零售,济南康之宁商贸有限公司,康之宁,2016-07-22,"山东 济南","使用呼吸机时： 1、感觉“闷气”是怎么回事 一般是由于初始压力较低导致气量不足，提升压力就可以解决; 如果患者过于紧张，也可能出现这种现象。这时往往表现为呼吸深重、频率加快。只要平静、自然呼吸，“闷气”的感觉很快就会消失; 最后一种可能是由于机器性能不过关导致。表现为吸气时面罩压力严重降低，造成供气不足;呼气时又显著升高，造成呼气费力。往往是电机的性能及电 机控制技术不好导致。使用这样的机器治疗，会出现治疗不足并出现二氧化碳潴留较多。福通及莲花系列睡眠呼吸机都经过模拟肺测试，这方面的性能十分优异。 2、什么原因导致夜间面罩被摘掉? 直接的原因是由于压力不足导致患者憋气(呼吸暂停)。憋气时患者会张口(条件反射)，因大量气流从口吹出，加上憋气后心慌难受，患者自己把面罩扯掉。由于这时患者还处于浅睡或微醒觉状态，晨起后没有记忆。 更为严重的情况是患者因憋气和大量气流从口吹出后觉醒，这时患者表现为心慌(憋气造成)，往往会误认为是被呼吸机憋醒的。 出现这些现象时，往往通过适当提升“压力下限”就可以解决。当然，也可能“压力上限”的设置过低，需要提高。这时应该寻求专业服务商的帮助。 3、为何晨起时感觉腹胀? 一般是由于治疗中压力过高，气流吹进胃里导致的。应该及时寻求专业服务商的帮助。 4、晨起口干是什么原因? 一般有两种可能：一是加温湿化程度不够，适当提高湿化温度即可;另一种是治疗中压力不足，导致因呼吸气量不足产生轻度张口(条件反射)，气流持续从口中少量吹出，造成口干。需要得到专业服务商帮助。 5、为何晨起眼睛发涩不舒服? 因面罩在鼻梁根部有一定程度漏气造成凉风持续吹眼部。 6、白天精神仍不太好是什么原因? 治疗不到位，夜间仍有较多通气不足甚至憋气现象。应联系专业服务商帮助。 7、带呼吸机还会有“呼噜”声吗? 对较重的患者，戴机治疗中偶尔出现短时间(3-5秒)轻度鼾声，属于正常现象。这种现象往往出现在快速入睡过程中，或由侧卧转换成仰卧过程中。否则就说明机器治疗不到位，要么是治疗参数设置不合理，要么是机器性能有缺陷。应该联系服务商解决。 本公司主营产品有：山东呼吸机，济南呼吸机，hxjkzn02进口呼吸机，国产呼吸机，单水平呼吸机，双水平呼吸机，全自动呼吸机，品牌呼吸机，另外上门安装呼吸机，呼吸机消毒，呼吸机清理，呼吸机配件，呼吸机产品，呼吸机管道，呼吸机鼻罩等等，经营品牌广泛，进口、国产呼吸机品牌多样化，保证产品质量的同时，我们还可给予一对一的售后，要消费者百分百放心，使用舒心，无后顾之忧，保证全部产品原装正品，如有需求可与我司联系。 有任何呼吸机的问题或者关于各类打鼾、鼾症、睡眠呼吸暂停，呼吸衰竭、慢阻肺（COPD）、运动神经元病，心衰等呼吸疾病的问题都可以随时咨询我，本公司技术人员会为您推荐一款最适合您的机器。机器不一定价格高就是好，关键是对症选择机器，调节压力。 康之宁呼吸机供应商hxjkzn02联系直通车： 联系人：王经理 联系电话：0531-88026585 手机：13176026106 即时QQ：779557710 公司：http://www.kzncpap.com 公司地址：山东省济南市市中区顺河东街66号银座晶都国际2-1804室",1,,生产企业,王绍彬,0531-88026585,568,2016-04-18
3369,1,"2018-08-12 22:46:33",呼吸机,1,"2018-08-12 22:19:32",手术设备,3369,"2018-08-13 04:43:28",济南呼吸机家用无创睡眠呼吸机专业讲解,济南康之宁商贸有限公司,,2016-07-22,"山东 济南","平时坚持使用山东呼吸机有什么好处 在很多朋友的印象中山东济南呼吸机可能还是医院治疗的时候才会用到的机器，其实现在有很多家庭也会使用睡眠呼吸机，而且一些疾病患者也会经常使用这样的机器帮助自己进行调节。山东青岛呼吸机已经走入了我们的生活，身为家用呼吸机的领导品牌，这款产品也受到了大家的推崇。那么平时我们可以使用无创呼吸机吗？哪些情况下是一定要使用到这种产品呢？ 呼吸机的使用还是非常广泛的，临床上呼吸系统疾病和心脑血管疾病患者也是要每天使用呼吸机来帮助自己维持一个良好的状态。而且手术后的患者为了能够加快恢复也会使用呼吸机来进行辅助，出院后继续使用不仅可以提高患者的免疫力，也能够快速的帮助其恢复健康。购买一台济南呼吸机放在家中，患者每天也都可以使用。 也有一些朋友是因为睡眠质量不高才会需要使用呼吸机，或者是出现了长期打鼾不止的情况也是可以使用这款产品的。济南呼吸机可以有效的治疗打鼾，也能够帮助我们轻松的解决夜间的呼吸问题。坚持使用一段时间就可以看到很好的疗效，特别是一些经常出现精力不济的朋友坚持使用呼吸机也可以逐步的改善身体状态。 已经有越来越多的朋友开始购买这款产品，为了能够保证消费者的权益，最好是在官网购买这款产品，这样也能够确保产品为正品，保证我们的利益不受到损害。相信只要是大家能够坚持使用正品，就可以拥有一个更好的睡眠质量和健康的身体。 那么坚持使用这样的产品具有哪些方面的好处呢？ 提高睡眠质量。现代人的睡眠质量都是有一定问题的，尤其是一些处于亚健康边缘的朋友，身体已经出现了多种隐藏的病情，如果不能及时的调理很容易出现各种疾病。使用济南呼吸机就可以轻松的解决睡眠问题，每天坚持使用一段时间就可以拥有一个很好的睡眠，即便是夜晚一直使用也不会感觉到不适。 改善打鼾。不少人都习惯性的打鼾，医学上也证明这是因为人体出现了一些问题才会引起的打鼾。打鼾如果不能治疗好，还容易诱发多种并发症，心脏病患者更是要注意控制打鼾。使用济南呼吸机可以帮助患者进行调理，打鼾也能够被治好，这样就可以让自己和家人拥有一个更好的睡眠环境。 提高心肺功能。心脑血管疾病和呼吸系统疾病患者都是需要使用呼吸机来进行辅助治疗的，临床上也都会使用这样的机器。济南呼吸机可以提高我们的心肺功能，逐步的缓解身体上的一些不适。对于一些经常会出现缺氧乏力的朋友来讲，使用呼吸机也是非常有好处的，可以改善自己的心肺功能。 本公司主营产品有：山东呼吸机，济南呼吸机，hxjkzn02进口呼吸机，国产呼吸机，单水平呼吸机，双水平呼吸机，全自动呼吸机，品牌呼吸机，另外上门安装呼吸机，呼吸机消毒，呼吸机清理，呼吸机配件，呼吸机产品，呼吸机管道，呼吸机鼻罩等等，经营品牌广泛，进口、国产呼吸机品牌多样化，保证产品质量的同时，我们还可给予一对一的售后，要消费者百分百放心，使用舒心，无后顾之忧，保证全部产品原装正品，如有需求可与我司联系。 有任何呼吸机的问题或者关于各类打鼾、鼾症、睡眠呼吸暂停，呼吸衰竭、慢阻肺（COPD）、运动神经元病，心衰等呼吸疾病的问题都可以随时咨询我，本公司技术人员会为您推荐一款最适合您的机器。机器不一定价格高就是好，关键是对症选择机器，调节压力。 康之宁呼吸机供应商hxjkzn02联系直通车： 联系人：王经理 联系电话：0531-88026585 手机：13176026106 即时QQ：779557710 公司：http://www.kzncpap.com 公司地址：山东省济南市市中区顺河东街66号银座晶都国际2-1804室",,,生产企业,王绍彬,0531-88026585,568,2016-04-18
3370,1,"2018-08-12 22:46:33",呼吸机,1,"2018-08-12 22:19:32",手术设备,3370,"2018-08-13 04:43:32",山东济南呼吸机治疗肺心病呼吸衰.竭等呼吸疾病,济南康之宁商贸有限公司,,2016-07-22,"山东 济南","初用CPAP的问题及处理 1、 信心问题： 病人可能会对其疗效，舒适性及需要终身使用呼吸机表示担心，对使用缺乏信心，医生应向病人详细介绍睡眠呼吸暂停及其危害，强调使用虽然有点不便，但可却避免严重的健康问题。 2、第一夜治疗效果不理想并不意味着治疗失败： 新的使用者总有一个学习掌握呼吸机的过程，要经过一段时间的学习、适应才能熟练自如的使用及掌握其性能。 3、在CPAP呼吸机治疗的初期会出现睡眠反跳： 重症睡眠呼吸暂停综合征患者在治疗初期，会出现REM睡眠及IV期深睡眠异常增多，即所谓""睡眠反跳""。REM睡眠可不间断地持续1-2小时，较正常睡眠时为长。 因为在REM睡眠期，病人对多种刺激的反应能力下降，很难觉醒，如果CPAP呼吸机压力不够，病人还会出现呼吸道阻塞甚至呼吸暂停，引起程度重、持续时间长的缺氧，因此应严密地随访观察，设定足够的压力，这对保障患者的生命安全十分重要，睡眠反跳一般持续1周左右。 4、鼻罩漏气： 当病人自觉鼻罩周围皮肤发凉时，就证明有漏气。漏气造成压力达不到设定值，影响治疗效果，一般由鼻罩大小不合适，头带佩戴松紧度不合适造成，做相应调整即可。另外,旧的面罩也可引起漏气，这与老化、弹性减退有关。需更换新的。 5、皮肤过敏及鼻梁溃疡： 少数患者使用鼻罩时会发生皮肤过敏，表现为与鼻罩接触的皮肤处出现红、肿、痒，甚至水泡、皮肤破溃。尤其是鼻梁部更易发生，这与鼻罩过紧压迫也有一定关系。除了正确使用鼻罩及头带外，还可采取下列方法： 换用气泡型鼻罩 额部垫海绵垫 在皮肤及鼻罩间放置软垫 在每次用鼻罩之前应洗脸，清洗鼻罩鼻梁部的破溃不易愈合，尤其应注意预防。 在应用CPAP呼吸机的初期，不少患者面部及鼻部会出现局部压痕或皮肤发红，这与鼻罩压迫、鼻罩内呼出气体的刺激有关，如无其它症状，不必担心，起床后数小时即可自行消退。几天后，随着使用技术的熟练及皮肤的适应，会自然好转。 有任何呼吸机的问题或者关于各类打鼾、鼾症、睡眠呼吸暂停，呼吸衰竭、慢阻肺（COPD）、运动神经元病，心衰等呼吸疾病的问题都可以随时咨询我，本公司技术人员会为您推荐一款最适合您的机器。机器不一定价格高就是好，关键是对症选择机器，调节压力。 康之宁呼吸机供应商hxjkzn02联系直通车： 联系人：王经理 联系电话：0531-88026585 手机：13176026106 即时QQ：779557710 公司：http://www.kzncpap.com 公司地址：山东省济南市市中区顺河东街66号银座晶都国际2-1804室",,,生产企业,王绍彬,0531-88026585,568,2016-04-18
3371,1,"2018-08-12 22:46:33",呼吸机,1,"2018-08-12 22:19:32",手术设备,3371,"2018-08-13 04:43:32",山东济南呼吸机儿童呼吸机专业康复仪器,济南康之宁商贸有限公司,,2016-07-22,"山东 济南","呼衰对身体的不良影响： 对呼吸影响： 缺氧对呼吸的影响远较CO2潴留的影响为小。缺氧主要通过颈动脉窦和主动脉体化学感受器的反射作用刺激通气，如缺氧程度缓慢加重，这种反射迟钝。CO2是强有力的呼吸中枢兴奋剂，吸入CO2浓度增加，通气量成倍增加，急性CO2潴留出现深、大快速的呼吸；但当吸入超过12%CO2浓度时，通气量不再增加，呼吸机中枢处于被抑制状态。 对肝、肾和造血系统的影响： 氧可直接或间接损害肝使谷丙转氨酶上升，但随着缺氧的纠正，肝功能逐渐恢复正常，慢性呼吸衰竭轻度CO2潴留会扩张肾血管，增加肾血流量，尿量增加。 家用呼吸机可舒缓因肺病引发呼吸衰竭致死的病例增加，使用家用无创通气治疗可助慢性呼吸衰竭患者维持正常生活，减低复发机会和死亡风险。九成慢性呼吸衰竭病人使用家用无创呼吸机，可减低急性呼吸衰竭的复发率达四成，更令病人整体存活率提升至健康人相同水平。 有患者表示，长时间在家使用呼吸机能舒缓头痛和气喘等症状。由于慢性呼吸衰竭病人的呼吸系统未能正常换氧，容易引致头痛、气促和嗜睡等症状，严重者会休克甚至死亡。患者须长期藉呼吸机舒缓病情，让血液中氧气及二氧化碳量能回复至正常水平。随着家用无创呼吸机的普及，病人日间可以正常生活，只须在睡觉、即体内含氧量较低时戴约八个钟氧气罩就可以改善病情。 有任何呼吸机的问题或者关于各类打鼾、鼾症、睡眠呼吸暂停，呼吸衰竭、慢阻肺（COPD）、运动神经元病，心衰等呼吸疾病的问题都可以随时咨询我，本公司技术人员会为您推荐一款最适合您的机器。机器不一定价格高就是好，关键是对症选择机器，调节压力。 康之宁呼吸机供应商hxjkzn02联系直通车： 联系人：王经理 联系电话：0531-88026585 手机：13176026106 即时QQ：779557710 公司：http://www.kzncpap.com 公司地址：山东省济南市市中区顺河东街66号银座晶都国际2-1804室",,,生产企业,王绍彬,0531-88026585,568,2016-04-18
3372,1,"2018-08-12 22:46:33",呼吸机,1,"2018-08-12 22:19:32",手术设备,3372,"2018-08-13 04:43:34",济南睡眠呼吸机家用无创呼吸机专业上门免费安装,济南康之宁商贸有限公司,,2016-07-22,"山东 济南","　　什么是睡眠呼吸机?睡眠呼吸机通常用于睡眠呼吸暂停低通气综合征患者(俗称打呼噜)的治疗，所以给这类呼吸机冠以睡眠呼吸机或家庭呼吸机的称呼。 随着医学的进步，越来越多的患者已经意识到，睡觉打呼噜并不是睡的香，而是患上了睡眠呼吸暂停低通气综合征。人的一生约有1/3的时间在睡眠中度过，良好的睡眠可以使大脑和身体得到充分的休息，使我们在白天保持头脑清醒，精力旺盛，我们每个人都有失眠和睡眠不足的体验，更深深知道睡眠的重要性。然而由打呼噜导致的睡眠不足却是患者自身所无法控制的。 患者睡眠呼吸暂停低通气综合征的患者通常会有这样的表现：白天疲劳嗜睡、起床后咽干口苦口臭、头晕头痛、暴躁易怒、性功能减退等;夜间打呼噜、呼吸暂停、反复憋.醒、频.繁翻身、多汗多尿、失眠多梦等。严重的睡眠呼吸暂停甚至会发生夜间猝死。 目前国际上首选治疗睡眠呼吸暂停综合征的方式就是持续正压通气治疗，即睡眠呼吸机，它也是阻塞型睡眠暂停治疗中使用最为广泛的呼吸机。它能够持续输出一个恒定压力，使患者气道始终处于开放状态，这个压力在整晚的使用中都不会改变，适用于绝大部分睡眠呼吸暂停综合征患者，治疗效果明显，经济实惠，并且安全无副作用，对患者无任何损伤。 有任何呼吸机的问题或者关于各类打鼾、鼾症、睡眠呼吸暂停，呼吸衰竭、慢阻肺（COPD）、运动神经元病，心衰等呼吸疾病的问题都可以随时咨询我，本公司技术人员会为您推荐一款最适合您的机器。机器不一定价格高就是好，关键是对症选择机器，调节压力。 康之宁呼吸机供应商hxjkzn02联系直通车： 联系人：王经理 联系电话：0531-88026585 手机：13176026106 即时QQ：779557710 公司：http://www.kzncpap.com 公司地址：山东省济南市市中区顺河东街66号银座晶都国际2-1804室",,,生产企业,王绍彬,0531-88026585,568,2016-04-18
3373,1,"2018-08-12 22:46:33",呼吸机,1,"2018-08-12 22:19:32",手术设备,3373,"2018-08-13 04:43:38",山东济南哪里有卖呼吸机的,济南康之宁商贸有限公司,,2016-07-22,"山东 济南","1、一款好的呼吸机必须配备人工加温湿化罐。 睡眠呼吸暂停患者戴机治疗时呼吸道内气流速度比自然呼吸时要快，类似于乘坐在飞速行驶的敞篷车上张口呼吸，所以吸入的气流必须经过人工增加温度和湿度，才能保证戴机的舒适性，保证治疗效果。 2、高灵敏度的压力传感管及高性能的电机也是呼吸机性能好的一个重要标志。 由于机械控制方面等的原因，单水平家用呼吸机的实际压力也会随着戴机者的呼吸而上下波动，而不会是理想状态的一条直线。吸气时由于容量变大，面罩处压力会瞬时下降。如果仪器的压力传感不敏感及电机补偿功率不够大，则仪器的压力会下降较大幅度（10%~15%）；而呼气时，由于容量变小，面罩处压力会瞬间上升（10%~15%），如果仪器的压力传感不敏感及电机可操控性不好，则仪器的压力会大幅上升。 3、山东呼吸机应该有超强的漏气补偿功能。 由于戴机者夜间翻身，面罩会不可避免地出现漏气，一量稍有漏气，面罩内的压力即大幅下降，从而出现用户戴着仪器打鼾的现象，因此也就达不到治疗目的。 有任何呼吸机的问题或者关于各类打鼾、鼾症、睡眠呼吸暂停，呼吸衰竭、慢阻肺（COPD）、运动神经元病，心衰等呼吸疾病的问题都可以随时咨询我，本公司技术人员会为您推荐一款最适合您的机器。机器不一定价格高就是好，关键是对症选择机器，调节压力。 康之宁呼吸机供应商hxjkzn02联系直通车： 联系人：王经理 联系电话：0531-88026585 手机：13176026106 即时QQ：779557710 公司：http://www.kzncpap.com 公司地址：山东省济南市市中区顺河东街66号银座晶都国际2-1804室",,,生产企业,王绍彬,0531-88026585,568,2016-04-18
3374,1,"2018-08-12 22:46:33",呼吸机,1,"2018-08-12 22:19:32",手术设备,3374,"2018-08-13 04:43:41",山东济南呼吸机专业指导使用可上门免费安装,济南康之宁商贸有限公司,,2016-07-22,"山东 济南","家用呼吸机是一种可以代替或改善人的呼吸，增加肺通气量，改善呼吸功能的医疗仪器，适用于肺部功能衰竭或者气道阻塞不能正常呼吸的病人。 家用呼吸机的通气方式： 1. 间歇正压呼吸(intermittent positive pressure ventilation,IPPV)：最基本的通气方式。吸气时 产生正压，将气体压入肺内，身体自身压力呼出气体。 2. 呼气平台(plateau)：也叫吸气末正压呼吸(end inspiratory positive pressure breathing,EIPPB)，吸气末，呼气前，呼气阀继续关闭一段时间，再开放呼气，这段时间一般不超过呼吸周期的5%，能减少VD/VT (死腔量/潮气量) 3. 呼气末正压通气(positive end expiratory pressure,PEEP)：在间歇正压通气的前提下，使呼气末 气道内保持一定压力，在治疗呼吸窘迫综合征、非心源性肺水肿、肺出血时起重要作用。 4. 间歇指令通气(intermittent mandatory ventilation,IMV)、同步间歇指令通气(synchronized intermittent mandatory ventilation,SIMV)：属于辅助通气方式，呼吸机管道中有持续气流，(可自主呼 吸)若干次自主呼吸后给一次正压通气，保证每分钟通气量，IMV的呼吸频率成人一般小于 10次/分，儿童为正常频率的1/2~1/10 5. 呼气延迟，也叫滞后呼气(expiratory retard)：主要用于气道早期萎陷和慢性阻塞性肺疾患，如哮喘 等，应用时间不宜太久。 6. 深呼吸或叹息(sigh) 7. 压力支持(pressure support)：自主呼吸基础上，提供一定压力支持，使每次呼吸时压力均能达到预定 峰压值。 8. 气道持续正压通气(continue positive airway pressure,CPAP)：除了调节CPAP旋钮外，一 定要保证足够的流量，应使流量加大3~4倍。CPAP正常值一般4~12cm水柱，特殊情况下可达15厘米水柱。(呼气压4厘米水柱)。 9.分钟指令性通气(MMV)：保证病人活的设置的目标分钟通气量。 10.双水平气道正压通气(BiLEVEL)：即在给定的时间内设置2个不同的压力水平值，病人在2个不同的压力水平上自主呼吸。 11.辅助控制通气模式(Assist/Controlled)：属于纯指令性通气，其中包括：压力控制，压力限制和容量控制。 本公司主营产品有：山东呼吸机，济南呼吸机，hxjkzn02进口呼吸机，国产呼吸机，单水平呼吸机，双水平呼吸机，全自动呼吸机，品牌呼吸机，另外上门安装呼吸机，呼吸机消毒，呼吸机清理，呼吸机配件，呼吸机产品，呼吸机管道，呼吸机鼻罩等等，经营品牌广泛，进口、国产呼吸机品牌多样化，保证产品质量的同时，我们还可给予一对一的售后，要消费者百分百放心，使用舒心，无后顾之忧，保证全部产品原装正品，如有需求可与我司联系。 有任何呼吸机的问题或者关于各类打鼾、鼾症、睡眠呼吸暂停，呼吸衰竭、慢阻肺（COPD）、运动神经元病，心衰等呼吸疾病的问题都可以随时咨询我，本公司技术人员会为您推荐一款最适合您的机器。机器不一定价格高就是好，关键是对症选择机器，调节压力。 康之宁呼吸机供应商hxjkzn02联系直通车： 联系人：王经理 联系电话：0531-88026585 手机：13176026106 即时QQ：779557710 公司：http://www.kzncpap.com 公司地址：山东省济南市市中区顺河东街66号银座晶都国际2-1804室",,,生产企业,王绍彬,0531-88026585,568,2016-04-18
3375,1,"2018-08-12 22:46:33",呼吸机,1,"2018-08-12 22:19:32",手术设备,3375,"2018-08-13 04:43:44",山东济南呼吸机专业指导操作使用，治疗打鼾呼吸机,济南康之宁商贸有限公司,,2016-07-21,"山东 济南","合理的布置工作、休息时间，劳逸分离、坚持安康的生活方式是大家熟知的道理。但是，安康的睡眠、顺畅的呼吸同样是至关重要的，有效地睡眠，是身体各项器官休息、调整的重要保证，假如没有安康的睡眠，不只身体安康难以保证，严重的话以至会危及生命，山东呼吸机。 那么如何防止悲剧的再次发作呢，首先要晓得什么是安康的睡眠，以及不安康的睡眠，即济南呼吸机暂停有什么表现？ 首先，真正的睡眠安康是指人在入睡后，经过本身的调理，疾速进入深度睡眠状态，使身体的各局部器官得到充沛休息。 其次，如何肯定能否患有睡眠呼吸暂停综合症呢？日常表现包括：睡眠时间长但效果欠佳、白昼嗜睡、长期有黑眼圈、精神降落等；从医学角度而言，最精确的就是经过睡眠监测来判别能否患有睡眠呼吸暂停。目前，普通山东呼吸机都会装备多导睡眠监测设备，经过这种设备对运用者停止睡眠监测后，会得到一份关于该运用者的睡眠呼吸监测报告。依据报告中的一些指标，（如：睡眠过程中呼吸暂停的次数，均匀血氧度，最低血氧度）便能够判别出运用者能否患有睡眠呼吸暂停综合症，以及病情的水平，是属于轻度，中度还是重度。 本公司主营产品有：山东呼吸机，济南呼吸机，hxjkzn02进口呼吸机，国产呼吸机，单水平呼吸机，双水平呼吸机，全自动呼吸机，品牌呼吸机，另外上门安装呼吸机，呼吸机消毒，呼吸机清理，呼吸机配件，呼吸机产品，呼吸机管道，呼吸机鼻罩等等，经营品牌广泛，进口、国产呼吸机品牌多样化，保证产品质量的同时，我们还可给予一对一的售后，要消费者百分百放心，使用舒心，无后顾之忧，保证全部产品原装正品，如有需求可与我司联系。 有任何呼吸机的问题或者关于各类打鼾、鼾症、睡眠呼吸暂停，呼吸衰竭、慢阻肺（COPD）、运动神经元病，心衰等呼吸疾病的问题都可以随时咨询我，本公司技术人员会为您推荐一款最适合您的机器。机器不一定价格高就是好，关键是对症选择机器，调节压力。 康之宁呼吸机供应商hxjkzn02联系直通车： 联系人：王经理 联系电话：0531-88026585 手机：13176026106 即时QQ：779557710 公司：http://www.kzncpap.com 公司地址：山东省济南市市中区顺河东街66号银座晶都国际2-1804室",,,生产企业,王绍彬,0531-88026585,568,2016-04-18
3376,1,"2018-08-12 22:46:33",呼吸机,1,"2018-08-12 22:19:32",手术设备,3376,"2018-08-13 04:43:48","山东济南家用无创睡眠呼吸机,专业指导使用呼吸机",济南康之宁商贸有限公司,,2016-07-21,"山东 济南","山东呼吸机，现在随着社会的发展，人类所面临的疾病层出不群，不单单老年人需要家用呼吸机，就连年轻人家中都要备着一个以防后患。打开电脑我们会发现有很多呼吸机的牌子，淘宝上的家用呼吸机更是不胜枚举，但是关于呼吸机价格的问题却很少有人做出完美的回答。 其实就专家分析而言，市面上现在的呼吸机跟医疗上所使用的还不太一样，现在的呼吸机主要时起到一个改善呼吸系统的作用，在深入的话它是达不到的，所以关于呼吸机价格的问题按理说应该没有想象中那么高，主要在于你自己的家庭收入与自我需求，如果你要求的高，需要呼吸机的功能强大，那么自认价格就是高一些，反之你要是目的简单，价格自认就是低一些，所以说这个没有什么明显的界限，只看你怎么去理解。 听了小编以上的讲解我相信大家对呼吸机价格会有一个全方位的理解，但是还得提醒大家需理性消费、理性购物。 本公司主营产品有：山东呼吸机，济南呼吸机，hxjkzn02进口呼吸机，国产呼吸机，单水平呼吸机，双水平呼吸机，全自动呼吸机，品牌呼吸机，另外上门安装呼吸机，呼吸机消毒，呼吸机清理，呼吸机配件，呼吸机产品，呼吸机管道，呼吸机鼻罩等等，经营品牌广泛，进口、国产呼吸机品牌多样化，保证产品质量的同时，我们还可给予一对一的售后，要消费者百分百放心，使用舒心，无后顾之忧，保证全部产品原装正品，如有需求可与我司联系。 有任何呼吸机的问题或者关于各类打鼾、鼾症、睡眠呼吸暂停，呼吸衰竭、慢阻肺（COPD）、运动神经元病，心衰等呼吸疾病的问题都可以随时咨询我，本公司技术人员会为您推荐一款最适合您的机器。机器不一定价格高就是好，关键是对症选择机器，调节压力。 康之宁呼吸机供应商hxjkzn02联系直通车： 联系人：王经理 联系电话：0531-88026585 手机：13176026106 即时QQ：779557710 公司：http://www.kzncpap.com 公司地址：山东省济南市市中区顺河东街66号银座晶都国际2-1804室",,,生产企业,王绍彬,0531-88026585,568,2016-04-18
3377,1,"2018-08-12 22:46:33",呼吸机,1,"2018-08-12 22:19:32",手术设备,3377,"2018-08-13 04:43:49",山东康之宁济南家用无创呼吸机优惠,济南康之宁商贸有限公司,,2016-07-20,"山东 济南","常见的山东呼吸机报警的缘由及处置措施：机械通气已成为临床上不可短少的生命支持手腕，是重症监护、急救复苏和麻醉范畴的主要治疗手腕之一。随着呼吸机的不时改良和开展，呼吸机的各种报警参数日益增加。只要合理地设置和调理这些参数，才干充沛发挥呼吸机的临床作用，预防和降低各种并发症的发作。为了可以及时判别并有效的精确处置各项报警，本文经过察看呼吸机运用过程中所呈现过的报警缘由剖析，提出了相应的处置措施。 高压报警： 普通提示气道阻力增高，肺顺应性降落，人工气道或管道不畅。 缘由1：由于患者冲动，焦躁不安，想要交谈惹起。 处置措施：①检查患者能否咬住气管，自主呼吸能否与呼吸机同步，当呼吸机送气时患者能否屏住呼吸：②必要时运用镇静剂或采取温馨体位；③检查牙垫放置位置能否适宜；④呼吸机潮气量设置能否过高；⑤树立会话以外交流办法：如图片、写字等。 缘由2：由于患者咳嗽惹起。 处置措施：①找出缘由，能否气道分泌物过多、气管插管移位、湿化不够而刺激呼吸道、支气管痉挛等要素惹起，或呼吸机管路牵拉气管插管刺激气道粘膜而惹起；②吸痰或运用有效的吸收技术；③增加湿化，可给雾化吸入器内添加水，检查湿化器能否呈现毛病；④调理呼吸机机械臂，以免呼吸机管路牵拉气管插管。 缘由3：患者呈现病情变化或并发症：如气胸、支气管痉挛、肺水肿、ARDS、血胸。 处置措施：①医生对患者停止细致查体，并查血气剖析及胸片，准备好胸腔闭式引流及急救设备；②对支气管痉挛者，调理机械通气方式，同时给予支气管扩张剂；③对肺水肿者，应用利尿剂，监测出入量，并查胸片。 缘由4：呼吸机冷凝水过多、管路打折、病人压住管路、病人咬管、气道分泌物阻塞、插管移位进入右支气管或支气管痉挛。 处置措施：①断开呼吸机（不超越10秒），肃清管路内积水；②假如管道内积水进入病人气道，可停止吸痰，吸痰后监测不良反响；③检查管路、解除打折等缘由，必要时，运用简易呼吸器人工呼吸以进步氧分压。 低压报警 缘由1：由于气囊漏气，气囊充气缺乏形成，临床上可表现：呼吸急促、紫绀、还能够听到咽喉部有漏气声或听到患者讲话声。 处置措施：①可将气囊逐步充气直到听不见漏气声为止；②假如患者呈现呼吸急促、紫绀加重，立刻运用简易呼吸器停止人工呼吸；③如发作气囊决裂，给予改换气管内导管。 缘由2：由于呼吸机管路决裂、断开或衔接不紧形成漏气。 处置措施：①患者呈现低氧等病症时，给予人工呼吸；②认真检查管路，将各接头接紧，如呼吸机管路决裂，应改换新管路。 二、氧气报警：设置高压和低压报警范围，如呈现问题则呼吸机报警。 缘由①无意将氧浓度改动，如吸痰前调氧浓度为100%后遗忘调回；②氧剖析错误，校正氧浓度；③氧源缺乏，停止调整。 本公司主营产品有：山东呼吸机，济南呼吸机，hxjkzn02进口呼吸机，国产呼吸机，单水平呼吸机，双水平呼吸机，全自动呼吸机，品牌呼吸机，另外上门安装呼吸机，呼吸机消毒，呼吸机清理，呼吸机配件，呼吸机产品，呼吸机管道，呼吸机鼻罩等等，经营品牌广泛，进口、国产呼吸机品牌多样化，保证产品质量的同时，我们还可给予一对一的售后，要消费者百分百放心，使用舒心，无后顾之忧，保证全部产品原装正品，如有需求可与我司联系。 有任何呼吸机的问题或者关于各类打鼾、鼾症、睡眠呼吸暂停，呼吸衰竭、慢阻肺（COPD）、运动神经元病，心衰等呼吸疾病的问题都可以随时咨询我，本公司技术人员会为您推荐一款最适合您的机器。机器不一定价格高就是好，关键是对症选择机器，调节压力。 康之宁呼吸机供应商hxjkzn02联系直通车： 联系人：王经理 联系电话：0531-88026585 手机：13176026106 即时QQ：779557710 公司：http://www.kzncpap.com 公司地址：山东省济南市市中区顺河东街66号银座晶都国际2-1804室",,,生产企业,王绍彬,0531-88026585,568,2016-04-18
3378,1,"2018-08-12 22:46:33",呼吸机,1,"2018-08-12 22:19:32",手术设备,3378,"2018-08-13 04:43:53",济南呼吸机无创家用睡眠呼吸机哪里卖,济南康之宁商贸有限公司,,2016-07-20,"山东 济南","济南呼吸机组成介绍 电子线路和机械气路混装的呼吸机的基本结构一般结构是由氧气源、电磁阀、混合空气装置、限压阀、湿化器和温控电路、气道阻力表、呼吸阀、信号盒、电磁阀控制电路等九部分组成。济南呼吸机 （一）“氧气源” 它是储氧气的装置，专为患者提供吸气时所需的氧气。一般由高压氧气瓶或压缩空气供给。 （二）电磁阀 电磁阀是“氧气源”的开关阀门。它与机械调节阀门不同之处是电控制的，即通过控制电磁阀线圈电流的通与断，来控制其阀门的开与关，从而使气流通或断。它的工作原理与普通继电器有些相似。 （三）混空气 混空气装置是利用高速流体侧向压力减小的原理，由高速喷咀喷射出氧气，产生负压区，两侧的空气压力大于负压区，空气即卷入高速流动的氧气之中。 （四）限压阀 限压阀是确保气体以一定压力输出的气体限压装置。该机出厂时，一般调到6kPa（60cmH2O）高。若机器输出气压超过此数值，将自动泄放气体，以确保病人安全。 （五）湿化器和温控电路 它是一个装有恒温水，气体可以进出的恒温装置。该装置可以免除病人肺部受冷空气的刺激，避免呼吸道粘膜脱水，起到类似于人体呼吸道的湿化、过滤、温暖的作用。温控电路是用来调节湿化器中的水温，并使之保持恒定的电路。 （六）气道阻力表 该表是用来指示病人呼吸道阻力大小的装置。由呼吸道阻力和氧气源压力可以分别推算出氧气的含量（不包括空气中的含氧量）和潮气量。 （七）呼吸阀 它是利用气动的办法，驱动两个活瓣，实现呼气、吸气、负气压三个信号通过时的有机结合的装置。吸气时，吸气活瓣开，机器向病人单向送气，呼气时，吸气活瓣关闭，呼出的气体由呼气道排出。 （八）信号盒 信号盒是由一个灵敏的弹性膜片带动一对密封电气接点而构成的。当吸气负压达到一定值时，接点断开，信号盒输出一个脉冲信号。这样，把患者吸气负压变换成了电信号，并输入到“电磁阀控制电路”，实现对电磁阀的控制作用。 （九）电磁阀控制电路 它是由脉冲数字电路组成的逻辑控制系统，用来控制电磁阀的通或断。最后，通过气路最终实现所要求的呼吸频率、呼与吸时间比的机器控制呼吸、同步呼吸以及主动与被动呼吸的自动转换等。 本公司主营产品有：山东呼吸机，济南呼吸机，hxjkzn02进口呼吸机，国产呼吸机，单水平呼吸机，双水平呼吸机，全自动呼吸机，品牌呼吸机，另外上门安装呼吸机，呼吸机消毒，呼吸机清理，呼吸机配件，呼吸机产品，呼吸机管道，呼吸机鼻罩等等，经营品牌广泛，进口、国产呼吸机品牌多样化，保证产品质量的同时，我们还可给予一对一的售后，要消费者百分百放心，使用舒心，无后顾之忧，保证全部产品原装正品，如有需求可与我司联系。 有任何呼吸机的问题或者关于各类打鼾、鼾症、睡眠呼吸暂停，呼吸衰竭、慢阻肺（COPD）、运动神经元病，心衰等呼吸疾病的问题都可以随时咨询我，本公司技术人员会为您推荐一款最适合您的机器。机器不一定价格高就是好，关键是对症选择机器，调节压力。 康之宁呼吸机供应商hxjkzn02联系直通车： 联系人：王经理 联系电话：0531-88026585 手机：13176026106 即时QQ：779557710 公司：http://www.kzncpap.com 公司地址：山东省济南市市中区顺河东街66号银座晶都国际2-1804室",,,生产企业,王绍彬,0531-88026585,568,2016-04-18
3379,1,"2018-08-12 22:46:33",呼吸机,1,"2018-08-12 22:19:32",手术设备,3379,"2018-08-13 04:43:54",济南家用呼吸机批发零售，质量保证,济南康之宁商贸有限公司,,2016-07-20,"山东 济南","教您更好地使用济南呼吸机 想要更好地使用济南呼吸机，那么你就该知道这几点： 一、呼吸机结构概述 现代呼吸机的结构分为主机、附加结构和监控结构。其中主机是呼吸机最重要的组成部分，分为供气部分和呼气部分。供气部分给患者提供吸气压力、时间和流量，提供的气体容量称为吸气潮气量，提供的压力为吸气压力。呼气部分是让患者呼出气体。附加结构为吸入气体提供吸氧浓度、温度、湿度、连接管和压力保障。监控结构完成监护和警报作用。 二、主机 呼吸机主机 供气部分 呼气部分 1、供气的动力：常见有电力、压缩气体或两者混合 2、供气的触发：呼吸机的控制部分发出信号，呼吸机由呼气相转换成吸气相。可分为压力触发、流速触发和容量触发等。 1、呼气的触发：吸气向呼气转换可根据时间、压力、容量或流速。 3、气道压力：气道正压高低和形态决定可选择的通气模式和设定的参数。 2、呼气的时间：非同步控制通气时，呼气时间由呼吸频率、吸/呼时间比等参数决定。同步呼吸辅助通气时，当患者自主吸气开始时呼气便结束。 4、潮气量：定容型潮气量是恒定的，非定容型潮气量取决于通气模式和相关参数，并且与肺胸病变有关。 5、吸气流速：吸气流速可调节，比如递增、递减、平台型或正弦波型。 6、吸气时间：取决于通气模式和设定的通气参数，也与吸气转呼气方式有关。 3、呼气压力：一般呼气相压力为零，在某些模式时呼气相压力可以是正压（比如持续气道正压通气）或负压（比如间歇正负压通气） 三、附加结构 呼吸机的附加结构 1、空氧混合器 顾名思义，就是混合空气和氧气的装置。一般由三部分组成：平衡阀、配比阀、安全装置。 2、湿化器 必备装置！湿化器对吸入气体进行加温、加湿。大多是通过加温储水罐中的水产生蒸汽，对吸入气气道加温、加湿作用。为减少从湿化器到气道外口之间的温度损失和减少积水，在吸气管道中可安装加热线。提醒：每次开机记得同时启动湿化器！否则病人将会吸入干冷的气体！ 3、雾化器 附加装置，非必备！雾化器有超声雾化和喷雾雾化两种。雾化既可增加湿化效果，也可在雾化中加药物，起治疗作用。但要注意雾化是否增加潮气量，有些呼吸机的雾化器使潮气量增加，有的不增加。 4、安全阀 安全阀包括排气阀、旁路吸入阀。前者防止吸气相气道压力过高，当气道压力在设定范围内时，阀门关闭；当气道压力高于上限时，阀门开启排气。后者是为了避免窒息，呼吸机正常工作时旁路吸入阀是关闭的。 5、连接管道 吸气管道、呼气管道通过一个Y型连接管构成一个密闭回路，湿化装置、温度传感器等均与管路相连。 四、监控结构 呼吸机监控结构 1）监测系统：监测患者和机器本身 2）报警系统 3）记录系统 包括监测压力、通气量、吸入气氧浓度、通气动力机制等。 常见报警：电源切断报警、高低压报警（原因非常多，临床常见）、氧气或空气源压力不足报警等。 记录机械通气的各项参数和呼吸曲线，有利于评价患者病情及治疗经过、总结经验、指导治疗等。 本公司主营产品有：山东呼吸机，济南呼吸机，hxjkzn02进口呼吸机，国产呼吸机，单水平呼吸机，双水平呼吸机，全自动呼吸机，品牌呼吸机，另外上门安装呼吸机，呼吸机消毒，呼吸机清理，呼吸机配件，呼吸机产品，呼吸机管道，呼吸机鼻罩等等，经营品牌广泛，进口、国产呼吸机品牌多样化，保证产品质量的同时，我们还可给予一对一的售后，要消费者百分百放心，使用舒心，无后顾之忧，保证全部产品原装正品，如有需求可与我司联系。 有任何呼吸机的问题或者关于各类打鼾、鼾症、睡眠呼吸暂停，呼吸衰竭、慢阻肺（COPD）、运动神经元病，心衰等呼吸疾病的问题都可以随时咨询我，本公司技术人员会为您推荐一款最适合您的机器。机器不一定价格高就是好，关键是对症选择机器，调节压力。 康之宁呼吸机供应商hxjkzn02联系直通车： 联系人：王经理 联系电话：0531-88026585 手机：13176026106 即时QQ：779557710 公司：http://www.kzncpap.com 公司地址：山东省济南市市中区顺河东街66号银座晶都国际2-1804室",,,生产企业,王绍彬,0531-88026585,568,2016-04-18
3380,1,"2018-08-12 22:46:33",呼吸机,1,"2018-08-12 22:19:32",手术设备,3380,"2018-08-13 04:43:58","济南家用睡眠呼吸机,济南呼吸机哪里卖",济南康之宁商贸有限公司,,2016-07-20,"山东 济南","济南呼吸机有辅助质量效果 济南呼吸机分享吸氧可缓解心绞痛，预防心肌堵塞的发作。心绞痛是因急性心肌缺氧所致，心肌持续缺氧30分钟以上者，可形成心肌堵塞的发作，是病人猝死的一大风险要素。定期保健吸氧或病发时吸氧可预防或缓解心绞痛，心肌堵塞的发作，为治疗争取时间。 呼吸机必需具备四个根本功用，即向肺充气、吸气向呼气转换，排出肺泡气以及呼气向吸气转换，依次循环往复。因而必需有，能提供保送气体的动力，替代人体呼吸肌的工作能产生一定 的呼吸节律，包括呼吸频率和吸呼比， 治疗用的呼吸机，常用于病情较复杂较重的病人，请求功用较齐全，可停止各种呼吸形式，以顺应病情变 化的需求。而麻醉呼吸机主要用于麻醉手术中的病人，病人大多无严重心肺异常，在运输和寄存过程中，严禁横放、倒置、湿润或阳光直射， 在没有装置过滤器和滤网的状况下制止开机，制氧机要放置平稳，否则会增加制氧机运转的噪声，运用制氧机时要避开通火，防止发作火灾。 本公司主营产品有：山东呼吸机，济南呼吸机，hxjkzn02进口呼吸机，国产呼吸机，单水平呼吸机，双水平呼吸机，全自动呼吸机，品牌呼吸机，另外上门安装呼吸机，呼吸机消毒，呼吸机清理，呼吸机配件，呼吸机产品，呼吸机管道，呼吸机鼻罩等等，经营品牌广泛，进口、国产呼吸机品牌多样化，保证产品质量的同时，我们还可给予一对一的售后，要消费者百分百放心，使用舒心，无后顾之忧，保证全部产品原装正品，如有需求可与我司联系。 有任何呼吸机的问题或者关于各类打鼾、鼾症、睡眠呼吸暂停，呼吸衰竭、慢阻肺（COPD）、运动神经元病，心衰等呼吸疾病的问题都可以随时咨询我，本公司技术人员会为您推荐一款最适合您的机器。机器不一定价格高就是好，关键是对症选择机器，调节压力。 康之宁呼吸机供应商hxjkzn02联系直通车： 联系人：王经理 联系电话：0531-88026585 手机：13176026106 即时QQ：779557710 公司：http://www.kzncpap.com 公司地址：山东省济南市市中区顺河东街66号银座晶都国际2-1804室",,,生产企业,王绍彬,0531-88026585,568,2016-04-18
3381,1,"2018-08-12 22:46:33",呼吸机,1,"2018-08-12 22:19:32",手术设备,3381,"2018-08-13 04:44:01",济南哪里卖呼吸机，济南呼吸机批发零售,济南康之宁商贸有限公司,,2016-07-20,"山东 济南","睡眠呼吸暂停低通气综合征的分类： 1.阻塞型：最为常见。其基本病理为睡眠过程中发生上呼吸道阻塞。 病因多为肥胖、增龄、舌根后坠等导致的咽腔狭窄和咽扩张肌力降低、肌肉松弛，以及先天性异常。 2.中枢型：较少见。基本病理为短暂呼吸运动停止。多发生于慢性心力衰竭、脑血管疾病后遗症的病人。 3.混合型：以上两型混合存在。 本公司主营产品有：山东呼吸机，济南呼吸机，hxjkzn02进口呼吸机，国产呼吸机，单水平呼吸机，双水平呼吸机，全自动呼吸机，品牌呼吸机，另外上门安装呼吸机，呼吸机消毒，呼吸机清理，呼吸机配件，呼吸机产品，呼吸机管道，呼吸机鼻罩等等，经营品牌广泛，进口、国产呼吸机品牌多样化，保证产品质量的同时，我们还可给予一对一的售后，要消费者百分百放心，使用舒心，无后顾之忧，保证全部产品原装正品，如有需求可与我司联系。 有任何呼吸机的问题或者关于各类打鼾、鼾症、睡眠呼吸暂停，呼吸衰竭、慢阻肺（COPD）、运动神经元病，心衰等呼吸疾病的问题都可以随时咨询我，本公司技术人员会为您推荐一款最适合您的机器。机器不一定价格高就是好，关键是对症选择机器，调节压力。 康之宁呼吸机供应商hxjkzn02联系直通车： 联系人：王经理 联系电话：0531-88026585 手机：13176026106 即时QQ：779557710 公司：http://www.kzncpap.com 公司地址：山东省济南市市中区顺河东街66号银座晶都国际2-1804室",,,生产企业,王绍彬,0531-88026585,568,2016-04-18
3382,1,"2018-08-12 22:46:33",呼吸机,1,"2018-08-12 22:19:32",手术设备,3382,"2018-08-13 04:44:02",济南呼吸机批发零售，价格优惠，服务专业,济南康之宁商贸有限公司,,2016-07-19,"山东 济南","济南呼吸机使用操作: 1．使用呼吸机时应注意管道连接准确，开通氧气，再开机。 2．湿化罐内加好蒸馏水后再开机，每班检查湿化瓶内的水量，下班前加好蒸馏水。 3．及时清倒积水瓶内液体，防止影响呼吸机正常工作。 4．使用过程中保持呼吸机整洁，机身上不得堆放物品，避免潮湿，每班按时清洁，过滤网及时清洗。 5．呼吸机固定牢固，推动应稳准，必要时两人一起推，避免碰、撞、损坏。 6．遇有停电情况，需立即脱开呼吸机，关闭呼吸机电源，改用人工呼吸器辅助呼吸。 7．使用结束后取下主机内呼出部分管路、外接管道、湿化器、集水器浸泡消毒后用清水冲净，晾干备用。 8．长期使用时，每周更换消毒一次呼吸机管道和湿化器，如遇有细菌培养结果阳性，应立即更换呼吸机管路，以免引起感染。 9．被特殊致病菌污染的呼吸机管路应单独消毒。 有任何呼吸机的问题或者关于各类打鼾、鼾症、睡眠呼吸暂停，呼吸衰竭、慢阻肺（COPD）、运动神经元病，心衰等呼吸疾病的问题都可以随时咨询我，本公司技术人员会为您推荐一款最适合您的机器。机器不一定价格高就是好，关键是对症选择机器，调节压力。",,,生产企业,王绍彬,0531-88026585,568,2016-04-18
3383,1,"2018-08-12 22:46:33",呼吸机,1,"2018-08-12 22:19:32",手术设备,3383,"2018-08-13 04:44:04",山东家用无创呼吸机可上门免费专业安装指导使用,济南康之宁商贸有限公司,,2016-07-19,"山东 济南","呼吸机在临床上的应用体现为什么？ 1.呼吸机治疗的目的主要为: (1) 维持适当的通气量,使肺泡通气量满足机体需要。改善气体交换 功能,维持有效的气体交换。(2)减少呼吸肌的作功。(3)肺内雾化吸 入治疗。(4)预防性机械通气,用于开胸术后或败血症、休克、严重 创伤情况下的呼吸衰竭预防性治疗。 2.呼吸机治疗的指征 成人的呼吸生理指标达到下列标准的任何一项时，即应开始机械通 气治疗： (1)自主呼吸频率大于正常的3倍或小于1/3者。(2)自主潮气量小于 正常1/3者。(3)生理无效腔/潮气量>60%者。(4)肺活量<10-15ml/kg 者。(5)PaCO2 >50mmHg (慢性阻塞性肺疾患除外) 且有继续升高趋 势，或出现精神症状者。 3.呼吸机治疗的适应症 当患者出现呼吸困难或呼吸衰竭症状，应及时使用呼吸机进行机械 通气，以防止因低氧或缺氧而引起的器官功能衰竭。在临床实践中 ，心肺复苏后、中枢神经系统疾病引起肺泡低通气量、成人呼吸窘 迫综合征、重症肺炎、严重肺挫伤引起的低氧血症、部分COPD患者 、ARDS、呼吸衰竭等病人宜使用。 （1）呼吸突然停止或即将停止。 （2）在吸入100%氧气的情况下，动脉血氧分压仍达不到50～60mmHg 。 （3）严重缺氧和二氧化碳储留而引起意识和循环功能障碍。 4.呼吸机与病人的连接方式 （1）经口气管插管。适用于神志不清的病人，应用时间不超过48－ 72小时。 （2）经鼻腔气管插管。 （3）气管切开插管。需较长期作加压人工呼吸治疗的病人，应作气 管切开，放置气管套管。",,,生产企业,王绍彬,0531-88026585,568,2016-04-18
3384,1,"2018-08-12 22:46:33",呼吸机,1,"2018-08-12 22:19:32",手术设备,3384,"2018-08-13 04:44:06",山东济南睡眠无创家用治疗打鼾的呼吸机,济南康之宁商贸有限公司,,2016-07-19,"山东 济南","山东呼吸机商家给您讲解单水平呼吸机、全自动呼吸机、双水平呼 吸机的区别： 1）持续正压呼吸机（CPAP）又称“单水平呼吸机”是临床上用途比 较广泛的呼吸机，它能够持续的输出一个恒定压力，适用于大部分 睡眠呼吸暂停综合症的病人，治疗效果可靠，经济实用。 2）全自动正压呼吸机（Auto CPAP）又称智能型呼吸机，它能自动 探测出病人的呼吸暂停及气流降低量，然后根据上气道阻力、睡眠 时相、体位的不同自动输出变化的压力，以最小的输出压力达到最 佳治疗效果，舒适性较好。同时这种机器带有数据存储功能，自动 记录分析使用情况，评估疗效，功能比较全面。对于严重的呼吸暂 停患者，是最佳的选择。 3）双水平呼吸机（BiPAP），是一种功能最全面的双气道压力呼吸 机，可分别设置较高的吸气压和较低的呼气压，当患者在吸气时机 器提供较高的吸气压力以保持气道开放，呼气时提供较低的呼气压 力，以保证患者呼吸顺畅。机器与呼吸保持同步，该机器适合各类 睡眠呼吸暂停综合症病人及所有需用无创通气治疗的病人，尤其是 一些危重病人，例如：治疗肺心病、肺结合、肺气肿、哮喘、高血 压患者、慢性阻塞性肺病患者、二型呼吸衰竭、低氧血症、二氧化 碳潴留、支气管炎、运动神经元、治疗睡眠呼吸暂停综合症（OSA） 包括：阻塞性、中枢性、混合性鼾症（打呼噜），气管切开恢复期 患者等等。双水平呼吸机（BiPAP ST）是目前功能最全面、顺应性 最好的无创呼吸机. 有任何呼吸机的问题或者关于各类打鼾、鼾症、睡眠呼吸暂停，呼吸衰竭、慢阻肺（COPD）、运动神经元病，心衰等呼吸疾病的问题都可以随时咨询我，本公司技术人员会为您推荐一款最适合您的机器。机器不一定价格高就是好，关键是对症选择机器，调节压力。 康之宁呼吸机供应商hxjkzn02联系直通车： 联系人：王经理 联系电话：0531-88026585 手机：13176026106 即时QQ：779557710 公司： 公司地址：山东省济南市市中区顺河东街66号银座晶都国际2-1804室",,,生产企业,王绍彬,0531-88026585,568,2016-04-18
3385,1,"2018-08-12 22:46:33",呼吸机,1,"2018-08-12 22:19:32",手术设备,3385,"2018-08-13 04:44:09",山东呼吸机家用无创呼吸机首.选康之宁,济南康之宁商贸有限公司,,2016-07-15,"山东 济南","　　睡眠中出现一些异常行为，如梦游症、说梦话、在睡眠中突然骚动、惊叫、心跳加快、呼吸急促、全身出 、定向错乱或出现幻觉、做恶梦、磨牙、不自主笑、肌肉或肢体不自主跳动等。这些发作性异常行为不是出现在整夜睡眠中，而多是发生在一定的睡眠时期。例如，梦游和夜惊，多发生在正相睡眠的后期;而梦呓则多见于正相睡眠的中期，甚至是前期;磨牙、不自主笑、肌肉或肢体跳动等多见于正相睡眠的前期;梦魇多在异相睡眠期出现。睡眠呼吸暂停综合征最早的诊断标准是由美国斯坦福大学的研究人员在70年代提出来的。他们经过调查发现，呼吸机正常人在睡眠中呼吸暂停的频率即每小时的呼吸暂停的次数很少超过5次，因而将每小时的呼吸暂停在5次以上或7小时睡眠中呼吸暂停超过30次的患者诊断为睡眠呼吸暂停综合征的诊断;随着经验的增多、认识的不断深入，人们发现在睡眠时有些患者的呼吸虽然并未完全停止，但吸入的空气量明显减少，不足以维持人体的正常需氧量而出现缺氧，其临床意义与睡眠呼吸暂停相同。因而就将呼吸气流减少到正常的20%～50%，同时伴有血氧饱和度下降4%以上的呼吸紊乱称为低通气，只要患者在睡眠中呼吸暂停和睡眠低通气的总次数超过每小时5次，就可以诊断为睡眠呼吸紊乱综合征，习惯上称之为睡眠呼吸暂停综合征。睡眠状态下，大脑对呼吸的驱动能力降低是导致睡眠呼吸机暂停的原因之一，呼吸中枢对低氧及高二氧化碳刺激反应低下者，更易发生睡眠呼吸机暂停，且呼吸暂停发生后患者不能及时憋醒，以使气流尽快恢复。也就是说，呼吸驱动功能低下者睡眠呼吸机暂停持续的时间及发生的频率增加。中枢性呼吸驱动功能要受到遗传因素的影响，例如单卵双生子中枢的呼吸驱动功能有相似;曾有报道，一家三代九口人都患有睡眠呼吸机暂停综合征，测暄其中五个人的呼吸驱动功能发现，全部对低氧刺激的反应低下，提示中枢呼吸控制功能缺陷。 有任何呼吸机的问题或者关于各类打鼾、鼾症、睡眠呼吸暂停，呼吸衰竭、慢阻肺（COPD）、运动神经元病，心衰等呼吸疾病的问题都可以随时咨询我，本公司技术人员会为您推荐一款最适合您的机器。机器不一定价格高就是好，关键是对症选择机器，调节压力。 康之宁呼吸机供应商hxjkzn02联系直通车： 联系人：王经理 联系电话：0531-88026585 手机：13176026106 即时QQ：779557710 公司： 公司地址：山东省济南市市中区顺河东街66号银座晶都国际2-1804室",,,生产企业,王绍彬,0531-88026585,568,2016-04-18