category_2_x_parts.id,category_2.id,category_2.ts,category_2.title,category_1.id,category_1.ts,category_1.title,parts.id,parts.ts,parts.title,parts.price,parts.lieferumfang,parts.artikeleigenschaften_mengeneinheit,parts.hinweis_zur_altolrucknahme_wichtiger_hinweis_zur_altolverordnung,parts.filter_innenraumluft_artikeleigenschaften,parts.filter_innenraumluft_referenz_nummern_nur_zu_vergleichszwecken,parts.ihre_vorteile_auf_einen_blick,parts.unsere_versandpartner,parts.sichere_und_schnelle_zahlung,parts.delivery_time,parts.delivery_time_text,parts.art_nr,parts.hersteller,parts.teilenummer,parts.artikeleigenschaften_baugruppe,parts.artikeleigenschaften_verwendung,parts.zundkerze,parts.olfilter,parts.luftfilter,parts.filter_innenraumluft,parts.motorol,parts.filter_innenraumluft__artikeleigenschaften,parts.kontakt,parts.kontakt_address,parts.e_mail,parts.fax
864,1,"2018-12-11 01:21:21",Abgasanlage,1,"2018-12-07 04:00:14",Ersatzteile,864,"2018-12-11 03:13:41","ORIGINAL Ford Mittelschalldämpfer 1465052 für MONDEO I II 1.6i/1.8i 16V 88-115PS","109,95 EUR",,,,,,"<ul class=""fa-ul""> <li><i class=""fa-li fa fa-check""></i>Qualität rechnet sich!</li> <li><i class=""fa-li fa fa-check""></i>Hohe Verfügbarkeit</li> <li><i class=""fa-li fa fa-check""></i>Versandkostenfrei innerhalb DE ab 99 €</li> <li><i class=""fa-li fa fa-check""></i>1 Monat Widerrufsrecht</li>","<ul class=""fa-ul""> <li><i class=""fa-li fa fa-check""></i><strong>DHL Paket</strong></li> <li><i class=""fa-li fa fa-check""></i><strong>DPD Predict</strong></li> <li><i class=""fa-li fa fa-check""></i><strong>Spedition</strong>. Die entsprechenden Produkte sind mit dem Hinweis ""Sperrgut"" gekennzeichnet</li> <li><i class=""fa-li fa fa-check""></i>...natürlich inkl. <strong>Sendungsverfolgung</strong>!</li>","<ul class=""fa-ul""> <li><i class=""fa-li fa fa-check""></i><strong>PAYPAL</strong> (Lastschrift, Kreditkarte, Rechnung)</li> <li><i class=""fa-li fa fa-check""></i><strong>AMAZON PAY</strong> (mit Ihrem Amazon Konto)</li> <li><i class=""fa-li fa fa-check""></i><strong>DHL NACHNAHME</strong> (BAR bei Lieferung)</li> <li><i class=""fa-li fa fa-check""></i><strong>VORKASSE</strong> / Banküberweisung</li>","sofort lieferbar","1-2 Werktage",FO503Z339E,Ford,"1 465 052",,,,,,,,,"International Parts Trading GmbH","Breslauer Straße 8 D-31655 Stadthagen ! keine Abholung / kein Umtausch vor Ort !",service.de@myparto.com,"+49 (0) 5721 / 9379010"
865,1,"2018-12-11 01:21:21",Abgasanlage,1,"2018-12-07 04:00:14",Ersatzteile,865,"2018-12-11 03:13:47","ORIGINAL Ford Endschalldämpfer FUSION (JU_) 1.4 TDCi 1.6 TDCi 68/100 PS 1557610","79,95 EUR",,,,,,"<ul class=""fa-ul""> <li><i class=""fa-li fa fa-check""></i>Qualität rechnet sich!</li> <li><i class=""fa-li fa fa-check""></i>Hohe Verfügbarkeit</li> <li><i class=""fa-li fa fa-check""></i>Versandkostenfrei innerhalb DE ab 99 €</li> <li><i class=""fa-li fa fa-check""></i>1 Monat Widerrufsrecht</li>","<ul class=""fa-ul""> <li><i class=""fa-li fa fa-check""></i><strong>DHL Paket</strong></li> <li><i class=""fa-li fa fa-check""></i><strong>DPD Predict</strong></li> <li><i class=""fa-li fa fa-check""></i><strong>Spedition</strong>. Die entsprechenden Produkte sind mit dem Hinweis ""Sperrgut"" gekennzeichnet</li> <li><i class=""fa-li fa fa-check""></i>...natürlich inkl. <strong>Sendungsverfolgung</strong>!</li>","<ul class=""fa-ul""> <li><i class=""fa-li fa fa-check""></i><strong>PAYPAL</strong> (Lastschrift, Kreditkarte, Rechnung)</li> <li><i class=""fa-li fa fa-check""></i><strong>AMAZON PAY</strong> (mit Ihrem Amazon Konto)</li> <li><i class=""fa-li fa fa-check""></i><strong>DHL NACHNAHME</strong> (BAR bei Lieferung)</li> <li><i class=""fa-li fa fa-check""></i><strong>VORKASSE</strong> / Banküberweisung</li>","sofort lieferbar","1-2 Werktage",FO192U409L,Ford,"1 557 610",,,,,,,,,"International Parts Trading GmbH","Breslauer Straße 8 D-31655 Stadthagen ! keine Abholung / kein Umtausch vor Ort !",service.de@myparto.com,"+49 (0) 5721 / 9379010"
866,1,"2018-12-11 01:21:21",Abgasanlage,1,"2018-12-07 04:00:14",Ersatzteile,866,"2018-12-11 03:13:54","ORIGINAL Ford Anschlagpuffer Halter Schalldämpfer FOCUS I ST170 1016405","17,95 EUR",,,,,,"<ul class=""fa-ul""> <li><i class=""fa-li fa fa-check""></i>Qualität rechnet sich!</li> <li><i class=""fa-li fa fa-check""></i>Hohe Verfügbarkeit</li> <li><i class=""fa-li fa fa-check""></i>Versandkostenfrei innerhalb DE ab 99 €</li> <li><i class=""fa-li fa fa-check""></i>1 Monat Widerrufsrecht</li>","<ul class=""fa-ul""> <li><i class=""fa-li fa fa-check""></i><strong>DHL Paket</strong></li> <li><i class=""fa-li fa fa-check""></i><strong>DPD Predict</strong></li> <li><i class=""fa-li fa fa-check""></i><strong>Spedition</strong>. Die entsprechenden Produkte sind mit dem Hinweis ""Sperrgut"" gekennzeichnet</li> <li><i class=""fa-li fa fa-check""></i>...natürlich inkl. <strong>Sendungsverfolgung</strong>!</li>","<ul class=""fa-ul""> <li><i class=""fa-li fa fa-check""></i><strong>PAYPAL</strong> (Lastschrift, Kreditkarte, Rechnung)</li> <li><i class=""fa-li fa fa-check""></i><strong>AMAZON PAY</strong> (mit Ihrem Amazon Konto)</li> <li><i class=""fa-li fa fa-check""></i><strong>DHL NACHNAHME</strong> (BAR bei Lieferung)</li> <li><i class=""fa-li fa fa-check""></i><strong>VORKASSE</strong> / Banküberweisung</li>","sofort lieferbar","1-2 Werktage",FO744R309K,Ford,"1 016 405",,,,,,,,,"International Parts Trading GmbH","Breslauer Straße 8 D-31655 Stadthagen ! keine Abholung / kein Umtausch vor Ort !",service.de@myparto.com,"+49 (0) 5721 / 9379010"
867,1,"2018-12-11 01:21:21",Abgasanlage,1,"2018-12-07 04:00:14",Ersatzteile,867,"2018-12-11 03:13:56","ORIGINAL Ford Krümmerdichtung Abgaskrümmer 1.6EcoBoost 150/182 PS 1721157","12,95 EUR",,,,,,"<ul class=""fa-ul""> <li><i class=""fa-li fa fa-check""></i>Qualität rechnet sich!</li> <li><i class=""fa-li fa fa-check""></i>Hohe Verfügbarkeit</li> <li><i class=""fa-li fa fa-check""></i>Versandkostenfrei innerhalb DE ab 99 €</li> <li><i class=""fa-li fa fa-check""></i>1 Monat Widerrufsrecht</li>","<ul class=""fa-ul""> <li><i class=""fa-li fa fa-check""></i><strong>DHL Paket</strong></li> <li><i class=""fa-li fa fa-check""></i><strong>DPD Predict</strong></li> <li><i class=""fa-li fa fa-check""></i><strong>Spedition</strong>. Die entsprechenden Produkte sind mit dem Hinweis ""Sperrgut"" gekennzeichnet</li> <li><i class=""fa-li fa fa-check""></i>...natürlich inkl. <strong>Sendungsverfolgung</strong>!</li>","<ul class=""fa-ul""> <li><i class=""fa-li fa fa-check""></i><strong>PAYPAL</strong> (Lastschrift, Kreditkarte, Rechnung)</li> <li><i class=""fa-li fa fa-check""></i><strong>AMAZON PAY</strong> (mit Ihrem Amazon Konto)</li> <li><i class=""fa-li fa fa-check""></i><strong>DHL NACHNAHME</strong> (BAR bei Lieferung)</li> <li><i class=""fa-li fa fa-check""></i><strong>VORKASSE</strong> / Banküberweisung</li>","sofort lieferbar","1-2 Werktage",FO781R809H,Ford,"1 721 157",,,,,,,,,"International Parts Trading GmbH","Breslauer Straße 8 D-31655 Stadthagen ! keine Abholung / kein Umtausch vor Ort !",service.de@myparto.com,"+49 (0) 5721 / 9379010"
868,1,"2018-12-11 01:21:21",Abgasanlage,1,"2018-12-07 04:00:14",Ersatzteile,868,"2018-12-11 03:14:09","ORIGINAL BMW Ölleitung Turbolader Lader Ölzulaufleitung 3er 5er 7er 11422247915","43,55 EUR",,,,,,"<ul class=""fa-ul""> <li><i class=""fa-li fa fa-check""></i>Qualität rechnet sich!</li> <li><i class=""fa-li fa fa-check""></i>Hohe Verfügbarkeit</li> <li><i class=""fa-li fa fa-check""></i>Versandkostenfrei innerhalb DE ab 99 €</li> <li><i class=""fa-li fa fa-check""></i>1 Monat Widerrufsrecht</li>","<ul class=""fa-ul""> <li><i class=""fa-li fa fa-check""></i><strong>DHL Paket</strong></li> <li><i class=""fa-li fa fa-check""></i><strong>DPD Predict</strong></li> <li><i class=""fa-li fa fa-check""></i><strong>Spedition</strong>. Die entsprechenden Produkte sind mit dem Hinweis ""Sperrgut"" gekennzeichnet</li> <li><i class=""fa-li fa fa-check""></i>...natürlich inkl. <strong>Sendungsverfolgung</strong>!</li>","<ul class=""fa-ul""> <li><i class=""fa-li fa fa-check""></i><strong>PAYPAL</strong> (Lastschrift, Kreditkarte, Rechnung)</li> <li><i class=""fa-li fa fa-check""></i><strong>AMAZON PAY</strong> (mit Ihrem Amazon Konto)</li> <li><i class=""fa-li fa fa-check""></i><strong>DHL NACHNAHME</strong> (BAR bei Lieferung)</li> <li><i class=""fa-li fa fa-check""></i><strong>VORKASSE</strong> / Banküberweisung</li>","sofort lieferbar","1-2 Werktage",BM200D813E,BMW,"11 42 2 247 915",,,,,,,,,"International Parts Trading GmbH","Breslauer Straße 8 D-31655 Stadthagen ! keine Abholung / kein Umtausch vor Ort !",service.de@myparto.com,"+49 (0) 5721 / 9379010"
869,1,"2018-12-11 01:21:21",Abgasanlage,1,"2018-12-07 04:00:14",Ersatzteile,869,"2018-12-11 03:14:21","ORIGINAL Ford Ladeluftschlauch Transit Connect 1.8TDCi 110 PS 5050743","191,95 EUR",,,,,,"<ul class=""fa-ul""> <li><i class=""fa-li fa fa-check""></i>Qualität rechnet sich!</li> <li><i class=""fa-li fa fa-check""></i>Hohe Verfügbarkeit</li> <li><i class=""fa-li fa fa-check""></i>Versandkostenfrei innerhalb DE ab 99 €</li> <li><i class=""fa-li fa fa-check""></i>1 Monat Widerrufsrecht</li>","<ul class=""fa-ul""> <li><i class=""fa-li fa fa-check""></i><strong>DHL Paket</strong></li> <li><i class=""fa-li fa fa-check""></i><strong>DPD Predict</strong></li> <li><i class=""fa-li fa fa-check""></i><strong>Spedition</strong>. Die entsprechenden Produkte sind mit dem Hinweis ""Sperrgut"" gekennzeichnet</li> <li><i class=""fa-li fa fa-check""></i>...natürlich inkl. <strong>Sendungsverfolgung</strong>!</li>","<ul class=""fa-ul""> <li><i class=""fa-li fa fa-check""></i><strong>PAYPAL</strong> (Lastschrift, Kreditkarte, Rechnung)</li> <li><i class=""fa-li fa fa-check""></i><strong>AMAZON PAY</strong> (mit Ihrem Amazon Konto)</li> <li><i class=""fa-li fa fa-check""></i><strong>DHL NACHNAHME</strong> (BAR bei Lieferung)</li> <li><i class=""fa-li fa fa-check""></i><strong>VORKASSE</strong> / Banküberweisung</li>","sofort lieferbar","1-2 Werktage",FO268D429S,Ford,"5 050 743",,,,,,,,,"International Parts Trading GmbH","Breslauer Straße 8 D-31655 Stadthagen ! keine Abholung / kein Umtausch vor Ort !",service.de@myparto.com,"+49 (0) 5721 / 9379010"
870,1,"2018-12-11 01:21:21",Abgasanlage,1,"2018-12-07 04:00:14",Ersatzteile,870,"2018-12-11 03:14:34","ORIGINAL BMW Kühler AGR-Ventil Unterdruckbehälter 4-Zylinder DIESEL 11717810751","511,95 EUR",,,,,,"<ul class=""fa-ul""> <li><i class=""fa-li fa fa-check""></i>Qualität rechnet sich!</li> <li><i class=""fa-li fa fa-check""></i>Hohe Verfügbarkeit</li> <li><i class=""fa-li fa fa-check""></i>Versandkostenfrei innerhalb DE ab 99 €</li> <li><i class=""fa-li fa fa-check""></i>1 Monat Widerrufsrecht</li>","<ul class=""fa-ul""> <li><i class=""fa-li fa fa-check""></i><strong>DHL Paket</strong></li> <li><i class=""fa-li fa fa-check""></i><strong>DPD Predict</strong></li> <li><i class=""fa-li fa fa-check""></i><strong>Spedition</strong>. Die entsprechenden Produkte sind mit dem Hinweis ""Sperrgut"" gekennzeichnet</li> <li><i class=""fa-li fa fa-check""></i>...natürlich inkl. <strong>Sendungsverfolgung</strong>!</li>","<ul class=""fa-ul""> <li><i class=""fa-li fa fa-check""></i><strong>PAYPAL</strong> (Lastschrift, Kreditkarte, Rechnung)</li> <li><i class=""fa-li fa fa-check""></i><strong>AMAZON PAY</strong> (mit Ihrem Amazon Konto)</li> <li><i class=""fa-li fa fa-check""></i><strong>DHL NACHNAHME</strong> (BAR bei Lieferung)</li> <li><i class=""fa-li fa fa-check""></i><strong>VORKASSE</strong> / Banküberweisung</li>","sofort lieferbar","1-2 Werktage",BM443T213K,BMW,"11 71 7 810 751",,,,,,,,,"International Parts Trading GmbH","Breslauer Straße 8 D-31655 Stadthagen ! keine Abholung / kein Umtausch vor Ort !",service.de@myparto.com,"+49 (0) 5721 / 9379010"
871,1,"2018-12-11 01:21:21",Abgasanlage,1,"2018-12-07 04:00:14",Ersatzteile,871,"2018-12-11 03:14:41","ORIGINAL Renault Ladeluftschlauch Turboschlauch CLIO IV 1.5dCi 75 PS 144609034R","169,70 EUR",,,,,,"<ul class=""fa-ul""> <li><i class=""fa-li fa fa-check""></i>Qualität rechnet sich!</li> <li><i class=""fa-li fa fa-check""></i>Hohe Verfügbarkeit</li> <li><i class=""fa-li fa fa-check""></i>Versandkostenfrei innerhalb DE ab 99 €</li> <li><i class=""fa-li fa fa-check""></i>1 Monat Widerrufsrecht</li>","<ul class=""fa-ul""> <li><i class=""fa-li fa fa-check""></i><strong>DHL Paket</strong></li> <li><i class=""fa-li fa fa-check""></i><strong>DPD Predict</strong></li> <li><i class=""fa-li fa fa-check""></i><strong>Spedition</strong>. Die entsprechenden Produkte sind mit dem Hinweis ""Sperrgut"" gekennzeichnet</li> <li><i class=""fa-li fa fa-check""></i>...natürlich inkl. <strong>Sendungsverfolgung</strong>!</li>","<ul class=""fa-ul""> <li><i class=""fa-li fa fa-check""></i><strong>PAYPAL</strong> (Lastschrift, Kreditkarte, Rechnung)</li> <li><i class=""fa-li fa fa-check""></i><strong>AMAZON PAY</strong> (mit Ihrem Amazon Konto)</li> <li><i class=""fa-li fa fa-check""></i><strong>DHL NACHNAHME</strong> (BAR bei Lieferung)</li> <li><i class=""fa-li fa fa-check""></i><strong>VORKASSE</strong> / Banküberweisung</li>","sofort lieferbar","1-2 Werktage",RE339A013B,RENAULT,"14 46 090 34R",,,,,,,,,"International Parts Trading GmbH","Breslauer Straße 8 D-31655 Stadthagen ! keine Abholung / kein Umtausch vor Ort !",service.de@myparto.com,"+49 (0) 5721 / 9379010"
872,1,"2018-12-11 01:21:21",Abgasanlage,1,"2018-12-07 04:00:14",Ersatzteile,872,"2018-12-11 03:14:48","ORIGINAL Citroen Peugeot Dichtungssatz Abgasanlage Auspuff Schalldämpfer 1797.74","11,95 EUR",,,,,,"<ul class=""fa-ul""> <li><i class=""fa-li fa fa-check""></i>Qualität rechnet sich!</li> <li><i class=""fa-li fa fa-check""></i>Hohe Verfügbarkeit</li> <li><i class=""fa-li fa fa-check""></i>Versandkostenfrei innerhalb DE ab 99 €</li> <li><i class=""fa-li fa fa-check""></i>1 Monat Widerrufsrecht</li>","<ul class=""fa-ul""> <li><i class=""fa-li fa fa-check""></i><strong>DHL Paket</strong></li> <li><i class=""fa-li fa fa-check""></i><strong>DPD Predict</strong></li> <li><i class=""fa-li fa fa-check""></i><strong>Spedition</strong>. Die entsprechenden Produkte sind mit dem Hinweis ""Sperrgut"" gekennzeichnet</li> <li><i class=""fa-li fa fa-check""></i>...natürlich inkl. <strong>Sendungsverfolgung</strong>!</li>","<ul class=""fa-ul""> <li><i class=""fa-li fa fa-check""></i><strong>PAYPAL</strong> (Lastschrift, Kreditkarte, Rechnung)</li> <li><i class=""fa-li fa fa-check""></i><strong>AMAZON PAY</strong> (mit Ihrem Amazon Konto)</li> <li><i class=""fa-li fa fa-check""></i><strong>DHL NACHNAHME</strong> (BAR bei Lieferung)</li> <li><i class=""fa-li fa fa-check""></i><strong>VORKASSE</strong> / Banküberweisung</li>","sofort lieferbar","1-2 Werktage",PE613P813W,PEUGEOT,1797.74,,,,,,,,,"International Parts Trading GmbH","Breslauer Straße 8 D-31655 Stadthagen ! keine Abholung / kein Umtausch vor Ort !",service.de@myparto.com,"+49 (0) 5721 / 9379010"
873,1,"2018-12-11 01:21:21",Abgasanlage,1,"2018-12-07 04:00:14",Ersatzteile,873,"2018-12-11 03:14:59","ORIGINAL Citroen Peugeot AGR Ventil BERLINGO C2 C3 106 206 306 1.1 1.4 1618.24","72,27 EUR",,,,,,"<ul class=""fa-ul""> <li><i class=""fa-li fa fa-check""></i>Qualität rechnet sich!</li> <li><i class=""fa-li fa fa-check""></i>Hohe Verfügbarkeit</li> <li><i class=""fa-li fa fa-check""></i>Versandkostenfrei innerhalb DE ab 99 €</li> <li><i class=""fa-li fa fa-check""></i>1 Monat Widerrufsrecht</li>","<ul class=""fa-ul""> <li><i class=""fa-li fa fa-check""></i><strong>DHL Paket</strong></li> <li><i class=""fa-li fa fa-check""></i><strong>DPD Predict</strong></li> <li><i class=""fa-li fa fa-check""></i><strong>Spedition</strong>. Die entsprechenden Produkte sind mit dem Hinweis ""Sperrgut"" gekennzeichnet</li> <li><i class=""fa-li fa fa-check""></i>...natürlich inkl. <strong>Sendungsverfolgung</strong>!</li>","<ul class=""fa-ul""> <li><i class=""fa-li fa fa-check""></i><strong>PAYPAL</strong> (Lastschrift, Kreditkarte, Rechnung)</li> <li><i class=""fa-li fa fa-check""></i><strong>AMAZON PAY</strong> (mit Ihrem Amazon Konto)</li> <li><i class=""fa-li fa fa-check""></i><strong>DHL NACHNAHME</strong> (BAR bei Lieferung)</li> <li><i class=""fa-li fa fa-check""></i><strong>VORKASSE</strong> / Banküberweisung</li>","sofort lieferbar","1-2 Werktage",PE313A213W,PEUGEOT,1618.24,,,,,,,,,"International Parts Trading GmbH","Breslauer Straße 8 D-31655 Stadthagen ! keine Abholung / kein Umtausch vor Ort !",service.de@myparto.com,"+49 (0) 5721 / 9379010"
875,1,"2018-12-11 01:21:21",Abgasanlage,1,"2018-12-07 04:00:14",Ersatzteile,875,"2018-12-11 03:15:08","ORIGINAL VW AGR Ventil Kühler Abgasrückführung Reglerklappe 2.0 TDI 03L131512B","260,95 EUR","<br><br><ul><li>1x Kühler, Abgasrückführung Stück - 03L 131 512 B</li><li>1x Dichtung, AGR-Ventil Stück - 069 131 547 D</li></ul> <br><br>",,,,"<ul><li>AJUSA - 01089900 / 01089900</li><li>AUDI - 069 131 547 D / 069131547D</li><li>CONTINENTAL CTAM - A2C59516939 / A2C59516939</li><li>ELRING - 729970 / 729970</li><li>SEAT - 069 131 547 D / 069131547D</li><li>SKODA - 069 131 547 D / 069131547D</li><li>VAG - 069 131 547 D / 069131547D</li><li>VW - 069 131 547 D / 069131547D</li>","<ul class=""fa-ul""> <li><i class=""fa-li fa fa-check""></i>Qualität rechnet sich!</li> <li><i class=""fa-li fa fa-check""></i>Hohe Verfügbarkeit</li> <li><i class=""fa-li fa fa-check""></i>Versandkostenfrei innerhalb DE ab 99 €</li> <li><i class=""fa-li fa fa-check""></i>1 Monat Widerrufsrecht</li>","<ul class=""fa-ul""> <li><i class=""fa-li fa fa-check""></i><strong>DHL Paket</strong></li> <li><i class=""fa-li fa fa-check""></i><strong>DPD Predict</strong></li> <li><i class=""fa-li fa fa-check""></i><strong>Spedition</strong>. Die entsprechenden Produkte sind mit dem Hinweis ""Sperrgut"" gekennzeichnet</li> <li><i class=""fa-li fa fa-check""></i>...natürlich inkl. <strong>Sendungsverfolgung</strong>!</li>","<ul class=""fa-ul""> <li><i class=""fa-li fa fa-check""></i><strong>PAYPAL</strong> (Lastschrift, Kreditkarte, Rechnung)</li> <li><i class=""fa-li fa fa-check""></i><strong>AMAZON PAY</strong> (mit Ihrem Amazon Konto)</li> <li><i class=""fa-li fa fa-check""></i><strong>DHL NACHNAHME</strong> (BAR bei Lieferung)</li> <li><i class=""fa-li fa fa-check""></i><strong>VORKASSE</strong> / Banküberweisung</li>","sofort lieferbar","1-2 Werktage",PP706R282E,Volkswagen,"03L 131 512 B",,,,,,,,"<ul><li>Baugruppe: Abgasrückführung</li><li>Verwendung: AGR-Ventil</li><li>Mengeneinheit: Stück</li>","International Parts Trading GmbH","Breslauer Straße 8 D-31655 Stadthagen ! keine Abholung / kein Umtausch vor Ort !",service.de@myparto.com,"+49 (0) 5721 / 9379010"
876,1,"2018-12-11 01:21:21",Abgasanlage,1,"2018-12-07 04:00:14",Ersatzteile,876,"2018-12-11 03:15:20","ORIGINAL Ford Krümmerdichtung Ansaugkrümmer FOCUS III MONDEO V 2.0 TDCi 1860585","15,95 EUR",,,,,,"<ul class=""fa-ul""> <li><i class=""fa-li fa fa-check""></i>Qualität rechnet sich!</li> <li><i class=""fa-li fa fa-check""></i>Hohe Verfügbarkeit</li> <li><i class=""fa-li fa fa-check""></i>Versandkostenfrei innerhalb DE ab 99 €</li> <li><i class=""fa-li fa fa-check""></i>1 Monat Widerrufsrecht</li>","<ul class=""fa-ul""> <li><i class=""fa-li fa fa-check""></i><strong>DHL Paket</strong></li> <li><i class=""fa-li fa fa-check""></i><strong>DPD Predict</strong></li> <li><i class=""fa-li fa fa-check""></i><strong>Spedition</strong>. Die entsprechenden Produkte sind mit dem Hinweis ""Sperrgut"" gekennzeichnet</li> <li><i class=""fa-li fa fa-check""></i>...natürlich inkl. <strong>Sendungsverfolgung</strong>!</li>","<ul class=""fa-ul""> <li><i class=""fa-li fa fa-check""></i><strong>PAYPAL</strong> (Lastschrift, Kreditkarte, Rechnung)</li> <li><i class=""fa-li fa fa-check""></i><strong>AMAZON PAY</strong> (mit Ihrem Amazon Konto)</li> <li><i class=""fa-li fa fa-check""></i><strong>DHL NACHNAHME</strong> (BAR bei Lieferung)</li> <li><i class=""fa-li fa fa-check""></i><strong>VORKASSE</strong> / Banküberweisung</li>","kurzfristig lieferbar","1-2 Werktage",FO267D739S,Ford,"1 860 585",,,,,,,,,"International Parts Trading GmbH","Breslauer Straße 8 D-31655 Stadthagen ! keine Abholung / kein Umtausch vor Ort !",service.de@myparto.com,"+49 (0) 5721 / 9379010"
877,1,"2018-12-11 01:21:21",Abgasanlage,1,"2018-12-07 04:00:14",Ersatzteile,877,"2018-12-11 03:15:32","ORIGINAL Ford Mittelschalldämpfer FOCUS C-MAX / C-MAX FOCUS II 1.4 1.6 1677746","105,95 EUR",,,,,,"<ul class=""fa-ul""> <li><i class=""fa-li fa fa-check""></i>Qualität rechnet sich!</li> <li><i class=""fa-li fa fa-check""></i>Hohe Verfügbarkeit</li> <li><i class=""fa-li fa fa-check""></i>Versandkostenfrei innerhalb DE ab 99 €</li> <li><i class=""fa-li fa fa-check""></i>1 Monat Widerrufsrecht</li>","<ul class=""fa-ul""> <li><i class=""fa-li fa fa-check""></i><strong>DHL Paket</strong></li> <li><i class=""fa-li fa fa-check""></i><strong>DPD Predict</strong></li> <li><i class=""fa-li fa fa-check""></i><strong>Spedition</strong>. Die entsprechenden Produkte sind mit dem Hinweis ""Sperrgut"" gekennzeichnet</li> <li><i class=""fa-li fa fa-check""></i>...natürlich inkl. <strong>Sendungsverfolgung</strong>!</li>","<ul class=""fa-ul""> <li><i class=""fa-li fa fa-check""></i><strong>PAYPAL</strong> (Lastschrift, Kreditkarte, Rechnung)</li> <li><i class=""fa-li fa fa-check""></i><strong>AMAZON PAY</strong> (mit Ihrem Amazon Konto)</li> <li><i class=""fa-li fa fa-check""></i><strong>DHL NACHNAHME</strong> (BAR bei Lieferung)</li> <li><i class=""fa-li fa fa-check""></i><strong>VORKASSE</strong> / Banküberweisung</li>","nicht lieferbar",,FO921V809C,Ford,"1 677 746",,,,,,,,,"International Parts Trading GmbH","Breslauer Straße 8 D-31655 Stadthagen ! keine Abholung / kein Umtausch vor Ort !",service.de@myparto.com,"+49 (0) 5721 / 9379010"
878,1,"2018-12-11 01:21:21",Abgasanlage,1,"2018-12-07 04:00:14",Ersatzteile,878,"2018-12-11 03:15:46","ORIGINAL Ford Rohrverbinder Doppelschelle Abgasanlage Ø 55 mm 1854892","17,95 EUR",,,,,,"<ul class=""fa-ul""> <li><i class=""fa-li fa fa-check""></i>Qualität rechnet sich!</li> <li><i class=""fa-li fa fa-check""></i>Hohe Verfügbarkeit</li> <li><i class=""fa-li fa fa-check""></i>Versandkostenfrei innerhalb DE ab 99 €</li> <li><i class=""fa-li fa fa-check""></i>1 Monat Widerrufsrecht</li>","<ul class=""fa-ul""> <li><i class=""fa-li fa fa-check""></i><strong>DHL Paket</strong></li> <li><i class=""fa-li fa fa-check""></i><strong>DPD Predict</strong></li> <li><i class=""fa-li fa fa-check""></i><strong>Spedition</strong>. Die entsprechenden Produkte sind mit dem Hinweis ""Sperrgut"" gekennzeichnet</li> <li><i class=""fa-li fa fa-check""></i>...natürlich inkl. <strong>Sendungsverfolgung</strong>!</li>","<ul class=""fa-ul""> <li><i class=""fa-li fa fa-check""></i><strong>PAYPAL</strong> (Lastschrift, Kreditkarte, Rechnung)</li> <li><i class=""fa-li fa fa-check""></i><strong>AMAZON PAY</strong> (mit Ihrem Amazon Konto)</li> <li><i class=""fa-li fa fa-check""></i><strong>DHL NACHNAHME</strong> (BAR bei Lieferung)</li> <li><i class=""fa-li fa fa-check""></i><strong>VORKASSE</strong> / Banküberweisung</li>","sofort lieferbar","1-2 Werktage",FO276D639M,Ford,"1 854 892",,,,,,,,,"International Parts Trading GmbH","Breslauer Straße 8 D-31655 Stadthagen ! keine Abholung / kein Umtausch vor Ort !",service.de@myparto.com,"+49 (0) 5721 / 9379010"