parts_x_parts_versandarten.id,parts_versandarten.id,parts_versandarten.ts,parts.id,parts.ts,parts.title,parts.price,parts.lieferumfang,parts.artikeleigenschaften_mengeneinheit,parts.hinweis_zur_altolrucknahme_wichtiger_hinweis_zur_altolverordnung,parts.filter_innenraumluft_artikeleigenschaften,parts.filter_innenraumluft_referenz_nummern_nur_zu_vergleichszwecken,parts.ihre_vorteile_auf_einen_blick,parts.unsere_versandpartner,parts.sichere_und_schnelle_zahlung,parts.delivery_time,parts.delivery_time_text,parts.art_nr,parts.hersteller,parts.teilenummer,parts.artikeleigenschaften_baugruppe,parts.artikeleigenschaften_verwendung,parts.zundkerze,parts.olfilter,parts.luftfilter,parts.filter_innenraumluft,parts.motorol,parts.filter_innenraumluft__artikeleigenschaften,parts.kontakt,parts.kontakt_address,parts.e_mail,parts.fax
1,1,"2018-12-11 01:23:28",1,"2018-12-11 03:01:07","ORIGINAL Ford Krümmerdichtung Ansaugkrümmer Cougar Mondeo I II III 2.5 3902545","22,95 EUR",,,,,,,,,"sofort lieferbar","1-2 Werktage",FO122U609C,Ford,"3 902 545, 3902545",,,,,,,,,"International Parts Trading GmbH","Breslauer Straße 8 D-31655 Stadthagen ! keine Abholung / kein Umtausch vor Ort !",service.de@myparto.com,"+49 (0) 5721 / 9379010"
7,1,"2018-12-11 01:23:28",2,"2018-12-11 03:01:07","ORIGINAL Peugeot Ladeluftschlauch 307 / 307 BREAK / 307 CC / 307 SW 6448.K1","18,95 EUR",,,,,,,,,"sofort lieferbar","1-2 Werktage",PE641P013K,PEUGEOT,6448.K1,,,,,,,,,"International Parts Trading GmbH","Breslauer Straße 8 D-31655 Stadthagen ! keine Abholung / kein Umtausch vor Ort !",service.de@myparto.com,"+49 (0) 5721 / 9379010"
10,1,"2018-12-11 01:23:28",3,"2018-12-11 03:02:32","ORIGINAL Renault Krümmerdichtung Ansaugkrümmerdichtung (1 Stück) 8200052311","6,00 EUR",,,,,,,,,"sofort lieferbar","1-2 Werktage",RE370A313M,RENAULT,"82 00 052 311",,,,,,,,,"International Parts Trading GmbH","Breslauer Straße 8 D-31655 Stadthagen ! keine Abholung / kein Umtausch vor Ort !",service.de@myparto.com,"+49 (0) 5721 / 9379010"
13,1,"2018-12-11 01:23:28",4,"2018-12-11 03:01:07","ORIGINAL Ford Krümmerdichtung Ansaugkrümmer 1.6EcoBoost 150/182 PS1685610","18,95 EUR",,,,,,,,,"sofort lieferbar","1-2 Werktage",FO421T129C,Ford,"1 685 610",,,,,,,,,"International Parts Trading GmbH","Breslauer Straße 8 D-31655 Stadthagen ! keine Abholung / kein Umtausch vor Ort !",service.de@myparto.com,"+49 (0) 5721 / 9379010"
16,1,"2018-12-11 01:23:28",5,"2018-12-11 03:01:07","ORIGINAL Ford Krümmerdichtung Abgaskrümmer Transit / Tourneo 2.5DI/TD 1056838","31,95 EUR",,,,,,,,,"kurzfristig lieferbar","2-3 Werktage",FO569Z409S,Ford,"1 056 838",,,,,,,,,"International Parts Trading GmbH","Breslauer Straße 8 D-31655 Stadthagen ! keine Abholung / kein Umtausch vor Ort !",service.de@myparto.com,"+49 (0) 5721 / 9379010"
19,1,"2018-12-11 01:23:28",6,"2018-12-11 03:01:07","ORIGINAL Ford Krümmerdichtung Ansaugkrümmer C-Max Fiesta Focus Fusion 1254375","8,95 EUR",,,,,,,,,"sofort lieferbar","1-2 Werktage",FO583Z319H,Ford,"1 254 375",,,,,,,,,"International Parts Trading GmbH","Breslauer Straße 8 D-31655 Stadthagen ! keine Abholung / kein Umtausch vor Ort !",service.de@myparto.com,"+49 (0) 5721 / 9379010"
22,1,"2018-12-11 01:23:28",7,"2018-12-11 03:01:07","ORIGINAL Ford Krümmerdichtung Abgaskrümmer Mondeo III 2.0TDCi 90-130 PS 1137860","38,95 EUR",,,,,,,,,"sofort lieferbar","1-2 Werktage",FO282D339H,Ford,"1 359 319",,,,,,,,,"International Parts Trading GmbH","Breslauer Straße 8 D-31655 Stadthagen ! keine Abholung / kein Umtausch vor Ort !",service.de@myparto.com,"+49 (0) 5721 / 9379010"
25,1,"2018-12-11 01:23:28",8,"2018-12-11 03:01:07","ORIGINAL Ford Krümmerdichtung Abgaskrümmer Mondeo III MK3 1.8 SCi 130 PS 1222704","13,95 EUR",,,,,,,,,"sofort lieferbar","1-2 Werktage",FO512Z509W,Ford,"1 222 704",,,,,,,,,"International Parts Trading GmbH","Breslauer Straße 8 D-31655 Stadthagen ! keine Abholung / kein Umtausch vor Ort !",service.de@myparto.com,"+49 (0) 5721 / 9379010"
28,1,"2018-12-11 01:23:28",9,"2018-12-11 03:01:07","ORIGINAL Citroen Peugeot Krümmerdichtung Abgaskrümmer 1.4 1.6 0349.L3","6,95 EUR",,,,,,,,,"sofort lieferbar","1-2 Werktage",PE729R313C,PEUGEOT,0349.L3,,,,,,,,,"International Parts Trading GmbH","Breslauer Straße 8 D-31655 Stadthagen ! keine Abholung / kein Umtausch vor Ort !",service.de@myparto.com,"+49 (0) 5721 / 9379010"
31,1,"2018-12-11 01:23:28",10,"2018-12-11 03:01:07","ORIGINAL Ford Krümmerdichtung Abgaskrümmer C-Max Fiesta Focus Galaxy 136702","47,95 EUR",,,,,,,,,"sofort lieferbar","1-2 Werktage",FO921V509C,Ford,"1 136 702",,,,,,,,,"International Parts Trading GmbH","Breslauer Straße 8 D-31655 Stadthagen ! keine Abholung / kein Umtausch vor Ort !",service.de@myparto.com,"+49 (0) 5721 / 9379010"
34,1,"2018-12-11 01:23:28",11,"2018-12-11 03:01:07","ORIGINAL Ford Krümmerdichtung Abgaskrümmer Capri Consul Escort Granada 6909666","7,95 EUR",,,,,,,,,"kurzfristig lieferbar","2-3 Werktage",FO524Z609C,Ford,"6 909 666",,,,,,,,,"International Parts Trading GmbH","Breslauer Straße 8 D-31655 Stadthagen ! keine Abholung / kein Umtausch vor Ort !",service.de@myparto.com,"+49 (0) 5721 / 9379010"
37,1,"2018-12-11 01:23:28",12,"2018-12-11 03:01:07","ORIGINAL Ford Krümmerdichtung Ansaugkrümmer Fiesta IV Focus Puma 1.4 1.6 1072063","10,95 EUR",,,,,,,,,"kurzfristig lieferbar","2-3 Werktage",FO477T839M,Ford,"1 072 063",,,,,,,,,"International Parts Trading GmbH","Breslauer Straße 8 D-31655 Stadthagen ! keine Abholung / kein Umtausch vor Ort !",service.de@myparto.com,"+49 (0) 5721 / 9379010"
40,1,"2018-12-11 01:23:28",13,"2018-12-11 03:09:34","ORIGINAL GM Opel Nebelscheinwerfer Nachrüst-Satz 95092171 für MOKKA / MOKKA X","156,95 EUR",,,,,,,,,"sofort lieferbar","1-2 Werktage",OP075Y014M,Opel,95092171,,,,,,,,,"International Parts Trading GmbH","Breslauer Straße 8 D-31655 Stadthagen ! keine Abholung / kein Umtausch vor Ort !",service.de@myparto.com,"+49 (0) 5721 / 9379010"
43,1,"2018-12-11 01:23:28",14,"2018-12-11 03:09:34","ORIGINAL Fiat Nebelscheinwerfer 500L DOBLO DUCATO PUNTO LINKS / RECHTS 51858824","43,95 EUR",,,,,,,,,"sofort lieferbar","1-2 Werktage",FI400T014E,Fiat,51858824,,,,,,,,,"International Parts Trading GmbH","Breslauer Straße 8 D-31655 Stadthagen ! keine Abholung / kein Umtausch vor Ort !",service.de@myparto.com,"+49 (0) 5721 / 9379010"
46,1,"2018-12-11 01:23:28",15,"2018-12-11 03:09:34","ORIGINAL Alfa Romeo Heckleuchte Rückleuchte Rücklicht GT (937_) links 60681559","125,85 EUR",,,,,,,,,"sofort lieferbar","1-2 Werktage",AL500Z014E,"Alfa Romeo",60681559,,,,,,,,,"International Parts Trading GmbH","Breslauer Straße 8 D-31655 Stadthagen ! keine Abholung / kein Umtausch vor Ort !",service.de@myparto.com,"+49 (0) 5721 / 9379010"
49,1,"2018-12-11 01:23:28",16,"2018-12-11 03:09:34","ORIGINAL Peugeot Heckblende Heckleuchte UNTEN 1610056080 für 308 II Schrägheck","123,95 EUR",,,,,,,,,"sofort lieferbar","1-2 Werktage",PE670P001M,PEUGEOT,"16 100 560 80",,,,,,,,,"International Parts Trading GmbH","Breslauer Straße 8 D-31655 Stadthagen ! keine Abholung / kein Umtausch vor Ort !",service.de@myparto.com,"+49 (0) 5721 / 9379010"
52,1,"2018-12-11 01:23:28",17,"2018-12-11 03:09:34","ORIGINAL Ford Glühlampe Halogenlampe H6W 12V 6W Bax9s (1 Stück) 1715400",,,,,,,,,,"sofort lieferbar","1-2 Werktage",FO655P829X,Ford,"1 715 400",,,,,,,,,"International Parts Trading GmbH","Breslauer Straße 8 D-31655 Stadthagen ! keine Abholung / kein Umtausch vor Ort !",service.de@myparto.com,"+49 (0) 5721 / 9379010"
55,1,"2018-12-11 01:23:28",18,"2018-12-11 03:09:34","ORIGINAL PSA Nebelschlussleuchte Nebelrücklicht C-CROSSER 4007 links 6350.EN","70,95 EUR",,,,,,,,,"sofort lieferbar","1-2 Werktage",PE411T014W,PEUGEOT,6350.EN,,,,,,,,,"International Parts Trading GmbH","Breslauer Straße 8 D-31655 Stadthagen ! keine Abholung / kein Umtausch vor Ort !",service.de@myparto.com,"+49 (0) 5721 / 9379010"
58,1,"2018-12-11 01:23:28",19,"2018-12-11 03:09:34","ORIGINAL Ford Heckleuchte Rücklicht FOCUS III MK3 Schrägheck rechts 1825319","204,95 EUR",,,,,,,,,"sofort lieferbar","1-2 Werktage",FO275D239M,Ford,"1 825 319",,,,,,,,,"International Parts Trading GmbH","Breslauer Straße 8 D-31655 Stadthagen ! keine Abholung / kein Umtausch vor Ort !",service.de@myparto.com,"+49 (0) 5721 / 9379010"
61,1,"2018-12-11 01:23:28",20,"2018-12-11 03:09:34","ORIGINAL Renault Heckleuchte Rückleuchte Rücklicht Master III links 265550023R","80,95 EUR",,,,,,,,,"sofort lieferbar","1-2 Werktage",RE011Y014W,RENAULT,"26 55 500 23R",,,,,,,,,"International Parts Trading GmbH","Breslauer Straße 8 D-31655 Stadthagen ! keine Abholung / kein Umtausch vor Ort !",service.de@myparto.com,"+49 (0) 5721 / 9379010"
64,1,"2018-12-11 01:23:28",21,"2018-12-11 03:09:34","ORIGINAL Peugeot Heckleuchte Rückleuchte Rücklicht 206+ links 6350.GV","51,95 EUR",,,,,,,,,"sofort lieferbar","1-2 Werktage",PE330A014B,PEUGEOT,6350.GV,,,,,,,,,"International Parts Trading GmbH","Breslauer Straße 8 D-31655 Stadthagen ! keine Abholung / kein Umtausch vor Ort !",service.de@myparto.com,"+49 (0) 5721 / 9379010"
67,1,"2018-12-11 01:23:28",22,"2018-12-11 03:09:34","ORIGINAL Renault Heckleuchte Rückleuchte Rücklicht Grand Scenic III rechts","85,95 EUR",,,,,,,,,"sofort lieferbar","1-2 Werktage",RE311A014W,RENAULT,"26 55 000 14R",,,,,,,,,"International Parts Trading GmbH","Breslauer Straße 8 D-31655 Stadthagen ! keine Abholung / kein Umtausch vor Ort !",service.de@myparto.com,"+49 (0) 5721 / 9379010"
70,1,"2018-12-11 01:23:28",23,"2018-12-11 03:11:36","ORIGINAL Ford Heckleuchte Rücklicht FOCUS III MK3 Turnier innen links 1868299","40,95 EUR",,,,,,,,,"sofort lieferbar","1-2 Werktage",FO518Z739W,Ford,"1 868 299",,,,,,,,,"International Parts Trading GmbH","Breslauer Straße 8 D-31655 Stadthagen ! keine Abholung / kein Umtausch vor Ort !",service.de@myparto.com,"+49 (0) 5721 / 9379010"
73,1,"2018-12-11 01:23:28",24,"2018-12-11 03:09:34","ORIGINAL Ford Heckleuchte Rückleuchte Rücklicht C-MAX II innen rechts 1861698","93,95 EUR",,,,,,,,,"sofort lieferbar","1-2 Werktage",FO791R939L,Ford,"1 861 698",,,,,,,,,"International Parts Trading GmbH","Breslauer Straße 8 D-31655 Stadthagen ! keine Abholung / kein Umtausch vor Ort !",service.de@myparto.com,"+49 (0) 5721 / 9379010"
76,1,"2018-12-11 01:23:28",25,"2018-12-11 03:28:30","ORIGINAL Opel Bremsen Kit Bremsscheiben + Beläge ASTRA K J60/J79 vorne 95526570",,,,,,,,,,"sofort lieferbar","1-2 Werktage",OP615P513W,Opel,95526570,,,,,,,,,"International Parts Trading GmbH","Breslauer Straße 8 D-31655 Stadthagen ! keine Abholung / kein Umtausch vor Ort !",service.de@myparto.com,"+49 (0) 5721 / 9379010"
79,1,"2018-12-11 01:23:28",26,"2018-12-11 01:33:25","ORIGINAL Ford Bremsbeläge + Wako Mondeo I II Scorpio I II Sierra vorne 1022078","88,95 EUR",,,,,,,,,"kurzfristig lieferbar","2-3 Werktage",FO232D809B,Ford,"1 022 078, 1022078",,,,,,,,,"International Parts Trading GmbH","Breslauer Straße 8 D-31655 Stadthagen ! keine Abholung / kein Umtausch vor Ort !",service.de@myparto.com,"+49 (0) 5721 / 9379010"
82,1,"2018-12-11 01:23:28",27,"2018-12-11 01:36:45","ORIGINAL Ford Bremsen Kit Bremsscheiben + Beläge MONDEO IV MK4 vorne + hinten","214,95 EUR",,,,,,,,,"sofort lieferbar","1-2 Werktage",PP226D582C,Ford,"1 500 159, 1 916 756, 2 111 254, 1 917 249",,,,,,,,"<ul><li>Baugruppe: Bremsanlage</li><li>Mengeneinheit: Stück</li><li>Bremsscheibenart: belüftet</li><li>Einbauseite: Vorderachse</li><li>Durchmesser [mm]: 300</li><li>Lochkreis-Ø [mm]: 108</li><li>Lochanzahl: 5</li>","International Parts Trading GmbH","Breslauer Straße 8 D-31655 Stadthagen ! keine Abholung / kein Umtausch vor Ort !",service.de@myparto.com,"+49 (0) 5721 / 9379010"
85,1,"2018-12-11 01:23:28",28,"2018-12-11 01:33:25","ORIGINAL Ford Bremsbackensatz FIESTA VI MK6 KA+ hinten 1894327","101,95 EUR",,,,,,,,,"kurzfristig lieferbar","2-3 Werktage",FO393A249L,Ford,"1 894 327",,,,,,,,,"International Parts Trading GmbH","Breslauer Straße 8 D-31655 Stadthagen ! keine Abholung / kein Umtausch vor Ort !",service.de@myparto.com,"+49 (0) 5721 / 9379010"
88,1,"2018-12-11 01:23:28",29,"2018-12-11 01:33:25","ORIGINAL Ford Unterdruckpumpe Vakuumpumpe 1741667 für TRANSIT / TORUNEO","343,95 EUR",,,,,,,,,"kurzfristig lieferbar","2-3 Werktage",FO039Y149B,Ford,"1 741 667",,,,,,,,,"International Parts Trading GmbH","Breslauer Straße 8 D-31655 Stadthagen ! keine Abholung / kein Umtausch vor Ort !",service.de@myparto.com,"+49 (0) 5721 / 9379010"
91,1,"2018-12-11 01:23:28",30,"2018-12-11 01:33:25","2x ORIGINAL Ford Halter Halterung Bremssattel HINTEN 1466081 GALAXY S-MAX (WA6)","137,95 EUR",,,,,,,,,"kurzfristig lieferbar","2-3 Werktage",FO947V039K,Ford,"1 466 081",,,,,,,,,"International Parts Trading GmbH","Breslauer Straße 8 D-31655 Stadthagen ! keine Abholung / kein Umtausch vor Ort !",service.de@myparto.com,"+49 (0) 5721 / 9379010"
94,1,"2018-12-11 01:23:28",31,"2018-12-11 01:33:25","ORIGINAL Renault Bremsscheiben Satz LOGAN I Kombi TWINGO I II vorne 7701208252","59,95 EUR",,,,,,,,,"sofort lieferbar","1-2 Werktage",RE903V513E,RENAULT,"77 01 208 252",,,,,,,,,"International Parts Trading GmbH","Breslauer Straße 8 D-31655 Stadthagen ! keine Abholung / kein Umtausch vor Ort !",service.de@myparto.com,"+49 (0) 5721 / 9379010"
97,1,"2018-12-11 01:23:28",32,"2018-12-11 01:33:25","ORIGINAL Citroen Peugeot Hauptbremszylinder C4 Coupe C4 I 307 4601.L0","107,95 EUR",,,,,,,,,"sofort lieferbar","1-2 Werktage",PE840N513K,PEUGEOT,4601.L0,,,,,,,,,"International Parts Trading GmbH","Breslauer Straße 8 D-31655 Stadthagen ! keine Abholung / kein Umtausch vor Ort !",service.de@myparto.com,"+49 (0) 5721 / 9379010"
100,1,"2018-12-11 01:23:28",33,"2018-12-11 01:33:25","ORIGINAL Ford Bremsen Kit Bremsscheiben + Beläge Galaxy (WGR) ab 04.2000 hinten","85,05 EUR",,,,,,,,,"sofort lieferbar","1-2 Werktage",PP643P082K,Ford,"1 526 694, 1 343 513",,,,,,,,"<ul><li>Baugruppe: Bremsanlage</li><li>Mengeneinheit: Stück</li><li>WVA-Nummer: 23554</li><li>Ausstattungsvariante: Motorcraft</li><li>Verschleißwarnkontakt: inkl. Verschleißwarnkontakt</li>","International Parts Trading GmbH","Breslauer Straße 8 D-31655 Stadthagen ! keine Abholung / kein Umtausch vor Ort !",service.de@myparto.com,"+49 (0) 5721 / 9379010"
103,1,"2018-12-11 01:23:28",34,"2018-12-11 01:33:25","ORIGINAL Audi Bremsscheiben Satz A4 A5 A6 A7 Q5 vorne Vorderachse 4G0615301AE","285,95 EUR",,,,,,,,,"sofort lieferbar","1-2 Werktage",PP808N682E,Audi,"4G0 615 301 AE",,,,,,,,"<ul><li>Baugruppe: Bremsanlage</li><li>Mengeneinheit: Stück</li><li>Bremsscheibenart: belüftet</li><li>Einbauseite: Vorderachse</li>","International Parts Trading GmbH","Breslauer Straße 8 D-31655 Stadthagen ! keine Abholung / kein Umtausch vor Ort !",service.de@myparto.com,"+49 (0) 5721 / 9379010"
106,1,"2018-12-11 01:23:28",35,"2018-12-11 01:33:25","ORIGINAL Ford Bremsschlauch GRAND C-MAX / C-MAX II FOCUS III hinten 1681131","24,95 EUR",,,,,,,,,"kurzfristig lieferbar","2-3 Werktage",FO009Y939E,Ford,"1 681 131",,,,,,,,,"International Parts Trading GmbH","Breslauer Straße 8 D-31655 Stadthagen ! keine Abholung / kein Umtausch vor Ort !",service.de@myparto.com,"+49 (0) 5721 / 9379010"
109,1,"2018-12-11 01:23:28",36,"2018-12-11 01:33:25","ORIGINAL Ford Bremsschlauch Bremsleitung FOCUS I MK1 ab 10.2000 hinten 1148270","62,95 EUR",,,,,,,,,"kurzfristig lieferbar","2-3 Werktage",FO163U219S,Ford,"1 148 270",,,,,,,,,"International Parts Trading GmbH","Breslauer Straße 8 D-31655 Stadthagen ! keine Abholung / kein Umtausch vor Ort !",service.de@myparto.com,"+49 (0) 5721 / 9379010"
112,1,"2018-12-11 01:23:28",37,"2018-12-11 01:57:48","ORIGINAL Renault Motorlager Motorhalter LAGUNA III 2.0 dCi rechts 112105736R","71,05 EUR",,,,,,,,,"sofort lieferbar","1-2 Werktage",RE093Y013L,RENAULT,"11 21 057 36R",,,,,,,,,"International Parts Trading GmbH","Breslauer Straße 8 D-31655 Stadthagen ! keine Abholung / kein Umtausch vor Ort !",service.de@myparto.com,"+49 (0) 5721 / 9379010"
115,1,"2018-12-11 01:23:28",38,"2018-12-11 01:57:19","ORIGINAL Citroen Peugeot Motorlager C4 I II XSARA 307 308 VORNE RECHTS 1839.H7","89,95 EUR",,,,,,,,,"sofort lieferbar","1-2 Werktage",PE144U013K,PEUGEOT,1839.H7,,,,,,,,,"International Parts Trading GmbH","Breslauer Straße 8 D-31655 Stadthagen ! keine Abholung / kein Umtausch vor Ort !",service.de@myparto.com,"+49 (0) 5721 / 9379010"
118,1,"2018-12-11 01:23:28",39,"2018-12-11 01:57:19","ORIGINAL Renault Motorlager Motorhalter Clio III Modus rechts 8200140431","51,75 EUR",,,,,,,,,"sofort lieferbar","1-2 Werktage",RE622P013C,RENAULT,"82 00 140 431",,,,,,,,,"International Parts Trading GmbH","Breslauer Straße 8 D-31655 Stadthagen ! keine Abholung / kein Umtausch vor Ort !",service.de@myparto.com,"+49 (0) 5721 / 9379010"
121,1,"2018-12-11 01:23:28",40,"2018-12-11 01:57:19","ORIGINAL Ford Motorlager TRANSIT 04.2006-08.2014 vorne rechts 1384138","314,95 EUR",,,,,,,,,"kurzfristig lieferbar","2-3 Werktage",FO505Z519E,Ford,"1 384 138",,,,,,,,,"International Parts Trading GmbH","Breslauer Straße 8 D-31655 Stadthagen ! keine Abholung / kein Umtausch vor Ort !",service.de@myparto.com,"+49 (0) 5721 / 9379010"
124,1,"2018-12-11 01:23:28",41,"2018-12-11 01:57:19","ORIGINAL Citroen Peugeot Kupplungsgestänge Berlingo 306 Partner 2128.22","5,95 EUR",,,,,,,,,"sofort lieferbar","1-2 Werktage",PE200D103E,PEUGEOT,2128.22,,,,,,,,,"International Parts Trading GmbH","Breslauer Straße 8 D-31655 Stadthagen ! keine Abholung / kein Umtausch vor Ort !",service.de@myparto.com,"+49 (0) 5721 / 9379010"
127,1,"2018-12-11 01:23:28",42,"2018-12-11 01:57:48","ORIGINAL Citroen Kupplungssatz Kupplungskit C4 Coupe 2.0HDi 136 PS 2052.N5","244,95 EUR",,,,,,,,,"sofort lieferbar","1-2 Werktage",CI100U113E,Citroen,2052.N5,,,,,,,,,"International Parts Trading GmbH","Breslauer Straße 8 D-31655 Stadthagen ! keine Abholung / kein Umtausch vor Ort !",service.de@myparto.com,"+49 (0) 5721 / 9379010"
130,1,"2018-12-11 01:23:28",43,"2018-12-11 01:57:19","ORIGINAL Citroen Peugeot Kupplungssatz Kupplungskit C4 C5 C8 206 307 406 2052.K1","211,95 EUR",,,,,,,,,"sofort lieferbar","1-2 Werktage",PE400T113E,PEUGEOT,2052.K1,,,,,,,,,"International Parts Trading GmbH","Breslauer Straße 8 D-31655 Stadthagen ! keine Abholung / kein Umtausch vor Ort !",service.de@myparto.com,"+49 (0) 5721 / 9379010"
133,1,"2018-12-11 01:23:28",44,"2018-12-11 01:57:19","ORIGINAL Peugeot Kupplungsseil Seilzug Kupplung 306 1.1 1.4 1.6 2150.H1","45,95 EUR",,,,,,,,,"sofort lieferbar","1-2 Werktage",PE301A103E,PEUGEOT,2150.H1,,,,,,,,,"International Parts Trading GmbH","Breslauer Straße 8 D-31655 Stadthagen ! keine Abholung / kein Umtausch vor Ort !",service.de@myparto.com,"+49 (0) 5721 / 9379010"
136,1,"2018-12-11 01:23:28",45,"2018-12-11 01:57:48","ORIGINAL Peugeot Kupplungsseil Seilzug Kupplung 206 1.1 1.4 1.6 2150.X3","29,95 EUR",,,,,,,,,"sofort lieferbar","1-2 Werktage",PE111U103W,PEUGEOT,2150.X3,,,,,,,,,"International Parts Trading GmbH","Breslauer Straße 8 D-31655 Stadthagen ! keine Abholung / kein Umtausch vor Ort !",service.de@myparto.com,"+49 (0) 5721 / 9379010"
139,1,"2018-12-11 01:23:28",46,"2018-12-11 01:57:19","ORIGINAL BMW Kupplungssatz 1er E81 E87 130i Z4 E85 E86 E89 3.0i 21207587369","190,00 EUR",,,,,,,,,"sofort lieferbar","1-2 Werktage",BM300A113E,BMW,"21 20 7 587 369",,,,,,,,,"International Parts Trading GmbH","Breslauer Straße 8 D-31655 Stadthagen ! keine Abholung / kein Umtausch vor Ort !",service.de@myparto.com,"+49 (0) 5721 / 9379010"
142,1,"2018-12-11 01:23:28",47,"2018-12-11 01:57:19","ORIGINAL Citroen Peugeot Schaltstange Schalthebel Schaltgetriebe OBEN 2452.76","23,95 EUR",,,,,,,,,"sofort lieferbar","1-2 Werktage",PE756R013X,PEUGEOT,2452.76,,,,,,,,,"International Parts Trading GmbH","Breslauer Straße 8 D-31655 Stadthagen ! keine Abholung / kein Umtausch vor Ort !",service.de@myparto.com,"+49 (0) 5721 / 9379010"
145,1,"2018-12-11 01:23:28",48,"2018-12-11 01:57:19","ORIGINAL Citroen Schwungrad Schwungscheibe Berlingo C5 I Jumper Xsara 0532.H8","194,95 EUR",,,,,,,,,"sofort lieferbar","1-2 Werktage",CI465T013S,Citroen,0532.H8,,,,,,,,,"International Parts Trading GmbH","Breslauer Straße 8 D-31655 Stadthagen ! keine Abholung / kein Umtausch vor Ort !",service.de@myparto.com,"+49 (0) 5721 / 9379010"
148,1,"2018-12-11 01:23:28",49,"2018-12-11 02:01:02","ORIGINAL Renault Bremslichtschalter CLIO III ESPACE IV KANGOO LAGUNA 8200168239","13,95 EUR",,,,,,,,,"sofort lieferbar","1-2 Werktage",RE221D214C,RENAULT,"82 00 168 239",,,,,,,,,"International Parts Trading GmbH","Breslauer Straße 8 D-31655 Stadthagen ! keine Abholung / kein Umtausch vor Ort !",service.de@myparto.com,"+49 (0) 5721 / 9379010"
151,1,"2018-12-11 01:23:28",50,"2018-12-11 02:01:02","ORIGINAL Ford Bremslichtschalter Bremslicht GALAXY (WGR) 1.9TDI 2.8 V6 1044903","48,95 EUR",,,,,,,,,"kurzfristig lieferbar","2-3 Werktage",FO969V629S,Ford,"1 044 903",,,,,,,,,"International Parts Trading GmbH","Breslauer Straße 8 D-31655 Stadthagen ! keine Abholung / kein Umtausch vor Ort !",service.de@myparto.com,"+49 (0) 5721 / 9379010"
154,1,"2018-12-11 01:23:28",51,"2018-12-11 02:01:02","ORIGINAL Ford Lichtschalter Hauptlichtschalter GALAXY (WGR) ab 04.2000 1121561","104,95 EUR",,,,,,,,,"kurzfristig lieferbar","2-3 Werktage",FO266D119S,Ford,"1 121 561",,,,,,,,,"International Parts Trading GmbH","Breslauer Straße 8 D-31655 Stadthagen ! keine Abholung / kein Umtausch vor Ort !",service.de@myparto.com,"+49 (0) 5721 / 9379010"
157,1,"2018-12-11 01:23:28",52,"2018-12-11 02:01:02","ORIGINAL Ford Bremslichtschalter Schalter Bremslicht MAVERICK 4069860","37,95 EUR",,,,,,,,,"kurzfristig lieferbar","2-3 Werktage",FO725R329C,Ford,"4 069 860",,,,,,,,,"International Parts Trading GmbH","Breslauer Straße 8 D-31655 Stadthagen ! keine Abholung / kein Umtausch vor Ort !",service.de@myparto.com,"+49 (0) 5721 / 9379010"
160,1,"2018-12-11 01:23:28",53,"2018-12-11 02:01:02","ORIGINAL Peugeot Lenkstockschalter Lichtschalter Blinkerschalter 207 307 6242.Z9","55,95 EUR",,,,,,,,,"sofort lieferbar","1-2 Werktage",PE310A214W,PEUGEOT,6242.Z9,,,,,,,,,"International Parts Trading GmbH","Breslauer Straße 8 D-31655 Stadthagen ! keine Abholung / kein Umtausch vor Ort !",service.de@myparto.com,"+49 (0) 5721 / 9379010"
163,1,"2018-12-11 01:23:28",54,"2018-12-11 02:01:02","ORIGINAL Ford Lenkstockschalter MONDEO IV GALAXY S-MAX (WA6) 1835508","71,95 EUR",,,,,,,,,"kurzfristig lieferbar","2-3 Werktage",FO318A439W,Ford,"1 835 508",,,,,,,,,"International Parts Trading GmbH","Breslauer Straße 8 D-31655 Stadthagen ! keine Abholung / kein Umtausch vor Ort !",service.de@myparto.com,"+49 (0) 5721 / 9379010"
166,1,"2018-12-11 01:23:28",55,"2018-12-11 02:01:02","ORIGINAL Citroen Lenkstockschalter Berlingo C3 C5 C8 Xsara Picasso 6242.Z9","55,95 EUR",,,,,,,,,"sofort lieferbar","1-2 Werktage",CI310A214W,Citroen,6242.Z9,,,,,,,,,"International Parts Trading GmbH","Breslauer Straße 8 D-31655 Stadthagen ! keine Abholung / kein Umtausch vor Ort !",service.de@myparto.com,"+49 (0) 5721 / 9379010"
169,1,"2018-12-11 01:23:28",56,"2018-12-11 02:01:42","ORIGINAL Peugeot Sicherungskasten Zentralelektronik Steuergerät 207 307 6500.FH","160,95 EUR",,,,,,,,,"sofort lieferbar","1-2 Werktage",PE104U414E,PEUGEOT,6500.FH,,,,,,,,,"International Parts Trading GmbH","Breslauer Straße 8 D-31655 Stadthagen ! keine Abholung / kein Umtausch vor Ort !",service.de@myparto.com,"+49 (0) 5721 / 9379010"
172,1,"2018-12-11 01:23:28",57,"2018-12-11 02:01:02","ORIGINAL Ford Rückfahrlichtschalter ESCORT V VI VII FIESTA III IV 1021795","87,95 EUR",,,,,,,,,"kurzfristig lieferbar","2-3 Werktage",FO674P909M,Ford,"1 021 795",,,,,,,,,"International Parts Trading GmbH","Breslauer Straße 8 D-31655 Stadthagen ! keine Abholung / kein Umtausch vor Ort !",service.de@myparto.com,"+49 (0) 5721 / 9379010"
175,1,"2018-12-11 01:23:28",58,"2018-12-11 02:01:02","ORIGINAL Peugeot Sicherungskasten Zentralelektronik Steuergerät 6580.P8","433,95 EUR",,,,,,,,,"sofort lieferbar","1-2 Werktage",PE304A414E,PEUGEOT,6580.P8,,,,,,,,,"International Parts Trading GmbH","Breslauer Straße 8 D-31655 Stadthagen ! keine Abholung / kein Umtausch vor Ort !",service.de@myparto.com,"+49 (0) 5721 / 9379010"