furniture_image.id,furniture_image.ts,furniture.id,furniture.ts,furniture.title,furniture.regular_price,furniture.special_price,furniture.save,furniture.price,furniture.description,furniture.features,furniture.phone,furniture.hour
209,"2018-03-05 04:21:23",68,"2018-03-05 04:21:23","ALTA Chair (Black)",$99.99,$49.99,"$50 !",,"Give your space a new look with the ALTA chair.",,1-888-696-5975,"Monday to Friday – 6:30am to 4pm PST Saturday and Sunday – 7:00 am to 3pm PST"
210,"2018-03-05 04:21:23",68,"2018-03-05 04:21:23","ALTA Chair (Black)",$99.99,$49.99,"$50 !",,"Give your space a new look with the ALTA chair.",,1-888-696-5975,"Monday to Friday – 6:30am to 4pm PST Saturday and Sunday – 7:00 am to 3pm PST"
211,"2018-03-05 04:21:23",68,"2018-03-05 04:21:23","ALTA Chair (Black)",$99.99,$49.99,"$50 !",,"Give your space a new look with the ALTA chair.",,1-888-696-5975,"Monday to Friday – 6:30am to 4pm PST Saturday and Sunday – 7:00 am to 3pm PST"
212,"2018-03-05 04:21:23",68,"2018-03-05 04:21:23","ALTA Chair (Black)",$99.99,$49.99,"$50 !",,"Give your space a new look with the ALTA chair.",,1-888-696-5975,"Monday to Friday – 6:30am to 4pm PST Saturday and Sunday – 7:00 am to 3pm PST"
213,"2018-03-05 04:21:31",69,"2018-03-05 04:21:31","ALTA Chair (White)",$99.99,$49.99,"$50 !",,"Faux leather chair with chrome legs",,1-888-696-5975,"Monday to Friday – 6:30am to 4pm PST Saturday and Sunday – 7:00 am to 3pm PST"
214,"2018-03-05 04:21:31",69,"2018-03-05 04:21:31","ALTA Chair (White)",$99.99,$49.99,"$50 !",,"Faux leather chair with chrome legs",,1-888-696-5975,"Monday to Friday – 6:30am to 4pm PST Saturday and Sunday – 7:00 am to 3pm PST"
215,"2018-03-05 04:21:31",69,"2018-03-05 04:21:31","ALTA Chair (White)",$99.99,$49.99,"$50 !",,"Faux leather chair with chrome legs",,1-888-696-5975,"Monday to Friday – 6:30am to 4pm PST Saturday and Sunday – 7:00 am to 3pm PST"
216,"2018-03-05 04:21:31",69,"2018-03-05 04:21:31","ALTA Chair (White)",$99.99,$49.99,"$50 !",,"Faux leather chair with chrome legs",,1-888-696-5975,"Monday to Friday – 6:30am to 4pm PST Saturday and Sunday – 7:00 am to 3pm PST"
217,"2018-03-05 04:21:42",70,"2018-03-05 04:21:42","YSTAD Accent Chair (Blue)",,,,$159.99,,,1-888-696-5975,"Monday to Friday – 6:30am to 4pm PST Saturday and Sunday – 7:00 am to 3pm PST"
218,"2018-03-05 04:21:42",70,"2018-03-05 04:21:42","YSTAD Accent Chair (Blue)",,,,$159.99,,,1-888-696-5975,"Monday to Friday – 6:30am to 4pm PST Saturday and Sunday – 7:00 am to 3pm PST"
219,"2018-03-05 04:21:42",70,"2018-03-05 04:21:42","YSTAD Accent Chair (Blue)",,,,$159.99,,,1-888-696-5975,"Monday to Friday – 6:30am to 4pm PST Saturday and Sunday – 7:00 am to 3pm PST"
220,"2018-03-05 04:21:42",70,"2018-03-05 04:21:42","YSTAD Accent Chair (Blue)",,,,$159.99,,,1-888-696-5975,"Monday to Friday – 6:30am to 4pm PST Saturday and Sunday – 7:00 am to 3pm PST"
221,"2018-03-05 04:21:53",71,"2018-03-05 04:21:53","YSTAD Accent Chair (Grey)",,,,$159.99,,,1-888-696-5975,"Monday to Friday – 6:30am to 4pm PST Saturday and Sunday – 7:00 am to 3pm PST"
222,"2018-03-05 04:21:53",71,"2018-03-05 04:21:53","YSTAD Accent Chair (Grey)",,,,$159.99,,,1-888-696-5975,"Monday to Friday – 6:30am to 4pm PST Saturday and Sunday – 7:00 am to 3pm PST"
223,"2018-03-05 04:21:53",71,"2018-03-05 04:21:53","YSTAD Accent Chair (Grey)",,,,$159.99,,,1-888-696-5975,"Monday to Friday – 6:30am to 4pm PST Saturday and Sunday – 7:00 am to 3pm PST"
224,"2018-03-05 04:21:53",71,"2018-03-05 04:21:53","YSTAD Accent Chair (Grey)",,,,$159.99,,,1-888-696-5975,"Monday to Friday – 6:30am to 4pm PST Saturday and Sunday – 7:00 am to 3pm PST"
225,"2018-03-05 04:22:00",72,"2018-03-05 04:22:00","EJERSLEV Footstool (Grey)",,,,$79.99,"Comfortable mid-century armchair in dark grey polyester fabric and solid oak legs.",,1-888-696-5975,"Monday to Friday – 6:30am to 4pm PST Saturday and Sunday – 7:00 am to 3pm PST"
226,"2018-03-05 04:22:00",72,"2018-03-05 04:22:00","EJERSLEV Footstool (Grey)",,,,$79.99,"Comfortable mid-century armchair in dark grey polyester fabric and solid oak legs.",,1-888-696-5975,"Monday to Friday – 6:30am to 4pm PST Saturday and Sunday – 7:00 am to 3pm PST"
227,"2018-03-05 04:22:00",72,"2018-03-05 04:22:00","EJERSLEV Footstool (Grey)",,,,$79.99,"Comfortable mid-century armchair in dark grey polyester fabric and solid oak legs.",,1-888-696-5975,"Monday to Friday – 6:30am to 4pm PST Saturday and Sunday – 7:00 am to 3pm PST"
228,"2018-03-05 04:22:08",73,"2018-03-05 04:22:08","EJERSLEV Armchair (Grey)",,,,$299.99,"Comfortable mid-century armchair in dark grey polyester fabric and solid oak legs.",,1-888-696-5975,"Monday to Friday – 6:30am to 4pm PST Saturday and Sunday – 7:00 am to 3pm PST"
229,"2018-03-05 04:22:08",73,"2018-03-05 04:22:08","EJERSLEV Armchair (Grey)",,,,$299.99,"Comfortable mid-century armchair in dark grey polyester fabric and solid oak legs.",,1-888-696-5975,"Monday to Friday – 6:30am to 4pm PST Saturday and Sunday – 7:00 am to 3pm PST"
230,"2018-03-05 04:22:08",73,"2018-03-05 04:22:08","EJERSLEV Armchair (Grey)",,,,$299.99,"Comfortable mid-century armchair in dark grey polyester fabric and solid oak legs.",,1-888-696-5975,"Monday to Friday – 6:30am to 4pm PST Saturday and Sunday – 7:00 am to 3pm PST"
231,"2018-03-05 04:22:08",73,"2018-03-05 04:22:08","EJERSLEV Armchair (Grey)",,,,$299.99,"Comfortable mid-century armchair in dark grey polyester fabric and solid oak legs.",,1-888-696-5975,"Monday to Friday – 6:30am to 4pm PST Saturday and Sunday – 7:00 am to 3pm PST"
232,"2018-03-05 04:22:08",73,"2018-03-05 04:22:08","EJERSLEV Armchair (Grey)",,,,$299.99,"Comfortable mid-century armchair in dark grey polyester fabric and solid oak legs.",,1-888-696-5975,"Monday to Friday – 6:30am to 4pm PST Saturday and Sunday – 7:00 am to 3pm PST"
233,"2018-03-05 04:22:08",73,"2018-03-05 04:22:08","EJERSLEV Armchair (Grey)",,,,$299.99,"Comfortable mid-century armchair in dark grey polyester fabric and solid oak legs.",,1-888-696-5975,"Monday to Friday – 6:30am to 4pm PST Saturday and Sunday – 7:00 am to 3pm PST"
234,"2018-03-05 04:22:08",73,"2018-03-05 04:22:08","EJERSLEV Armchair (Grey)",,,,$299.99,"Comfortable mid-century armchair in dark grey polyester fabric and solid oak legs.",,1-888-696-5975,"Monday to Friday – 6:30am to 4pm PST Saturday and Sunday – 7:00 am to 3pm PST"
235,"2018-03-05 04:22:14",74,"2018-03-05 04:22:14","BJORKE Armchair (Grey)",,,,$199.99,"The BJORKE Arm Chair is a beautiful, Scandinavian designed piece with a subtle elegance that makes it perfect for any living space. In a cozy, light grey polyester with classic button tufts along the back, this chair has an inviting appearance with soft, ",,1-888-696-5975,"Monday to Friday – 6:30am to 4pm PST Saturday and Sunday – 7:00 am to 3pm PST"
236,"2018-03-05 04:22:14",74,"2018-03-05 04:22:14","BJORKE Armchair (Grey)",,,,$199.99,"The BJORKE Arm Chair is a beautiful, Scandinavian designed piece with a subtle elegance that makes it perfect for any living space. In a cozy, light grey polyester with classic button tufts along the back, this chair has an inviting appearance with soft, ",,1-888-696-5975,"Monday to Friday – 6:30am to 4pm PST Saturday and Sunday – 7:00 am to 3pm PST"
237,"2018-03-05 04:22:14",74,"2018-03-05 04:22:14","BJORKE Armchair (Grey)",,,,$199.99,"The BJORKE Arm Chair is a beautiful, Scandinavian designed piece with a subtle elegance that makes it perfect for any living space. In a cozy, light grey polyester with classic button tufts along the back, this chair has an inviting appearance with soft, ",,1-888-696-5975,"Monday to Friday – 6:30am to 4pm PST Saturday and Sunday – 7:00 am to 3pm PST"
238,"2018-03-05 04:22:14",74,"2018-03-05 04:22:14","BJORKE Armchair (Grey)",,,,$199.99,"The BJORKE Arm Chair is a beautiful, Scandinavian designed piece with a subtle elegance that makes it perfect for any living space. In a cozy, light grey polyester with classic button tufts along the back, this chair has an inviting appearance with soft, ",,1-888-696-5975,"Monday to Friday – 6:30am to 4pm PST Saturday and Sunday – 7:00 am to 3pm PST"
239,"2018-03-05 04:22:14",74,"2018-03-05 04:22:14","BJORKE Armchair (Grey)",,,,$199.99,"The BJORKE Arm Chair is a beautiful, Scandinavian designed piece with a subtle elegance that makes it perfect for any living space. In a cozy, light grey polyester with classic button tufts along the back, this chair has an inviting appearance with soft, ",,1-888-696-5975,"Monday to Friday – 6:30am to 4pm PST Saturday and Sunday – 7:00 am to 3pm PST"
240,"2018-03-05 04:22:14",74,"2018-03-05 04:22:14","BJORKE Armchair (Grey)",,,,$199.99,"The BJORKE Arm Chair is a beautiful, Scandinavian designed piece with a subtle elegance that makes it perfect for any living space. In a cozy, light grey polyester with classic button tufts along the back, this chair has an inviting appearance with soft, ",,1-888-696-5975,"Monday to Friday – 6:30am to 4pm PST Saturday and Sunday – 7:00 am to 3pm PST"
241,"2018-03-05 04:22:21",75,"2018-03-05 04:22:21","FANDRUP Arm Chair (Dark Grey)",,,,$299.99,"The FANDRUP Arm Chair is a Wingback Armchair features wood frame construction, solid pine legs and durable, button tufted, polyester fabric. Available in Light or Dark Grey with natural finished legs or Light Blue with espresso finished legs.",,1-888-696-5975,"Monday to Friday – 6:30am to 4pm PST Saturday and Sunday – 7:00 am to 3pm PST"
242,"2018-03-05 04:22:21",75,"2018-03-05 04:22:21","FANDRUP Arm Chair (Dark Grey)",,,,$299.99,"The FANDRUP Arm Chair is a Wingback Armchair features wood frame construction, solid pine legs and durable, button tufted, polyester fabric. Available in Light or Dark Grey with natural finished legs or Light Blue with espresso finished legs.",,1-888-696-5975,"Monday to Friday – 6:30am to 4pm PST Saturday and Sunday – 7:00 am to 3pm PST"
243,"2018-03-05 04:22:21",75,"2018-03-05 04:22:21","FANDRUP Arm Chair (Dark Grey)",,,,$299.99,"The FANDRUP Arm Chair is a Wingback Armchair features wood frame construction, solid pine legs and durable, button tufted, polyester fabric. Available in Light or Dark Grey with natural finished legs or Light Blue with espresso finished legs.",,1-888-696-5975,"Monday to Friday – 6:30am to 4pm PST Saturday and Sunday – 7:00 am to 3pm PST"
244,"2018-03-05 04:22:36",76,"2018-03-05 04:22:36","YSTAD Accent Chair (Beige)",,,,$159.99,,,1-888-696-5975,"Monday to Friday – 6:30am to 4pm PST Saturday and Sunday – 7:00 am to 3pm PST"
245,"2018-03-05 04:22:36",76,"2018-03-05 04:22:36","YSTAD Accent Chair (Beige)",,,,$159.99,,,1-888-696-5975,"Monday to Friday – 6:30am to 4pm PST Saturday and Sunday – 7:00 am to 3pm PST"
246,"2018-03-05 04:22:36",76,"2018-03-05 04:22:36","YSTAD Accent Chair (Beige)",,,,$159.99,,,1-888-696-5975,"Monday to Friday – 6:30am to 4pm PST Saturday and Sunday – 7:00 am to 3pm PST"
247,"2018-03-05 04:22:36",76,"2018-03-05 04:22:36","YSTAD Accent Chair (Beige)",,,,$159.99,,,1-888-696-5975,"Monday to Friday – 6:30am to 4pm PST Saturday and Sunday – 7:00 am to 3pm PST"
248,"2018-03-05 04:22:43",77,"2018-03-05 04:22:43","NAOMI Ottoman (Black)",,,,$24.99,"Put your feet up and relax, while maintaining a clutter free living area with this handy ottoman. Opens up to help keep those handy items stored away. Folds up for easy storage.",,1-888-696-5975,"Monday to Friday – 6:30am to 4pm PST Saturday and Sunday – 7:00 am to 3pm PST"
249,"2018-03-05 04:22:43",77,"2018-03-05 04:22:43","NAOMI Ottoman (Black)",,,,$24.99,"Put your feet up and relax, while maintaining a clutter free living area with this handy ottoman. Opens up to help keep those handy items stored away. Folds up for easy storage.",,1-888-696-5975,"Monday to Friday – 6:30am to 4pm PST Saturday and Sunday – 7:00 am to 3pm PST"
250,"2018-03-05 04:22:43",77,"2018-03-05 04:22:43","NAOMI Ottoman (Black)",,,,$24.99,"Put your feet up and relax, while maintaining a clutter free living area with this handy ottoman. Opens up to help keep those handy items stored away. Folds up for easy storage.",,1-888-696-5975,"Monday to Friday – 6:30am to 4pm PST Saturday and Sunday – 7:00 am to 3pm PST"
251,"2018-03-05 04:22:47",78,"2018-03-05 04:22:47","NAOMI Storage Bench (Black)",,,,$59.99,,,1-888-696-5975,"Monday to Friday – 6:30am to 4pm PST Saturday and Sunday – 7:00 am to 3pm PST"
252,"2018-03-05 04:22:47",78,"2018-03-05 04:22:47","NAOMI Storage Bench (Black)",,,,$59.99,,,1-888-696-5975,"Monday to Friday – 6:30am to 4pm PST Saturday and Sunday – 7:00 am to 3pm PST"
253,"2018-03-05 04:22:47",78,"2018-03-05 04:22:47","NAOMI Storage Bench (Black)",,,,$59.99,,,1-888-696-5975,"Monday to Friday – 6:30am to 4pm PST Saturday and Sunday – 7:00 am to 3pm PST"
254,"2018-03-05 04:22:47",78,"2018-03-05 04:22:47","NAOMI Storage Bench (Black)",,,,$59.99,,,1-888-696-5975,"Monday to Friday – 6:30am to 4pm PST Saturday and Sunday – 7:00 am to 3pm PST"
255,"2018-03-05 04:22:59",79,"2018-03-05 04:22:59","EGELEV Pouffe with Storage (Grey)",,,,$49.99,"Add some style and storage to your living space.",,1-888-696-5975,"Monday to Friday – 6:30am to 4pm PST Saturday and Sunday – 7:00 am to 3pm PST"
256,"2018-03-05 04:22:59",79,"2018-03-05 04:22:59","EGELEV Pouffe with Storage (Grey)",,,,$49.99,"Add some style and storage to your living space.",,1-888-696-5975,"Monday to Friday – 6:30am to 4pm PST Saturday and Sunday – 7:00 am to 3pm PST"
257,"2018-03-05 04:22:59",79,"2018-03-05 04:22:59","EGELEV Pouffe with Storage (Grey)",,,,$49.99,"Add some style and storage to your living space.",,1-888-696-5975,"Monday to Friday – 6:30am to 4pm PST Saturday and Sunday – 7:00 am to 3pm PST"
258,"2018-03-05 04:22:59",79,"2018-03-05 04:22:59","EGELEV Pouffe with Storage (Grey)",,,,$49.99,"Add some style and storage to your living space.",,1-888-696-5975,"Monday to Friday – 6:30am to 4pm PST Saturday and Sunday – 7:00 am to 3pm PST"
259,"2018-03-05 04:23:07",80,"2018-03-05 04:23:07","EGELEV Pouffe with Storage (Black)",,,,$49.99,"Add some style and storage to your living space.",,1-888-696-5975,"Monday to Friday – 6:30am to 4pm PST Saturday and Sunday – 7:00 am to 3pm PST"
260,"2018-03-05 04:23:11",81,"2018-03-05 04:23:11","MAJESTIK Knitted Pouf (Blue)",,,,$59.99,"The multipurpose MAJESTIK Knitted Pouf is the perfect way to add a bit of bohemian flair to your home. Made from hand knitted rope, the MAJESTIK Pouf is comfortable enough to sit on yet durable and versatile enough to serve as a footrest or even a small t",,1-888-696-5975,"Monday to Friday – 6:30am to 4pm PST Saturday and Sunday – 7:00 am to 3pm PST"
261,"2018-03-05 04:23:11",81,"2018-03-05 04:23:11","MAJESTIK Knitted Pouf (Blue)",,,,$59.99,"The multipurpose MAJESTIK Knitted Pouf is the perfect way to add a bit of bohemian flair to your home. Made from hand knitted rope, the MAJESTIK Pouf is comfortable enough to sit on yet durable and versatile enough to serve as a footrest or even a small t",,1-888-696-5975,"Monday to Friday – 6:30am to 4pm PST Saturday and Sunday – 7:00 am to 3pm PST"
262,"2018-03-05 04:23:11",81,"2018-03-05 04:23:11","MAJESTIK Knitted Pouf (Blue)",,,,$59.99,"The multipurpose MAJESTIK Knitted Pouf is the perfect way to add a bit of bohemian flair to your home. Made from hand knitted rope, the MAJESTIK Pouf is comfortable enough to sit on yet durable and versatile enough to serve as a footrest or even a small t",,1-888-696-5975,"Monday to Friday – 6:30am to 4pm PST Saturday and Sunday – 7:00 am to 3pm PST"
263,"2018-03-05 04:23:11",81,"2018-03-05 04:23:11","MAJESTIK Knitted Pouf (Blue)",,,,$59.99,"The multipurpose MAJESTIK Knitted Pouf is the perfect way to add a bit of bohemian flair to your home. Made from hand knitted rope, the MAJESTIK Pouf is comfortable enough to sit on yet durable and versatile enough to serve as a footrest or even a small t",,1-888-696-5975,"Monday to Friday – 6:30am to 4pm PST Saturday and Sunday – 7:00 am to 3pm PST"
264,"2018-03-05 04:23:24",82,"2018-03-05 04:23:24","NAOMI Ottoman (White)",,,,$24.99,"Put your feet up and relax, while maintaining a clutter free living area with this handy ottoman. Opens up to help keep those handy items stored away. Folds up for easy storage.",,1-888-696-5975,"Monday to Friday – 6:30am to 4pm PST Saturday and Sunday – 7:00 am to 3pm PST"
265,"2018-03-05 04:23:26",83,"2018-03-05 04:23:26","MAJESTIK Knitted Pouf (Charcoal)",,,,$59.99,"The multipurpose MAJESTIK Knitted Pouf is the perfect way to add a bit of bohemian flair to your home. Made from hand knitted rope, the MAJESTIK Pouf is comfortable enough to sit on yet durable and versatile enough to serve as a footrest or even a small t",,1-888-696-5975,"Monday to Friday – 6:30am to 4pm PST Saturday and Sunday – 7:00 am to 3pm PST"
266,"2018-03-05 04:23:26",83,"2018-03-05 04:23:26","MAJESTIK Knitted Pouf (Charcoal)",,,,$59.99,"The multipurpose MAJESTIK Knitted Pouf is the perfect way to add a bit of bohemian flair to your home. Made from hand knitted rope, the MAJESTIK Pouf is comfortable enough to sit on yet durable and versatile enough to serve as a footrest or even a small t",,1-888-696-5975,"Monday to Friday – 6:30am to 4pm PST Saturday and Sunday – 7:00 am to 3pm PST"
267,"2018-03-05 04:23:26",83,"2018-03-05 04:23:26","MAJESTIK Knitted Pouf (Charcoal)",,,,$59.99,"The multipurpose MAJESTIK Knitted Pouf is the perfect way to add a bit of bohemian flair to your home. Made from hand knitted rope, the MAJESTIK Pouf is comfortable enough to sit on yet durable and versatile enough to serve as a footrest or even a small t",,1-888-696-5975,"Monday to Friday – 6:30am to 4pm PST Saturday and Sunday – 7:00 am to 3pm PST"
268,"2018-03-05 04:23:26",83,"2018-03-05 04:23:26","MAJESTIK Knitted Pouf (Charcoal)",,,,$59.99,"The multipurpose MAJESTIK Knitted Pouf is the perfect way to add a bit of bohemian flair to your home. Made from hand knitted rope, the MAJESTIK Pouf is comfortable enough to sit on yet durable and versatile enough to serve as a footrest or even a small t",,1-888-696-5975,"Monday to Friday – 6:30am to 4pm PST Saturday and Sunday – 7:00 am to 3pm PST"
269,"2018-03-05 04:23:30",84,"2018-03-05 04:23:30","NAOMI Storage Bench (Brown)",,,,$59.99,,,1-888-696-5975,"Monday to Friday – 6:30am to 4pm PST Saturday and Sunday – 7:00 am to 3pm PST"
270,"2018-03-05 04:23:34",85,"2018-03-05 04:23:34","MAJESTIK Knitted Pouf (Ecru)",,,,$59.99,"The multipurpose MAJESTIK Knitted Pouf is the perfect way to add a bit of bohemian flair to your home. Made from hand knitted rope, the MAJESTIK Pouf is comfortable enough to sit on yet durable and versatile enough to serve as a footrest or even a small t",,1-888-696-5975,"Monday to Friday – 6:30am to 4pm PST Saturday and Sunday – 7:00 am to 3pm PST"
271,"2018-03-05 04:23:34",85,"2018-03-05 04:23:34","MAJESTIK Knitted Pouf (Ecru)",,,,$59.99,"The multipurpose MAJESTIK Knitted Pouf is the perfect way to add a bit of bohemian flair to your home. Made from hand knitted rope, the MAJESTIK Pouf is comfortable enough to sit on yet durable and versatile enough to serve as a footrest or even a small t",,1-888-696-5975,"Monday to Friday – 6:30am to 4pm PST Saturday and Sunday – 7:00 am to 3pm PST"
272,"2018-03-05 04:23:34",85,"2018-03-05 04:23:34","MAJESTIK Knitted Pouf (Ecru)",,,,$59.99,"The multipurpose MAJESTIK Knitted Pouf is the perfect way to add a bit of bohemian flair to your home. Made from hand knitted rope, the MAJESTIK Pouf is comfortable enough to sit on yet durable and versatile enough to serve as a footrest or even a small t",,1-888-696-5975,"Monday to Friday – 6:30am to 4pm PST Saturday and Sunday – 7:00 am to 3pm PST"
273,"2018-03-05 04:23:44",86,"2018-03-05 04:23:44","NAOMI Ottoman (Brown)",,,,$24.99,"Put your feet up and relax, while maintaining a clutter free living area with this handy ottoman. Opens up to help keep those handy items stored away. Folds up for easy storage.",,1-888-696-5975,"Monday to Friday – 6:30am to 4pm PST Saturday and Sunday – 7:00 am to 3pm PST"
274,"2018-03-05 04:23:44",86,"2018-03-05 04:23:44","NAOMI Ottoman (Brown)",,,,$24.99,"Put your feet up and relax, while maintaining a clutter free living area with this handy ottoman. Opens up to help keep those handy items stored away. Folds up for easy storage.",,1-888-696-5975,"Monday to Friday – 6:30am to 4pm PST Saturday and Sunday – 7:00 am to 3pm PST"
275,"2018-03-05 04:23:44",86,"2018-03-05 04:23:44","NAOMI Ottoman (Brown)",,,,$24.99,"Put your feet up and relax, while maintaining a clutter free living area with this handy ottoman. Opens up to help keep those handy items stored away. Folds up for easy storage.",,1-888-696-5975,"Monday to Friday – 6:30am to 4pm PST Saturday and Sunday – 7:00 am to 3pm PST"
276,"2018-03-05 04:23:53",87,"2018-03-05 04:23:53","NAOMI Ottoman (Apple)",,,,$24.99,"Put your feet up and relax, while maintaining a clutter free living area with this handy ottoman. Opens up to help keep those handy items stored away. Folds up for easy storage.",,1-888-696-5975,"Monday to Friday – 6:30am to 4pm PST Saturday and Sunday – 7:00 am to 3pm PST"
277,"2018-03-05 04:23:53",87,"2018-03-05 04:23:53","NAOMI Ottoman (Apple)",,,,$24.99,"Put your feet up and relax, while maintaining a clutter free living area with this handy ottoman. Opens up to help keep those handy items stored away. Folds up for easy storage.",,1-888-696-5975,"Monday to Friday – 6:30am to 4pm PST Saturday and Sunday – 7:00 am to 3pm PST"
278,"2018-03-05 04:23:53",87,"2018-03-05 04:23:53","NAOMI Ottoman (Apple)",,,,$24.99,"Put your feet up and relax, while maintaining a clutter free living area with this handy ottoman. Opens up to help keep those handy items stored away. Folds up for easy storage.",,1-888-696-5975,"Monday to Friday – 6:30am to 4pm PST Saturday and Sunday – 7:00 am to 3pm PST"
279,"2018-03-05 04:24:02",88,"2018-03-05 04:24:02","SOPHIE Pouf (Grey)",$39.99,$29.99,"$10 !",,"The multipurpose SOPHIE Pouf is comfortable enough to sit on yet durable and versatile enough to serve as a footrest or even a small table. Its delightful colour also makes it a great option as a decorative accent piece.",,1-888-696-5975,"Monday to Friday – 6:30am to 4pm PST Saturday and Sunday – 7:00 am to 3pm PST"
280,"2018-03-05 04:24:13",89,"2018-03-05 04:24:13","SOPHIE Pouf (Black)",$39.99,$29.99,"$10 !",,"The multipurpose SOPHIE Pouf is comfortable enough to sit on yet durable and versatile enough to serve as a footrest or even a small table. Its delightful colour also makes it a great option as a decorative accent piece.",,1-888-696-5975,"Monday to Friday – 6:30am to 4pm PST Saturday and Sunday – 7:00 am to 3pm PST"
281,"2018-03-05 04:24:18",90,"2018-03-05 04:24:18","SOPHIE Pouf (White)",$39.99,$29.99,"$10 !",,"The multipurpose SOPHIE Pouf is comfortable enough to sit on yet durable and versatile enough to serve as a footrest or even a small table. Its delightful colour also makes it a great option as a decorative accent piece.",,1-888-696-5975,"Monday to Friday – 6:30am to 4pm PST Saturday and Sunday – 7:00 am to 3pm PST"
282,"2018-03-05 04:24:18",90,"2018-03-05 04:24:18","SOPHIE Pouf (White)",$39.99,$29.99,"$10 !",,"The multipurpose SOPHIE Pouf is comfortable enough to sit on yet durable and versatile enough to serve as a footrest or even a small table. Its delightful colour also makes it a great option as a decorative accent piece.",,1-888-696-5975,"Monday to Friday – 6:30am to 4pm PST Saturday and Sunday – 7:00 am to 3pm PST"
283,"2018-03-05 04:24:18",90,"2018-03-05 04:24:18","SOPHIE Pouf (White)",$39.99,$29.99,"$10 !",,"The multipurpose SOPHIE Pouf is comfortable enough to sit on yet durable and versatile enough to serve as a footrest or even a small table. Its delightful colour also makes it a great option as a decorative accent piece.",,1-888-696-5975,"Monday to Friday – 6:30am to 4pm PST Saturday and Sunday – 7:00 am to 3pm PST"
284,"2018-03-05 04:24:31",91,"2018-03-05 04:24:31","HUSUM Stool (Grey)",,,,$49.99,"Four legged stool draped in faux fur.",,1-888-696-5975,"Monday to Friday – 6:30am to 4pm PST Saturday and Sunday – 7:00 am to 3pm PST"