beauty_detail.id,beauty_detail.ts,beauty_detail.key,beauty_detail.value,beauty.id,beauty.ts,beauty.name,beauty.telephone,beauty.street_address,beauty.address_locality,beauty.address_region,beauty.postal_code,beauty.description,beauty.address_country,beauty.medical_specialty,beauty.fax_number,beauty.payment_accepted,beauty.email
1,"2023-08-03 08:50:02","Get Featured on Wellness.com","<span class=""learn-more""> <span class=""more-caret"">> </span> <span class=""learn-more-text"">Learn More</span> </span> </span> </a>",1,"2023-07-04 11:14:52","K. Lamar Hart, Jr., M.D.","(334) 792-1242","108 Medical Dr.",Dothan,AL,36303,"K. Lamar Hart, Jr., M.D. is a Cosmetic Dermatologist facility at 108 Medical Dr. in Dothan, AL.",US,,,,
2,"2023-08-03 08:50:02",About,"<h2>K. Lamar Hart, Jr., M.D.</h2> <span class=""listing-about"">K. Lamar Hart, Jr., M.D. is a Cosmetic Dermatologist facility at 108 Medical Dr. in Dothan, AL.</span>",1,"2023-07-04 11:14:52","K. Lamar Hart, Jr., M.D.","(334) 792-1242","108 Medical Dr.",Dothan,AL,36303,"K. Lamar Hart, Jr., M.D. is a Cosmetic Dermatologist facility at 108 Medical Dr. in Dothan, AL.",US,,,,
3,"2023-08-03 08:50:02","Primary Specialty","<h2 class=""normal"">Cosmetic Dermatologist</h2>",1,"2023-07-04 11:14:52","K. Lamar Hart, Jr., M.D.","(334) 792-1242","108 Medical Dr.",Dothan,AL,36303,"K. Lamar Hart, Jr., M.D. is a Cosmetic Dermatologist facility at 108 Medical Dr. in Dothan, AL.",US,,,,
4,"2023-08-03 08:50:02",Services,"<span>K. Lamar Hart, Jr., M.D. offers cosmetic dermatology treatments in Dothan, AL. A Cosmetic Dermatologist can perform a wide range of procedures aimed at improving the appearance of the skin. A Cosmetic Dermatologist may be able to reduce or remove fi",1,"2023-07-04 11:14:52","K. Lamar Hart, Jr., M.D.","(334) 792-1242","108 Medical Dr.",Dothan,AL,36303,"K. Lamar Hart, Jr., M.D. is a Cosmetic Dermatologist facility at 108 Medical Dr. in Dothan, AL.",US,,,,
5,"2023-08-03 08:51:57","Get Featured on Wellness.com","<span class=""learn-more""> <span class=""more-caret"">> </span> <span class=""learn-more-text"">Learn More</span> </span> </span> </a>",2,"2023-08-03 08:52:00","Sarah Sawyer, MD","(205) 870-3303","201 Office Park Drive Suite 350",Birmingham,AL,35223,"Sarah Sawyer, MD practices as a Cosmetic Dermatologist in Birmingham, AL.She graduated from University of Alabama Sc...",US,,,"Cash, Personal Check, Visa, Mastercard, American Express, Discover, Care Credit, Debit Cards",
6,"2023-08-03 08:51:57",About,"<h2>Sarah Sawyer, MD</h2> <span class=""listing-about"">Sarah Sawyer, MD practices as a Cosmetic Dermatologist in Birmingham, AL.She graduated from University of Alabama School of Medicine , University of Missouri-Columbia .</span>",2,"2023-08-03 08:52:00","Sarah Sawyer, MD","(205) 870-3303","201 Office Park Drive Suite 350",Birmingham,AL,35223,"Sarah Sawyer, MD practices as a Cosmetic Dermatologist in Birmingham, AL.She graduated from University of Alabama Sc...",US,,,"Cash, Personal Check, Visa, Mastercard, American Express, Discover, Care Credit, Debit Cards",
7,"2023-08-03 08:51:57","Primary Specialty","<h2 class=""normal"">Cosmetic Dermatologist</h2>",2,"2023-08-03 08:52:00","Sarah Sawyer, MD","(205) 870-3303","201 Office Park Drive Suite 350",Birmingham,AL,35223,"Sarah Sawyer, MD practices as a Cosmetic Dermatologist in Birmingham, AL.She graduated from University of Alabama Sc...",US,,,"Cash, Personal Check, Visa, Mastercard, American Express, Discover, Care Credit, Debit Cards",
8,"2023-08-03 08:51:57",Education,"<span>University of Alabama School of Medicine , University of Missouri-Columbia </span>",2,"2023-08-03 08:52:00","Sarah Sawyer, MD","(205) 870-3303","201 Office Park Drive Suite 350",Birmingham,AL,35223,"Sarah Sawyer, MD practices as a Cosmetic Dermatologist in Birmingham, AL.She graduated from University of Alabama Sc...",US,,,"Cash, Personal Check, Visa, Mastercard, American Express, Discover, Care Credit, Debit Cards",
9,"2023-08-03 08:51:57",Certification,<span>Dermatology</span>,2,"2023-08-03 08:52:00","Sarah Sawyer, MD","(205) 870-3303","201 Office Park Drive Suite 350",Birmingham,AL,35223,"Sarah Sawyer, MD practices as a Cosmetic Dermatologist in Birmingham, AL.She graduated from University of Alabama Sc...",US,,,"Cash, Personal Check, Visa, Mastercard, American Express, Discover, Care Credit, Debit Cards",
10,"2023-08-03 08:51:57","Payment Options","<span>Cash, Personal Check, Visa, Mastercard, American Express, Discover, Care Credit, Debit Cards</span>",2,"2023-08-03 08:52:00","Sarah Sawyer, MD","(205) 870-3303","201 Office Park Drive Suite 350",Birmingham,AL,35223,"Sarah Sawyer, MD practices as a Cosmetic Dermatologist in Birmingham, AL.She graduated from University of Alabama Sc...",US,,,"Cash, Personal Check, Visa, Mastercard, American Express, Discover, Care Credit, Debit Cards",
11,"2023-08-03 08:51:57",Gender,<span>Female</span>,2,"2023-08-03 08:52:00","Sarah Sawyer, MD","(205) 870-3303","201 Office Park Drive Suite 350",Birmingham,AL,35223,"Sarah Sawyer, MD practices as a Cosmetic Dermatologist in Birmingham, AL.She graduated from University of Alabama Sc...",US,,,"Cash, Personal Check, Visa, Mastercard, American Express, Discover, Care Credit, Debit Cards",
12,"2023-08-03 08:51:57",Services,"<span>Sarah Sawyer, MD offers cosmetic dermatology treatments in Birmingham, AL. A Cosmetic Dermatologist can perform a wide range of procedures aimed at improving the appearance of the skin. A Cosmetic Dermatologist may be able to reduce or remove fine l",2,"2023-08-03 08:52:00","Sarah Sawyer, MD","(205) 870-3303","201 Office Park Drive Suite 350",Birmingham,AL,35223,"Sarah Sawyer, MD practices as a Cosmetic Dermatologist in Birmingham, AL.She graduated from University of Alabama Sc...",US,,,"Cash, Personal Check, Visa, Mastercard, American Express, Discover, Care Credit, Debit Cards",
13,"2023-08-03 08:52:06","Get Featured on Wellness.com","<span class=""learn-more""> <span class=""more-caret"">> </span> <span class=""learn-more-text"">Learn More</span> </span> </span> </a>",3,"2023-07-04 11:15:26","Hedden Plastic Surgery Center","(205) 980-1744","111 Village Street",Birmingham,AL,35242,"Hedden Plastic Surgery Center is a Cosmetic Dermatologist facility at 111 Village Street in Birmingham, AL.",US,,,,
14,"2023-08-03 08:52:06",About,"<h2>Hedden Plastic Surgery Center</h2> <span class=""listing-about"">Hedden Plastic Surgery Center is a Cosmetic Dermatologist facility at 111 Village Street in Birmingham, AL.</span>",3,"2023-07-04 11:15:26","Hedden Plastic Surgery Center","(205) 980-1744","111 Village Street",Birmingham,AL,35242,"Hedden Plastic Surgery Center is a Cosmetic Dermatologist facility at 111 Village Street in Birmingham, AL.",US,,,,
15,"2023-08-03 08:52:06","Primary Specialty","<h2 class=""normal"">Cosmetic Dermatologist</h2>",3,"2023-07-04 11:15:26","Hedden Plastic Surgery Center","(205) 980-1744","111 Village Street",Birmingham,AL,35242,"Hedden Plastic Surgery Center is a Cosmetic Dermatologist facility at 111 Village Street in Birmingham, AL.",US,,,,
16,"2023-08-03 08:52:06",Services,"<span>Hedden Plastic Surgery Center offers cosmetic dermatology treatments in Birmingham, AL. A Cosmetic Dermatologist can perform a wide range of procedures aimed at improving the appearance of the skin. A Cosmetic Dermatologist may be able to reduce or ",3,"2023-07-04 11:15:26","Hedden Plastic Surgery Center","(205) 980-1744","111 Village Street",Birmingham,AL,35242,"Hedden Plastic Surgery Center is a Cosmetic Dermatologist facility at 111 Village Street in Birmingham, AL.",US,,,,
17,"2023-08-03 08:52:17",About,"<h2>The Hub IV Bar</h2> <span class=""listing-about"">We understand it’s tough when you’re running hard in work and life. And we know you enjoy your work and love your family - but even you get tired of gutting your way through it, day in and day out. Even ",4,"2023-07-04 11:15:51","The Hub IV Bar","(617) 249-5342","500 Commonwealth Ave. Suite 526",Boston,MA,02215,"We understand it’s tough when you’re running hard in work and life. And we know you enjoy your work and love your fam...",US,,,,
18,"2023-08-03 08:52:17",Website,"<a rel=""nofollow"" id=""provider-website"" target=""website"" href=""https://thehubivbar.com/"">https://thehubivbar.com/</a>",4,"2023-07-04 11:15:51","The Hub IV Bar","(617) 249-5342","500 Commonwealth Ave. Suite 526",Boston,MA,02215,"We understand it’s tough when you’re running hard in work and life. And we know you enjoy your work and love your fam...",US,,,,
19,"2023-08-03 08:52:17","Primary Specialty","<h2 class=""normal"">Health Club</h2>",4,"2023-07-04 11:15:51","The Hub IV Bar","(617) 249-5342","500 Commonwealth Ave. Suite 526",Boston,MA,02215,"We understand it’s tough when you’re running hard in work and life. And we know you enjoy your work and love your fam...",US,,,,
20,"2023-08-03 08:52:17",Practice,"<span class=""organization-text"">The Hub IV Bar</span>",4,"2023-07-04 11:15:51","The Hub IV Bar","(617) 249-5342","500 Commonwealth Ave. Suite 526",Boston,MA,02215,"We understand it’s tough when you’re running hard in work and life. And we know you enjoy your work and love your fam...",US,,,,
21,"2023-08-03 08:52:17","Accepting New Patients",,4,"2023-07-04 11:15:51","The Hub IV Bar","(617) 249-5342","500 Commonwealth Ave. Suite 526",Boston,MA,02215,"We understand it’s tough when you’re running hard in work and life. And we know you enjoy your work and love your fam...",US,,,,
22,"2023-08-03 08:52:17",Languages,<span>English</span>,4,"2023-07-04 11:15:51","The Hub IV Bar","(617) 249-5342","500 Commonwealth Ave. Suite 526",Boston,MA,02215,"We understand it’s tough when you’re running hard in work and life. And we know you enjoy your work and love your fam...",US,,,,
23,"2023-08-03 08:52:17",Services,"<span>IV Therapy</span>",4,"2023-07-04 11:15:51","The Hub IV Bar","(617) 249-5342","500 Commonwealth Ave. Suite 526",Boston,MA,02215,"We understand it’s tough when you’re running hard in work and life. And we know you enjoy your work and love your fam...",US,,,,
24,"2023-08-03 08:52:28",About,"<h2>Kathryn Russo</h2> <span class=""listing-about"">Kathryn Russo is an experienced Family Nurse Practitioner specializing in Cosmetic Dermatology and Anti-Aging Medicine. Her experience is with a vast range of products from the more common applications su",5,"2023-08-03 08:52:31","KDR Medspa + Wellness","(617) 834-1812","17 Herrick Rd",Newton,MA,02459,"Kathryn Russo is an experienced Family Nurse Practitioner specializing in Cosmetic Dermatology and Anti-Aging Medicin...",US,,,,info@kathrynrussoaesthetics.com
25,"2023-08-03 08:52:28",Website,"<a rel=""nofollow"" id=""provider-website"" target=""website"" href=""https://kathrynrussoaesthetics.com/"">https://kathrynrussoaesthetics.com/</a>",5,"2023-08-03 08:52:31","KDR Medspa + Wellness","(617) 834-1812","17 Herrick Rd",Newton,MA,02459,"Kathryn Russo is an experienced Family Nurse Practitioner specializing in Cosmetic Dermatology and Anti-Aging Medicin...",US,,,,info@kathrynrussoaesthetics.com
26,"2023-08-03 08:52:28","Primary Specialty","<h2 class=""normal"">Health Club</h2>",5,"2023-08-03 08:52:31","KDR Medspa + Wellness","(617) 834-1812","17 Herrick Rd",Newton,MA,02459,"Kathryn Russo is an experienced Family Nurse Practitioner specializing in Cosmetic Dermatology and Anti-Aging Medicin...",US,,,,info@kathrynrussoaesthetics.com
27,"2023-08-03 08:52:28",Practice,"<span class=""organization-text"">KDR Medspa + Wellness</span>",5,"2023-08-03 08:52:31","KDR Medspa + Wellness","(617) 834-1812","17 Herrick Rd",Newton,MA,02459,"Kathryn Russo is an experienced Family Nurse Practitioner specializing in Cosmetic Dermatology and Anti-Aging Medicin...",US,,,,info@kathrynrussoaesthetics.com
28,"2023-08-03 08:52:28","Accepting New Patients",,5,"2023-08-03 08:52:31","KDR Medspa + Wellness","(617) 834-1812","17 Herrick Rd",Newton,MA,02459,"Kathryn Russo is an experienced Family Nurse Practitioner specializing in Cosmetic Dermatology and Anti-Aging Medicin...",US,,,,info@kathrynrussoaesthetics.com
29,"2023-08-03 08:52:28",Degrees,"<span>Family Nurse Practitioner</span>",5,"2023-08-03 08:52:31","KDR Medspa + Wellness","(617) 834-1812","17 Herrick Rd",Newton,MA,02459,"Kathryn Russo is an experienced Family Nurse Practitioner specializing in Cosmetic Dermatology and Anti-Aging Medicin...",US,,,,info@kathrynrussoaesthetics.com
30,"2023-08-03 08:52:28","Office Name","<span>KDR Medspa + Wellness</span>",5,"2023-08-03 08:52:31","KDR Medspa + Wellness","(617) 834-1812","17 Herrick Rd",Newton,MA,02459,"Kathryn Russo is an experienced Family Nurse Practitioner specializing in Cosmetic Dermatology and Anti-Aging Medicin...",US,,,,info@kathrynrussoaesthetics.com
31,"2023-08-03 08:52:28",Languages,<span>English</span>,5,"2023-08-03 08:52:31","KDR Medspa + Wellness","(617) 834-1812","17 Herrick Rd",Newton,MA,02459,"Kathryn Russo is an experienced Family Nurse Practitioner specializing in Cosmetic Dermatology and Anti-Aging Medicin...",US,,,,info@kathrynrussoaesthetics.com
32,"2023-08-03 08:52:28",Email,<span>info@kathrynrussoaesthetics.com</span>,5,"2023-08-03 08:52:31","KDR Medspa + Wellness","(617) 834-1812","17 Herrick Rd",Newton,MA,02459,"Kathryn Russo is an experienced Family Nurse Practitioner specializing in Cosmetic Dermatology and Anti-Aging Medicin...",US,,,,info@kathrynrussoaesthetics.com
33,"2023-08-03 08:52:28",Gender,<span>Female</span>,5,"2023-08-03 08:52:31","KDR Medspa + Wellness","(617) 834-1812","17 Herrick Rd",Newton,MA,02459,"Kathryn Russo is an experienced Family Nurse Practitioner specializing in Cosmetic Dermatology and Anti-Aging Medicin...",US,,,,info@kathrynrussoaesthetics.com
34,"2023-08-03 08:52:28",Services,"<span>Full-Service Med Spa, Injectable Treatment, Bioidentical Hormone Replacement, IV Nutrition Therapy, Platelet Rich Plasma, Skin Care Treatments, PlasmaPen, Women's Sexual Health Procedures, Aesthetic Services</span>",5,"2023-08-03 08:52:31","KDR Medspa + Wellness","(617) 834-1812","17 Herrick Rd",Newton,MA,02459,"Kathryn Russo is an experienced Family Nurse Practitioner specializing in Cosmetic Dermatology and Anti-Aging Medicin...",US,,,,info@kathrynrussoaesthetics.com
35,"2023-08-03 08:52:34","Get Featured on Wellness.com","<span class=""learn-more""> <span class=""more-caret"">> </span> <span class=""learn-more-text"">Learn More</span> </span> </span> </a>",100790,"2023-07-04 12:29:02","Curves for Women","(734) 429-2000","509 East Michigan Avenue",Saline,MI,48176,"Curves for Women is a Health Club facility at 509 East Michigan Avenue in Saline, MI.",US,,,,
36,"2023-08-03 08:52:34",About,"<h2>Curves for Women</h2> <span class=""listing-about"">Curves for Women is a Health Club facility at 509 East Michigan Avenue in Saline, MI.</span>",100790,"2023-07-04 12:29:02","Curves for Women","(734) 429-2000","509 East Michigan Avenue",Saline,MI,48176,"Curves for Women is a Health Club facility at 509 East Michigan Avenue in Saline, MI.",US,,,,
37,"2023-08-03 08:52:34","Primary Specialty","<h2 class=""normal"">Health Club</h2>",100790,"2023-07-04 12:29:02","Curves for Women","(734) 429-2000","509 East Michigan Avenue",Saline,MI,48176,"Curves for Women is a Health Club facility at 509 East Michigan Avenue in Saline, MI.",US,,,,
38,"2023-08-03 08:52:34",Services,"<span>Curves for Women is a health club in Saline, MI. <br><br>Health Clubs like Curves for Women offer services that often include exercise, yoga, kick boxing, swimming, sauna, pool, weights, and personal training. Talk to the staff at Curves for Women f",100790,"2023-07-04 12:29:02","Curves for Women","(734) 429-2000","509 East Michigan Avenue",Saline,MI,48176,"Curves for Women is a Health Club facility at 509 East Michigan Avenue in Saline, MI.",US,,,,
39,"2023-08-03 08:52:35","Get Featured on Wellness.com","<span class=""learn-more""> <span class=""more-caret"">> </span> <span class=""learn-more-text"">Learn More</span> </span> </span> </a>",6,"2023-07-04 11:15:51","Cardio Fitness Group Llc","(781) 986-5555","50 Warren St",Randolph,MA,02368,"Cardio Fitness Group Llc is a Health Club facility at 50 Warren St in Randolph, MA.",US,,,,
40,"2023-08-03 08:52:35",About,"<h2>Cardio Fitness Group Llc</h2> <span class=""listing-about"">Cardio Fitness Group Llc is a Health Club facility at 50 Warren St in Randolph, MA.</span>",6,"2023-07-04 11:15:51","Cardio Fitness Group Llc","(781) 986-5555","50 Warren St",Randolph,MA,02368,"Cardio Fitness Group Llc is a Health Club facility at 50 Warren St in Randolph, MA.",US,,,,
41,"2023-08-03 08:52:35","Primary Specialty","<h2 class=""normal"">Health Club</h2>",6,"2023-07-04 11:15:51","Cardio Fitness Group Llc","(781) 986-5555","50 Warren St",Randolph,MA,02368,"Cardio Fitness Group Llc is a Health Club facility at 50 Warren St in Randolph, MA.",US,,,,
42,"2023-08-03 08:52:35",Services,"<span>Cardio Fitness Group Llc is a health club in Randolph, MA. <br><br>Health Clubs like Cardio Fitness Group Llc offer services that often include exercise, yoga, kick boxing, swimming, sauna, pool, weights, and personal training. Talk to the staff at ",6,"2023-07-04 11:15:51","Cardio Fitness Group Llc","(781) 986-5555","50 Warren St",Randolph,MA,02368,"Cardio Fitness Group Llc is a Health Club facility at 50 Warren St in Randolph, MA.",US,,,,
43,"2023-08-03 08:52:37","Get Featured on Wellness.com","<span class=""learn-more""> <span class=""more-caret"">> </span> <span class=""learn-more-text"">Learn More</span> </span> </span> </a>",7,"2023-07-04 11:15:51","Fighting Orange Institute","(781) 963-6006","94 N Main St",Randolph,MA,02368,"Fighting Orange Institute is a Health Club facility at 94 N Main St in Randolph, MA.",US,,,,
44,"2023-08-03 08:52:37",About,"<h2>Fighting Orange Institute</h2> <span class=""listing-about"">Fighting Orange Institute is a Health Club facility at 94 N Main St in Randolph, MA.</span>",7,"2023-07-04 11:15:51","Fighting Orange Institute","(781) 963-6006","94 N Main St",Randolph,MA,02368,"Fighting Orange Institute is a Health Club facility at 94 N Main St in Randolph, MA.",US,,,,
45,"2023-08-03 08:52:37","Primary Specialty","<h2 class=""normal"">Health Club</h2>",7,"2023-07-04 11:15:51","Fighting Orange Institute","(781) 963-6006","94 N Main St",Randolph,MA,02368,"Fighting Orange Institute is a Health Club facility at 94 N Main St in Randolph, MA.",US,,,,
46,"2023-08-03 08:52:37",Services,"<span>Fighting Orange Institute is a health club in Randolph, MA. <br><br>Health Clubs like Fighting Orange Institute offer services that often include exercise, yoga, kick boxing, swimming, sauna, pool, weights, and personal training. Talk to the staff a",7,"2023-07-04 11:15:51","Fighting Orange Institute","(781) 963-6006","94 N Main St",Randolph,MA,02368,"Fighting Orange Institute is a Health Club facility at 94 N Main St in Randolph, MA.",US,,,,
47,"2023-08-03 08:52:39","Get Featured on Wellness.com","<span class=""learn-more""> <span class=""more-caret"">> </span> <span class=""learn-more-text"">Learn More</span> </span> </span> </a>",100791,"2023-07-04 12:29:02","Coach Me Fit","(734) 944-0702","1207 Industrial Dr",Saline,MI,48176,"Coach Me Fit is a Health Club facility at 1207 Industrial Dr in Saline, MI.",US,,,,
48,"2023-08-03 08:52:39",About,"<h2>Coach Me Fit</h2> <span class=""listing-about"">Coach Me Fit is a Health Club facility at 1207 Industrial Dr in Saline, MI.</span>",100791,"2023-07-04 12:29:02","Coach Me Fit","(734) 944-0702","1207 Industrial Dr",Saline,MI,48176,"Coach Me Fit is a Health Club facility at 1207 Industrial Dr in Saline, MI.",US,,,,
49,"2023-08-03 08:52:39","Primary Specialty","<h2 class=""normal"">Health Club</h2>",100791,"2023-07-04 12:29:02","Coach Me Fit","(734) 944-0702","1207 Industrial Dr",Saline,MI,48176,"Coach Me Fit is a Health Club facility at 1207 Industrial Dr in Saline, MI.",US,,,,
50,"2023-08-03 08:52:39",Services,"<span>Coach Me Fit is a health club in Saline, MI. <br><br>Health Clubs like Coach Me Fit offer services that often include exercise, yoga, kick boxing, swimming, sauna, pool, weights, and personal training. Talk to the staff at Coach Me Fit for informati",100791,"2023-07-04 12:29:02","Coach Me Fit","(734) 944-0702","1207 Industrial Dr",Saline,MI,48176,"Coach Me Fit is a Health Club facility at 1207 Industrial Dr in Saline, MI.",US,,,,
51,"2023-08-03 08:52:43","Get Featured on Wellness.com","<span class=""learn-more""> <span class=""more-caret"">> </span> <span class=""learn-more-text"">Learn More</span> </span> </span> </a>",8,"2023-07-04 11:15:51","Innovative Fitness Systems Wellness Center","(781) 986-5885","24 Mazzeo Drive",Randolph,MA,02368,"Innovative Fitness Systems Wellness Center is a Health Club facility at 24 Mazzeo Drive in Randolph, MA.",US,,,,
52,"2023-08-03 08:52:43",About,"<h2>Innovative Fitness Systems Wellness Center</h2> <span class=""listing-about"">Innovative Fitness Systems Wellness Center is a Health Club facility at 24 Mazzeo Drive in Randolph, MA.</span>",8,"2023-07-04 11:15:51","Innovative Fitness Systems Wellness Center","(781) 986-5885","24 Mazzeo Drive",Randolph,MA,02368,"Innovative Fitness Systems Wellness Center is a Health Club facility at 24 Mazzeo Drive in Randolph, MA.",US,,,,
53,"2023-08-03 08:52:43","Primary Specialty","<h2 class=""normal"">Health Club</h2>",8,"2023-07-04 11:15:51","Innovative Fitness Systems Wellness Center","(781) 986-5885","24 Mazzeo Drive",Randolph,MA,02368,"Innovative Fitness Systems Wellness Center is a Health Club facility at 24 Mazzeo Drive in Randolph, MA.",US,,,,
54,"2023-08-03 08:52:43",Services,"<span>Innovative Fitness Systems Wellness Center is a health club in Randolph, MA. <br><br>Health Clubs like Innovative Fitness Systems Wellness Center offer services that often include exercise, yoga, kick boxing, swimming, sauna, pool, weights, and pers",8,"2023-07-04 11:15:51","Innovative Fitness Systems Wellness Center","(781) 986-5885","24 Mazzeo Drive",Randolph,MA,02368,"Innovative Fitness Systems Wellness Center is a Health Club facility at 24 Mazzeo Drive in Randolph, MA.",US,,,,
55,"2023-08-03 08:52:48","Get Featured on Wellness.com","<span class=""learn-more""> <span class=""more-caret"">> </span> <span class=""learn-more-text"">Learn More</span> </span> </span> </a>",9,"2023-07-04 11:15:51","Randolph Youth Soccer Association Inc","(781) 963-2936","60 Pleasant St",Randolph,MA,02368,"Randolph Youth Soccer Association Inc is a Health Club facility at 60 Pleasant St in Randolph, MA.",US,,,,
56,"2023-08-03 08:52:48",About,"<h2>Randolph Youth Soccer Association Inc</h2> <span class=""listing-about"">Randolph Youth Soccer Association Inc is a Health Club facility at 60 Pleasant St in Randolph, MA.</span>",9,"2023-07-04 11:15:51","Randolph Youth Soccer Association Inc","(781) 963-2936","60 Pleasant St",Randolph,MA,02368,"Randolph Youth Soccer Association Inc is a Health Club facility at 60 Pleasant St in Randolph, MA.",US,,,,
57,"2023-08-03 08:52:48","Primary Specialty","<h2 class=""normal"">Health Club</h2>",9,"2023-07-04 11:15:51","Randolph Youth Soccer Association Inc","(781) 963-2936","60 Pleasant St",Randolph,MA,02368,"Randolph Youth Soccer Association Inc is a Health Club facility at 60 Pleasant St in Randolph, MA.",US,,,,
58,"2023-08-03 08:52:48",Services,"<span>Randolph Youth Soccer Association Inc is a health club in Randolph, MA. <br><br>Health Clubs like Randolph Youth Soccer Association Inc offer services that often include exercise, yoga, kick boxing, swimming, sauna, pool, weights, and personal train",9,"2023-07-04 11:15:51","Randolph Youth Soccer Association Inc","(781) 963-2936","60 Pleasant St",Randolph,MA,02368,"Randolph Youth Soccer Association Inc is a Health Club facility at 60 Pleasant St in Randolph, MA.",US,,,,