category_2_x_motorcycle_part.id,category_2.id,category_2.ts,category_2.title,category_2.category_1,category_1.id,category_1.ts,category_1.title,motorcycle_part.id,motorcycle_part.ts,motorcycle_part.title,motorcycle_part.model_parameters,motorcycle_part.producting_area,motorcycle_part.designer,motorcycle_part.finish,motorcycle_part.manufacturer_part_number,motorcycle_part.sold_in_units,motorcycle_part.price,motorcycle_part.review,motorcycle_part.content_description
7672,1,"2017-09-20 03:53:49","Air Cleaner Components","Air Intake &amp; Fuel Systems",1,"2017-08-03 23:11:50","Air Intake &amp; Fuel Systems",7672,"2017-11-08 00:54:14","Genuine James Back Plate Assembly to Cylinder Head O-ring","J&P Part: 172-004","Made in the USA",,,JGI-11292,Each,,,
7673,1,"2017-09-20 03:53:49","Air Cleaner Components","Air Intake &amp; Fuel Systems",1,"2017-08-03 23:11:50","Air Intake &amp; Fuel Systems",7673,"2017-11-08 00:54:14","Genuine James Air Cleaner Gasket Paper with Adhesive","J&P Part: 172-025","Made in the USA",,,JGI-29313-95,Each,,,
7674,1,"2017-09-20 03:53:49","Air Cleaner Components","Air Intake &amp; Fuel Systems",1,"2017-08-03 23:11:50","Air Intake &amp; Fuel Systems",7674,"2017-11-08 00:54:14","J&P Cycles&reg; Replacement Induction Module to Backplate Gasket","J&P Part: 401-190",,,,,Each,,,
7675,1,"2017-09-20 03:53:49","Air Cleaner Components","Air Intake &amp; Fuel Systems",1,"2017-08-03 23:11:50","Air Intake &amp; Fuel Systems",7675,"2017-11-08 00:54:14","S&S Cycle Fast Idle Brass Washer","J&P Part: 562-365","Made in the USA",,,50-7007,Each,,,
7676,1,"2017-09-20 03:53:49","Air Cleaner Components","Air Intake &amp; Fuel Systems",1,"2017-08-03 23:11:50","Air Intake &amp; Fuel Systems",7676,"2017-11-08 00:54:14","J&P Cycles&reg; Keihin Intake Manifold Gasket","J&P Part: 432-325",,,,,Each,,,
7677,1,"2017-09-20 03:53:49","Air Cleaner Components","Air Intake &amp; Fuel Systems",1,"2017-08-03 23:11:50","Air Intake &amp; Fuel Systems",7677,"2017-11-08 00:54:14","V-Twin Manufacturing Carb Manifold Gasket","J&P Part: 401-617",,,Raw,,Each,,,
7678,1,"2017-09-20 03:53:49","Air Cleaner Components","Air Intake &amp; Fuel Systems",1,"2017-08-03 23:11:50","Air Intake &amp; Fuel Systems",7678,"2017-11-08 00:54:14","Genuine James Air Cleaner Gasket Paper with Adhesive","J&P Part: 171-931","Made in the USA",,,JGI-29058-77A,Each,,,
7679,1,"2017-09-20 03:53:49","Air Cleaner Components","Air Intake &amp; Fuel Systems",1,"2017-08-03 23:11:50","Air Intake &amp; Fuel Systems",7679,"2017-11-08 00:54:14","Genuine James Intake Manifold Gasket","J&P Part: 167-643","Made in the USA",,,JGI-27023-71,Each,,,
7680,1,"2017-09-20 03:53:49","Air Cleaner Components","Air Intake &amp; Fuel Systems",1,"2017-08-03 23:11:50","Air Intake &amp; Fuel Systems",7680,"2017-11-08 00:54:14","J&P Cycles&reg; Linkert Intake Manifold Gasket","J&P Part: 431-778",,,,,Each,,,
7681,1,"2017-09-20 03:53:49","Air Cleaner Components","Air Intake &amp; Fuel Systems",1,"2017-08-03 23:11:50","Air Intake &amp; Fuel Systems",7681,"2017-11-08 00:54:14","S&S Cycle Fast Idle Nylon Washer","J&P Part: 562-363","Made in the USA",,,50-7036,Each,,,
7682,1,"2017-09-20 03:53:49","Air Cleaner Components","Air Intake &amp; Fuel Systems",1,"2017-08-03 23:11:50","Air Intake &amp; Fuel Systems",7682,"2017-11-08 00:54:14","J&P Cycles&reg; Carburetor Adaptor O-ring","J&P Part: 400-491",,,,,Each,,,
7683,1,"2017-09-20 03:53:49","Air Cleaner Components","Air Intake &amp; Fuel Systems",1,"2017-08-03 23:11:50","Air Intake &amp; Fuel Systems",7683,"2017-11-08 00:54:14","J&P Cycles&reg; Induction Module-to-Backplate Gasket","J&P Part: 431-197",,,,,Each,,,
7684,1,"2017-09-20 03:53:49","Air Cleaner Components","Air Intake &amp; Fuel Systems",1,"2017-08-03 23:11:50","Air Intake &amp; Fuel Systems",7684,"2017-11-08 00:54:14","S&S Cycle Fast Idle Steel Washer","J&P Part: 562-364","Made in the USA",,,50-7037,Each,,,
7685,1,"2017-09-20 03:53:49","Air Cleaner Components","Air Intake &amp; Fuel Systems",1,"2017-08-03 23:11:50","Air Intake &amp; Fuel Systems",7685,"2017-11-08 00:54:14","Intake Manifold Gasket","J&P Part: 400-196",,,,,Each,,,
7686,1,"2017-09-20 03:53:49","Air Cleaner Components","Air Intake &amp; Fuel Systems",1,"2017-08-03 23:11:50","Air Intake &amp; Fuel Systems",7686,"2017-11-08 00:54:14","Kuryakyn Hypercharger Bracket","J&P Part: 400-287",,,Chrome,8344,,,,
7687,1,"2017-09-20 03:53:49","Air Cleaner Components","Air Intake &amp; Fuel Systems",1,"2017-08-03 23:11:50","Air Intake &amp; Fuel Systems",7687,"2017-11-08 00:54:14","Kuryakyn Hypercharger Bracket for Stock 38mm Carb or S&S B","J&P Part: 400-289",,,Chrome,8346,,,,
7688,1,"2017-09-20 03:53:49","Air Cleaner Components","Air Intake &amp; Fuel Systems",1,"2017-08-03 23:11:50","Air Intake &amp; Fuel Systems",7688,"2017-11-08 00:54:14","Kuryakyn Hypercharger Bracket","J&P Part: 400-292",,,Chrome,8349,,,,
7689,1,"2017-09-20 03:53:49","Air Cleaner Components","Air Intake &amp; Fuel Systems",1,"2017-08-03 23:11:50","Air Intake &amp; Fuel Systems",7689,"2017-11-08 00:54:14","Forcewinder XR-2 Air Cleaner Adaptor","J&P Part: 401-279","Made in the USA",,Polished,5011200SP,Each,,,
7690,1,"2017-09-20 03:53:49","Air Cleaner Components","Air Intake &amp; Fuel Systems",1,"2017-08-03 23:11:50","Air Intake &amp; Fuel Systems",7690,"2017-11-08 00:54:14","Kuryakyn Hypercharger Mounting Kit","J&P Part: 401-470",,,,8333,Kit,,,
7691,1,"2017-09-20 03:53:49","Air Cleaner Components","Air Intake &amp; Fuel Systems",1,"2017-08-03 23:11:50","Air Intake &amp; Fuel Systems",7691,"2017-11-08 00:54:14","Kuryakyn Hypercharger Mounting Kit","J&P Part: 401-472",,,,8335,Kit,,,
7692,1,"2017-09-20 03:53:49","Air Cleaner Components","Air Intake &amp; Fuel Systems",1,"2017-08-03 23:11:50","Air Intake &amp; Fuel Systems",7692,"2017-11-08 00:54:16","Kuryakyn Hypercharger Mounting Kit","J&P Part: 401-475",,,,8338,Kit,,,
7693,1,"2017-09-20 03:53:49","Air Cleaner Components","Air Intake &amp; Fuel Systems",1,"2017-08-03 23:11:50","Air Intake &amp; Fuel Systems",7693,"2017-11-08 00:54:16","Kuryakyn Hypercharger Mounting Kit","J&P Part: 401-479",,,,8342,Kit,,,
7694,1,"2017-09-20 03:53:49","Air Cleaner Components","Air Intake &amp; Fuel Systems",1,"2017-08-03 23:11:50","Air Intake &amp; Fuel Systems",7694,"2017-11-08 00:54:16","Lucky Dog Big Sucker Hardware","J&P Part: 402-699","Made in the USA",Wing-Nut,Chrome,,Each,,,
7695,1,"2017-09-20 03:53:49","Air Cleaner Components","Air Intake &amp; Fuel Systems",1,"2017-08-03 23:11:50","Air Intake &amp; Fuel Systems",7695,"2017-11-08 00:54:16","Cometic Gaskets Induction Module Gasket","J&P Part: 431-248","Made in the USA",,,3094-0098,Each,,,
7696,1,"2017-09-20 03:53:49","Air Cleaner Components","Air Intake &amp; Fuel Systems",1,"2017-08-03 23:11:50","Air Intake &amp; Fuel Systems",7696,"2017-11-08 00:54:16","S&S Cycle Fast Action Friction Washer","J&P Part: 562-362","Made in the USA",,,50-7035,Each,,,
7697,1,"2017-09-20 03:53:49","Air Cleaner Components","Air Intake &amp; Fuel Systems",1,"2017-08-03 23:11:50","Air Intake &amp; Fuel Systems",7697,"2017-11-08 00:54:16","S&S Cycle Air Cleaner Mounting Hardware Package","J&P Part: 972-269",,,,17-0458,Kit,,,
7698,1,"2017-09-20 03:53:49","Air Cleaner Components","Air Intake &amp; Fuel Systems",1,"2017-08-03 23:11:50","Air Intake &amp; Fuel Systems",7698,"2017-11-08 00:54:16","V-Twin Manufacturing J-Slot Air Cleaner Backing Plate","J&P Part: 400-133",,J-Slot,Chrome,,Each,,,
7699,1,"2017-09-20 03:53:49","Air Cleaner Components","Air Intake &amp; Fuel Systems",1,"2017-08-03 23:11:50","Air Intake &amp; Fuel Systems",7699,"2017-11-08 00:54:16","Twin Power HSR42 Carb 2-Bolt Manifold Adaptor","J&P Part: 403-909","Made in the USA",,,3150,Each,,,
7700,1,"2017-09-20 03:53:49","Air Cleaner Components","Air Intake &amp; Fuel Systems",1,"2017-08-03 23:11:50","Air Intake &amp; Fuel Systems",7700,"2017-11-08 00:54:16","Air Cleaner Adapter Plate","J&P Part: 404-416",,,,,Each,,,
7701,1,"2017-09-20 03:53:49","Air Cleaner Components","Air Intake &amp; Fuel Systems",1,"2017-08-03 23:11:50","Air Intake &amp; Fuel Systems",7701,"2017-11-08 00:54:16","Air Cleaner Adapter and Bracket","J&P Part: ZZ40920","Made in the USA",,"Chrome Air Cleaner Adapter, Black Powder-Coated Bracket",C1627-C,Kit,,,
7702,1,"2017-09-20 03:53:49","Air Cleaner Components","Air Intake &amp; Fuel Systems",1,"2017-08-03 23:11:50","Air Intake &amp; Fuel Systems",7702,"2017-11-08 00:54:16","Wimmer Custom Cycle Replacement Trim Ring","J&P Part: 424-718","Made in the USA",,Chrome,W10-002,Each,,,
7703,1,"2017-09-20 03:53:49","Air Cleaner Components","Air Intake &amp; Fuel Systems",1,"2017-08-03 23:11:50","Air Intake &amp; Fuel Systems",7703,"2017-11-08 00:54:16","V-Twin Manufacturing J-Slot Air Cleaner Cover Spring","J&P Part: 400-121",,J-Slot,Raw,,Each,,,
7704,1,"2017-09-20 03:53:49","Air Cleaner Components","Air Intake &amp; Fuel Systems",1,"2017-08-03 23:11:50","Air Intake &amp; Fuel Systems",7704,"2017-11-08 00:54:16","Chrome Air Cleaner Screws","J&P Part: 400-180","Made in the USA",Acorn,Chrome,7206-2,2-pk,,,
7705,1,"2017-09-20 03:53:49","Air Cleaner Components","Air Intake &amp; Fuel Systems",1,"2017-08-03 23:11:50","Air Intake &amp; Fuel Systems",7705,"2017-11-08 00:54:16","S&S Cycle Silicone Coated Steel Washer","J&P Part: 363-525",,,,50-7054,Kit,,,
7706,1,"2017-09-20 03:53:49","Air Cleaner Components","Air Intake &amp; Fuel Systems",1,"2017-08-03 23:11:50","Air Intake &amp; Fuel Systems",7706,"2017-11-08 00:54:16","S&S Cycle Shim","J&P Part: 533-525",,,,50-7027,Each,,,
7707,1,"2017-09-20 03:53:49","Air Cleaner Components","Air Intake &amp; Fuel Systems",1,"2017-08-03 23:11:50","Air Intake &amp; Fuel Systems",7707,"2017-11-08 00:54:16","Original Air Filter Backing Plate","J&P Part: 400-097",,,,,Each,,,
7708,1,"2017-09-20 03:53:49","Air Cleaner Components","Air Intake &amp; Fuel Systems",1,"2017-08-03 23:11:50","Air Intake &amp; Fuel Systems",7708,"2017-11-08 00:54:16","V-Twin Manufacturing Maltese Cross Velocity Stack Replacement Screws","J&P Part: 401-703",,Replacement,Chrome,,3-pk,,,
7709,1,"2017-09-20 03:53:49","Air Cleaner Components","Air Intake &amp; Fuel Systems",1,"2017-08-03 23:11:50","Air Intake &amp; Fuel Systems",7709,"2017-11-08 00:54:16","Chrome Air Cleaner Screws","J&P Part: 401-675","Made in the USA",Cap,Chrome,8461-2,Kit,,,
7710,1,"2017-09-20 03:53:49","Air Cleaner Components","Air Intake &amp; Fuel Systems",1,"2017-08-03 23:11:50","Air Intake &amp; Fuel Systems",7710,"2017-11-08 00:54:16","S&S Cycle Mounting Bolt Hex 5/16&Prime; -18 X 1-1/4&Prime;","J&P Part: 533-524",,,,50-0110,Each,,,
7711,1,"2017-09-20 03:53:49","Air Cleaner Components","Air Intake &amp; Fuel Systems",1,"2017-08-03 23:11:50","Air Intake &amp; Fuel Systems",7711,"2017-11-08 00:54:16","S&S Cycle 1/4-20 x .825&Prime; Backing Plate Screw","J&P Part: 722-283",,,Chrome,500-0059,Each,,,
7712,1,"2017-09-20 03:53:49","Air Cleaner Components","Air Intake &amp; Fuel Systems",1,"2017-08-03 23:11:50","Air Intake &amp; Fuel Systems",7712,"2017-11-08 00:54:16","S&S Cycle Classic Teardrop Air Cleaner Mounting Hardware Kit","J&P Part: 723-278","Made in the USA",,,106-0838,Kit,,,
7713,1,"2017-09-20 03:53:49","Air Cleaner Components","Air Intake &amp; Fuel Systems",1,"2017-08-03 23:11:50","Air Intake &amp; Fuel Systems",7713,"2017-11-08 00:54:16","Wimmer Mikuni Conversion Kit","J&P Part: 402-560","Made in the USA",,Chrome,W06-015W04-013,Each,,,
7714,1,"2017-09-20 03:53:49","Air Cleaner Components","Air Intake &amp; Fuel Systems",1,"2017-08-03 23:11:50","Air Intake &amp; Fuel Systems",7714,"2017-11-08 00:54:16","TC Bros. Choppers Air Cleaner/Carb Support Bracket","J&P Part: 744-484","Made in the USA",,"Black Powder Coat",109-0083,Each,,,
7715,1,"2017-09-20 03:53:49","Air Cleaner Components","Air Intake &amp; Fuel Systems",1,"2017-08-03 23:11:50","Air Intake &amp; Fuel Systems",7715,"2017-11-08 00:54:16","Colony Air Cleaner Cover Mount Kit","J&P Part: 400-732","Made in the USA",,Chrome,9957-2,Each,,,
7716,1,"2017-09-20 03:53:49","Air Cleaner Components","Air Intake &amp; Fuel Systems",1,"2017-08-03 23:11:50","Air Intake &amp; Fuel Systems",7716,"2017-11-08 00:54:19","Genuine James FOAMET Air Cleaner Gasket","J&P Part: 833-307","Made in the USA",,,JGI-29059-88-F,,,,
7717,1,"2017-09-20 03:53:49","Air Cleaner Components","Air Intake &amp; Fuel Systems",1,"2017-08-03 23:11:50","Air Intake &amp; Fuel Systems",7717,"2017-11-08 00:54:19","Genuine James Map Sensor Seal","J&P Part: 833-248","Made in the USA",,,JGI-11291,,,,
7718,1,"2017-09-20 03:53:49","Air Cleaner Components","Air Intake &amp; Fuel Systems",1,"2017-08-03 23:11:50","Air Intake &amp; Fuel Systems",7718,"2017-11-08 00:54:19","Genuine James Air Cleaner Gasket","J&P Part: 833-308","Made in the USA",,,JGI-29095-95,,,,
7719,1,"2017-09-20 03:53:49","Air Cleaner Components","Air Intake &amp; Fuel Systems",1,"2017-08-03 23:11:50","Air Intake &amp; Fuel Systems",7719,"2017-11-08 00:54:19","Genuine James FOAMET Air Cleaner Backplate Gasket","J&P Part: 833-309","Made in the USA",,,JGI-29241-08-F,,,,
7720,1,"2017-09-20 03:53:49","Air Cleaner Components","Air Intake &amp; Fuel Systems",1,"2017-08-03 23:11:50","Air Intake &amp; Fuel Systems",7720,"2017-11-08 00:54:19","Mikuni Airbox Mounting Screws","J&P Part: 400-247",,"Button Head",Chrome,"HS42/002 (3PACK)",Each,,,
25,2,"2017-09-20 03:54:02","Air Cleaner Cover Inserts","Air Intake &amp; Fuel Systems",1,"2017-08-03 23:11:50","Air Intake &amp; Fuel Systems",25,"2017-11-07 22:17:46","Jack Daniel&rsquo;s Chrome and Black 5-bolt Air Cleaner Insert","J&P Part: 106-282",,,Chrome/Paint,38-195,Each,,,
26,2,"2017-09-20 03:54:02","Air Cleaner Cover Inserts","Air Intake &amp; Fuel Systems",1,"2017-08-03 23:11:50","Air Intake &amp; Fuel Systems",26,"2017-11-07 22:17:46","Vance & Hines VO2 Skullcap Crown Air Cleaner Insert Chrome","J&P Part: 564-234","Made in the USA",Crown,,71017,Each,,,
27,2,"2017-09-20 03:54:02","Air Cleaner Cover Inserts","Air Intake &amp; Fuel Systems",1,"2017-08-03 23:11:50","Air Intake &amp; Fuel Systems",27,"2017-11-07 22:17:46","Vance & Hines VO2 Skullcap Crown Air Cleaner Insert Black","J&P Part: 564-235","Made in the USA",Crown,,71019,Each,,,
28,2,"2017-09-20 03:54:02","Air Cleaner Cover Inserts","Air Intake &amp; Fuel Systems",1,"2017-08-03 23:11:50","Air Intake &amp; Fuel Systems",28,"2017-11-07 22:17:46","Jack Daniel&rsquo;s Black Wrinkle 5-bolt Air Cleaner Insert","J&P Part: 106-283",,,"Powder Coated",38-196,Each,,,
29,2,"2017-09-20 03:54:02","Air Cleaner Cover Inserts","Air Intake &amp; Fuel Systems",1,"2017-08-03 23:11:50","Air Intake &amp; Fuel Systems",29,"2017-11-07 22:17:46","Chrome Dome Flaming Skull Air Cleaner Insert","J&P Part: 402-644","Made in the USA","Flaming Skull",Polished,ISTC-1,Each,,,
30,2,"2017-09-20 03:54:02","Air Cleaner Cover Inserts","Air Intake &amp; Fuel Systems",1,"2017-08-03 23:11:50","Air Intake &amp; Fuel Systems",30,"2017-11-07 22:17:46","Vance & Hines VO2 Skullcap Crown Air Cleaner Insert Chrome","J&P Part: 404-538","Made in the USA",,Chrome,71013,Each,,,
31,2,"2017-09-20 03:54:02","Air Cleaner Cover Inserts","Air Intake &amp; Fuel Systems",1,"2017-08-03 23:11:50","Air Intake &amp; Fuel Systems",31,"2017-11-07 22:17:46","Vance & Hines VO2 Skullcap Crown Air Cleaner Insert Black","J&P Part: 404-539","Made in the USA",,,71015,Each,,,
32,2,"2017-09-20 03:54:02","Air Cleaner Cover Inserts","Air Intake &amp; Fuel Systems",1,"2017-08-03 23:11:50","Air Intake &amp; Fuel Systems",32,"2017-11-07 22:17:46","Chrome Dome Flaming Skull Air Cleaner Insert","J&P Part: 402-676","Made in the USA","Flaming Skull",Polished,ISK-2,Each,,,
33,2,"2017-09-20 03:54:02","Air Cleaner Cover Inserts","Air Intake &amp; Fuel Systems",1,"2017-08-03 23:11:50","Air Intake &amp; Fuel Systems",33,"2017-11-07 22:17:46","Chrome Dome Medicine Wheel Air Cleaner Insert","J&P Part: 402-988","Made in the USA","Medicine Wheel",Polished,IFTC-1,Each,,,
34,2,"2017-09-20 03:54:02","Air Cleaner Cover Inserts","Air Intake &amp; Fuel Systems",1,"2017-08-03 23:11:50","Air Intake &amp; Fuel Systems",34,"2017-11-07 22:17:46","Crusher Black Maverick Air Cleaner Trim","J&P Part: 803-485",,,,9239,Each,,,
35,2,"2017-09-20 03:54:02","Air Cleaner Cover Inserts","Air Intake &amp; Fuel Systems",1,"2017-08-03 23:11:50","Air Intake &amp; Fuel Systems",35,"2017-11-07 22:17:46","Drag Specialties 5-Bolt Domed Air Cleaner Insert","J&P Part: 4000284",,"5-Bolt Domed",Chrome,14-0210-SC4,Each,,,
36,2,"2017-09-20 03:54:02","Air Cleaner Cover Inserts","Air Intake &amp; Fuel Systems",1,"2017-08-03 23:11:50","Air Intake &amp; Fuel Systems",36,"2017-11-07 22:17:46","J&P Cycles &lsquo;Live to Ride Ride to Live Eagle-Spirit&rsquo; Air Cleaner Insert","J&P Part: 4000145",,8&Prime;,Chrome,,Each,,,
37,2,"2017-09-20 03:54:02","Air Cleaner Cover Inserts","Air Intake &amp; Fuel Systems",1,"2017-08-03 23:11:50","Air Intake &amp; Fuel Systems",37,"2017-11-07 22:17:46","J&P Cycles&reg; &lsquo;Live to Ride&rsquo; Air Cleaner Insert","J&P Part: 4000320",,"Live to Ride",Chrome,,Each,,,
38,2,"2017-09-20 03:54:02","Air Cleaner Cover Inserts","Air Intake &amp; Fuel Systems",1,"2017-08-03 23:11:50","Air Intake &amp; Fuel Systems",38,"2017-11-07 22:17:46","&lsquo;Live to Ride&rsquo; Air Cleaner Insert","J&P Part: 4000315",,"Live to Ride","Chrome with Gold",,Each,,,
39,2,"2017-09-20 03:54:02","Air Cleaner Cover Inserts","Air Intake &amp; Fuel Systems",1,"2017-08-03 23:11:50","Air Intake &amp; Fuel Systems",39,"2017-11-07 22:17:46","Chrome Dome Screaming Eagle with Flame Hood Air Cleaner Insert","J&P Part: 402-675","Made in the USA","Screaming Eagle with Flames",Polished,IEF-1,Each,,,
40,2,"2017-09-20 03:54:02","Air Cleaner Cover Inserts","Air Intake &amp; Fuel Systems",1,"2017-08-03 23:11:50","Air Intake &amp; Fuel Systems",40,"2017-11-07 22:17:46","Chrome Dome Spanish Cross Air Cleaner Insert","J&P Part: 714-699","Made in the USA","Spanish Cross","Aged Aluminum",ICATC-1,Each,,,
41,2,"2017-09-20 03:54:02","Air Cleaner Cover Inserts","Air Intake &amp; Fuel Systems",1,"2017-08-03 23:11:50","Air Intake &amp; Fuel Systems",41,"2017-11-07 22:17:46","Kuryakyn Lighted Velocity Ring","J&P Part: 805-970",,"Velocity Ring",7-Color,5068,Each,,,
42,2,"2017-09-20 03:54:02","Air Cleaner Cover Inserts","Air Intake &amp; Fuel Systems",1,"2017-08-03 23:11:50","Air Intake &amp; Fuel Systems",42,"2017-11-07 22:17:46","Kuryakyn Hyper Charger Chrome Clear Trap Door","J&P Part: 834-275",,,Chrome,8746,Each,,,
43,2,"2017-09-20 03:54:02","Air Cleaner Cover Inserts","Air Intake &amp; Fuel Systems",1,"2017-08-03 23:11:50","Air Intake &amp; Fuel Systems",43,"2017-11-07 22:17:46","Chrome Dome Liberty Eagle Air Cleaner Insert","J&P Part: 402-946","Made in the USA","Liberty Eagle",Polished,ILTC-01,Each,,,
44,2,"2017-09-20 03:54:02","Air Cleaner Cover Inserts","Air Intake &amp; Fuel Systems",1,"2017-08-03 23:11:50","Air Intake &amp; Fuel Systems",44,"2017-11-07 22:17:46","Vance & Hines VO2 Skullcap Crown Air Cleaner Insert Matte Chrome","J&P Part: 105-355","Made in the USA",Crown,"Matte Chrome",71025,Each,,,
45,2,"2017-09-20 03:54:02","Air Cleaner Cover Inserts","Air Intake &amp; Fuel Systems",1,"2017-08-03 23:11:50","Air Intake &amp; Fuel Systems",45,"2017-11-07 22:17:46","Kuryakyn Black Spikes for Mach 2 Air Cleaners","J&P Part: 362-671",,,,9556,5-pc,,,
46,2,"2017-09-20 03:54:02","Air Cleaner Cover Inserts","Air Intake &amp; Fuel Systems",1,"2017-08-03 23:11:50","Air Intake &amp; Fuel Systems",46,"2017-11-07 22:17:46","Chrome Dome Spanish Cross Air Cleaner Insert","J&P Part: 402-989","Made in the USA","Spanish Cross",Polished,ICTC-1,Each,,,
47,2,"2017-09-20 03:54:02","Air Cleaner Cover Inserts","Air Intake &amp; Fuel Systems",1,"2017-08-03 23:11:50","Air Intake &amp; Fuel Systems",47,"2017-11-07 22:17:46","Chrome Dome Native Spirit Insert","J&P Part: 505-414",,"Native Spirit",Mirror,INSTC-1,Each,,,
48,2,"2017-09-20 03:54:02","Air Cleaner Cover Inserts","Air Intake &amp; Fuel Systems",1,"2017-08-03 23:11:50","Air Intake &amp; Fuel Systems",48,"2017-11-07 22:17:46","Crusher Chrome Maverick Air Cleaner Trim","J&P Part: 803-484",,,,9238,Each,,,
7721,2,"2017-09-20 03:54:02","Air Cleaner Cover Inserts","Air Intake &amp; Fuel Systems",1,"2017-08-03 23:11:50","Air Intake &amp; Fuel Systems",7721,"2017-11-08 00:54:21","MotorDog69 Black Set Screw Air Cleaner Coin Mount with ""Don't Tread on Me"" Coin","J&P Part: 164-286","Made in the USA",,Painted,SS-B-ACM-DTOM,Each,,,
7722,2,"2017-09-20 03:54:02","Air Cleaner Cover Inserts","Air Intake &amp; Fuel Systems",1,"2017-08-03 23:11:50","Air Intake &amp; Fuel Systems",7722,"2017-11-08 00:54:21","Kuryakyn Hypercharger Chrome Butterflies","J&P Part: 400-355",,,Chrome,8488,Pair,,,
7723,2,"2017-09-20 03:54:02","Air Cleaner Cover Inserts","Air Intake &amp; Fuel Systems",1,"2017-08-03 23:11:50","Air Intake &amp; Fuel Systems",7723,"2017-11-08 00:54:21","Kuryakyn Chrome Spikes for Mach 2 Air Cleaners","J&P Part: 135-231",,,Chrome,9557,5-pc,,,
7724,2,"2017-09-20 03:54:02","Air Cleaner Cover Inserts","Air Intake &amp; Fuel Systems",1,"2017-08-03 23:11:50","Air Intake &amp; Fuel Systems",7724,"2017-11-08 00:54:21","Motordog69 Air Cleaner Cover Challenge Coin Mount","J&P Part: 445-524","Made in the USA",,Chrome,SS-ACM-1.8,Each,,,
7725,2,"2017-09-20 03:54:02","Air Cleaner Cover Inserts","Air Intake &amp; Fuel Systems",1,"2017-08-03 23:11:50","Air Intake &amp; Fuel Systems",7725,"2017-11-08 00:54:21","Kuryakyn Zombie Interchangeable Medallion","J&P Part: 402-357",,Zombie,Chrome,3797,Each,,,
7726,2,"2017-09-20 03:54:02","Air Cleaner Cover Inserts","Air Intake &amp; Fuel Systems",1,"2017-08-03 23:11:50","Air Intake &amp; Fuel Systems",7726,"2017-11-08 00:54:21","CAT LLC POW Air Cleaner Cover Insert","J&P Part: 603-531",,POW,Chrome,,Each,,,
7727,2,"2017-09-20 03:54:02","Air Cleaner Cover Inserts","Air Intake &amp; Fuel Systems",1,"2017-08-03 23:11:50","Air Intake &amp; Fuel Systems",7727,"2017-11-08 00:54:21","Kuryakyn Hyper Charger Gloss Black Clear Trap Door","J&P Part: 834-276",,,"Gloss Black",8747,Each,,,
7728,2,"2017-09-20 03:54:02","Air Cleaner Cover Inserts","Air Intake &amp; Fuel Systems",1,"2017-08-03 23:11:50","Air Intake &amp; Fuel Systems",7728,"2017-11-08 00:54:21","Chrome Dome Screaming Eagle Air Cleaner Insert","J&P Part: 402-678","Made in the USA","Screaming Eagle",Polished,IE-1,Each,,,
7729,2,"2017-09-20 03:54:02","Air Cleaner Cover Inserts","Air Intake &amp; Fuel Systems",1,"2017-08-03 23:11:50","Air Intake &amp; Fuel Systems",7729,"2017-11-08 00:54:21","MotorDog69 Black Set Screw Air Cleaner Coin Mount with ""Thank You Troops"" Coin","J&P Part: 164-308","Made in the USA",,Painted,SS-B-ACM-THANK,Each,,,
7730,2,"2017-09-20 03:54:02","Air Cleaner Cover Inserts","Air Intake &amp; Fuel Systems",1,"2017-08-03 23:11:50","Air Intake &amp; Fuel Systems",7730,"2017-11-08 00:54:21","MotorDog69 Black Set Screw Air Cleaner Coin Mount with ""POW/MIA"" Coin","J&P Part: 164-296","Made in the USA",,Painted,SS-B-ACM-POW-MIA,Each,,,
7731,2,"2017-09-20 03:54:02","Air Cleaner Cover Inserts","Air Intake &amp; Fuel Systems",1,"2017-08-03 23:11:50","Air Intake &amp; Fuel Systems",7731,"2017-11-08 00:54:21","Joker Machine Air Cleaner Insert for Evolution Round Air Cleaners","J&P Part: 400-688","Made in the USA",Evolution,Chrome,921127FC,Each,,,
7732,2,"2017-09-20 03:54:02","Air Cleaner Cover Inserts","Air Intake &amp; Fuel Systems",1,"2017-08-03 23:11:50","Air Intake &amp; Fuel Systems",7732,"2017-11-08 00:54:21","Kuryakyn Hypercharger Chrome Trap door","J&P Part: 400-350",,,Chrome,8482,Each,,,
7733,2,"2017-09-20 03:54:02","Air Cleaner Cover Inserts","Air Intake &amp; Fuel Systems",1,"2017-08-03 23:11:50","Air Intake &amp; Fuel Systems",7733,"2017-11-08 00:54:21","Jack Daniel&rsquo;s Chrome 5-bolt Air Cleaner Insert","J&P Part: 106-281",,,Chrome,38-194,Each,,,