motorcycle_part.id,motorcycle_part.ts,motorcycle_part.title,motorcycle_part.model_parameters,motorcycle_part.producting_area,motorcycle_part.designer,motorcycle_part.finish,motorcycle_part.manufacturer_part_number,motorcycle_part.sold_in_units,motorcycle_part.price,motorcycle_part.review,motorcycle_part.content_description
101,"2017-11-07 22:17:54","Milwaukee Twins Air Filter for S&S 'E' and 'G' Air Cleaners","J&P Part: 401-980","Made in the USA",,,,Each,,,
102,"2017-11-07 22:17:54","Arlen Ness Stage I Standard Replacement Air Filter",,,,Pre-oiled,18-098,Each,,,
103,"2017-11-07 22:17:54","Replacement Air Cleaner Filter","J&P Part: 400-0114",,,,,Each,,,
104,"2017-11-07 22:17:54","Vance & Hines VO2 Replacement Air Filter","J&P Part: 693-535",,,,D100FL-R,Each,,,
105,"2017-11-07 22:17:54","K&N High Performance Replacement Air Filter for Screamin' Eagle","J&P Part: 402-967","Made in the USA",,Pre-oiled,HD-0818,Each,,,
106,"2017-11-07 22:17:54","Kuryakyn Hypercharger Filter Element","J&P Part: 400-878",,,,8513,Each,,,
107,"2017-11-07 22:17:54","S&S Cycle Air Cleaner Element","J&P Part: ZZ41242","Made in the USA",Teardrop,,106-4722,Each,,,
108,"2017-11-07 22:17:54","UNI High Performance Foam Air Filter Element","J&P Part: 4000342",,,Dry,NU-3426,Each,,,
109,"2017-11-07 22:17:54","S&S Cycle Replacement High Flow and Adapter Kit for S&S &lsquo;E&rsquo; and &lsquo;G&rsquo; carbs","J&P Part: 401-271","Made in the USA",,,17-0045,Kit,,,
110,"2017-11-07 22:17:54","K&N High Performance Replacement Air Filter for Screamin' Eagle","J&P Part: 362-829","Made in the USA",,Pre-oiled,HD-0910,Each,,,
111,"2017-11-07 22:17:54","EMGO Universal Clamp-On Air Filter 54mm","J&P Part: ZZ33441",,,Chrome,12-55754,Each,,,
112,"2017-11-07 22:17:54","BikeMaster Air Filter",,,,,ZUTR-HA007,Each,,,
113,"2017-11-07 22:17:54","V-Twin Manufacturing Washable Gauze Replacement Air Filter","J&P Part: 401-590",,,Pre-oiled,,Each,,,
114,"2017-11-07 22:17:54","Arlen Ness Pre-Filter for Big Sucker Air Cleaners","J&P Part: 400-844",,,,18-060,Each,,,
115,"2017-11-07 22:17:54","Milwaukee Twins Air Filter for Screamin' Eagle","J&P Part: 401-991","Made in the USA",,,,Each,,,
116,"2017-11-07 22:17:54","K&N Drycharger Sock for K&N Aircharger Performance Intakes","J&P Part: 402-713",,,,RC-3680DK,Each,,,
117,"2017-11-07 22:17:54","K&N RK Series Air Filter Kit",,"Made in the USA","High Performance Upgrade",Pre-oiled,RT-3910,Each,,,
118,"2017-11-07 22:17:54","Kuryakyn Pro-Series Hypercharger Replacement Filter","J&P Part: 400-581",,,,9493,Each,,,
119,"2017-11-07 22:17:54","Arlen Ness Ram-Air Intake for Steel Frame Models","J&P Part: 162-948","Made in the USA",,,V-5153,Each,,,
120,"2017-11-07 22:17:54","K&N High Performance Replacement Air Filter for Round Air Cleaners",,"Made in the USA",,Pre-oiled,E-2470,Each,,,
121,"2017-11-07 22:18:00","V-Twin Manufacturing Chrome Engine Breather Oil Collector","J&P Part: 804-110",,,Chrome,40-0595,Kit,,,
122,"2017-11-07 22:18:00","J&P Cycles&reg; Chrome Crankcase Breather Kit","J&P Part: 4000305",,,Chrome,,Kit,,,
123,"2017-11-07 22:18:00","J&P Cycles&reg; Braided Hose Crankcase Breather Kit","J&P Part: 4000380",,,Chrome,,Kit,,,
124,"2017-11-07 22:18:00","J&P Cycles&reg; Dual Breather Kit","J&P Part: 4000420",,,Chrome,,Kit,,,
125,"2017-11-07 22:18:00","Kuryakyn Bluegrass Crankcase Breather Catch Can","J&P Part: 401-722",,,Chrome,9931,Each,,,
126,"2017-11-07 22:18:00","J&P Cycles&reg; Crankcase Breather Kit","J&P Part: 4000330",,,Chrome,,Kit,,,
127,"2017-11-07 22:18:00","J&P Cycles&reg; Crankcase Breather Kit","J&P Part: 4000267",,,Chrome,,Kit,,,
128,"2017-11-07 22:18:00","J&P Cycles&reg; Custom Breather Bolt Kit","J&P Part: 4000310",,,Chrome,,Each,,,
129,"2017-11-07 22:18:00","J&P Cycles&reg; Crankcase Breather Kit","J&P Part: 4000283",,,Chrome,,,,,
130,"2017-11-07 22:18:00","S&S Breather Conversion Kit","J&P Part: 404-364",,,,17-0486,,,,
131,"2017-11-07 22:18:00","Kuryakyn Breather hoses","J&P Part: 401-719",,,,9977,Set,,,
132,"2017-11-07 22:18:00","Kuryakyn Bluegrass Crankcase Breather Kit","J&P Part: 401-721",,,Chrome,9932,Kit,,,
133,"2017-11-07 22:18:00","V-Twin Manufacturing Breather Bolts","J&P Part: 241-200",,,,,Pair,,,
134,"2017-11-07 22:18:00","Chrome Cut-To-Lenght Breather Bolt Kit","J&P Part: 402-333",,,,,Pair,,,
135,"2017-11-07 22:18:00","Kuryakyn Replacement Breather Boots & Hoses","J&P Part: 404-368",,,,8999,Kit,,,
136,"2017-11-07 22:18:00","Lowbrow Customs Chrome Radius Breather Bolts","J&P Part: 974-157","Made in the USA",,Chrome,003736,Pair,,,
137,"2017-11-07 22:18:00","Wimmer Custom Cycles Breather System","J&P Part: 402-916",,,Chrome,IBS-C,Each,,,
138,"2017-11-07 22:18:00","J&P Cycles&reg; Breather Bolt Washer Kit","J&P Part: 401-688",,,,,Kit,,,
139,"2017-11-07 22:18:00","Kuryakyn Breather bolts","J&P Part: 401-718",,,,9976,Pair,,,
140,"2017-11-07 22:18:00","V-Twin Manufacturing Breather Valve Thrust Washer Set","J&P Part: 430-360",,,,,"4-pc Set",,,
141,"2017-11-07 22:18:00","Kuryakyn Bluegrass Crankcase Breather Kit for models w/ Mikuni HSR Carbs","J&P Part: 401-720",,,Chrome,9930,Kit,,,
142,"2017-11-07 22:18:00","Baron Custom Accessories Reed Valve Block-Off Kit","J&P Part: ZZ40526","Made in the USA",,Painted,BA-2561-00,Kit,,,
143,"2017-11-07 22:18:00","S&S Cycle Breather Washer","J&P Part: 404-441",,,,50-7059,10-pk,,,
144,"2017-11-07 22:18:00","Baron Custom Accessories Air Injection Removal Kit","J&P Part: ZZ40311","Made in the USA",,Painted,BA-2551-00,Kit,,,
145,"2017-11-07 22:18:06","S&S Cycle Super &lsquo;E&rsquo; and &lsquo;G&rsquo; Carburetor Cable Guide Assembly","J&P Part: 400-684",,,,11-2338P,Each,,,
146,"2017-11-07 22:18:06","CV Performance Stainless Choke Bracket","J&P Part: 402-702","Made in the USA",,,,Each,,,
147,"2017-11-07 22:18:06","S&S Cycle Super &lsquo;E&rsquo; and &lsquo;G&rsquo; Carburetor Cable Guide Assembly","J&P Part: 400-230",,,Chrome,11-2339P,Each,,,
148,"2017-11-07 22:18:06","J&P Cycles&reg; Throttle Cable Support Bracket","J&P Part: 5200025",,,Chrome,,Each,,,
149,"2017-11-07 22:18:06","S&S Cycle Cruise Control Bracket","J&P Part: 400-804","Made in the USA",,Chrome,11-2927,Each,,,
150,"2017-11-07 22:18:06","Rivera Primo Cruise Control Bracket for Mikuni","J&P Part: 175-772","Made in the USA",,,3042-0004,Kit,,,
151,"2017-11-07 22:18:06","S&S Cycle Fast Idle Lever","J&P Part: 404-390","Made in the USA",,,17-0329,Each,,,
152,"2017-11-07 22:18:06","Colony Throttle Cable Clip","J&P Part: 401-069","Made in the USA",,Parkerized,9006-4,Each,,,
153,"2017-11-07 22:18:06","Throttle and Spark Cable Bracket","J&P Part: 401-068","Made in the USA",,Parkerized,9007-2,Each,,,
154,"2017-11-07 22:18:06","Throttle Cable Bracket","J&P Part: 401-160","Made in the USA",,Parkerized,9005-4,Each,,,
155,"2017-11-07 22:18:06","Cable Bracket for SU Carb","J&P Part: 400-444",,,Chrome,1042-0202,,,,
156,"2017-11-07 22:18:06","SU Throttle Cable Holder","J&P Part: 400-445",,,Chrome,1042-0203,,,,
157,"2017-11-07 22:18:06","Throttle Cable Bracket","J&P Part: 400-186","Made in the USA",,Parkerized,9008-5,Each,,,
158,"2017-11-07 22:18:06","West-Eagle Choke Cable Relocation Bracket","J&P Part: 212-683",,,"Matte Black",,Each,,,
159,"2017-11-07 22:18:06","Cable Pull Bracket for SU Carb","J&P Part: 400-443",,,,1042-0572,,,,
160,"2017-11-07 22:18:06","V-Twin Manufacturing Throttle Lever Bracket","J&P Part: 401-006",,,Raw,,Each,,,
161,"2017-11-07 22:18:06","V-Twin Manufacturing Throttle Cable Bracket","J&P Part: 401-655","Made in the USA",,Parkerized,,Each,,,
162,"2017-11-07 22:18:06","Todd&rsquo;s Cycle Choke Relocation Bracket","J&P Part: 400-0088","Made in the USA",,Ball-Burnished,MKE-1,Each,,,
163,"2017-11-07 22:18:07","J&P Cycles&reg; Replacement CV Carb Vacuum Piston","J&P Part: 401-209",,,,,Each,,,
164,"2017-11-07 22:18:07","Choke Cable Assembly for Keihin CV Carb","J&P Part: 5200366",,,,,assembly,,,
165,"2017-11-07 22:18:07","Mikuni Choke Cable","J&P Part: 400-243",,,,990-662-002,Each,,,
166,"2017-11-07 22:18:07","S&S Float","J&P Part: 400-895",,,,11-2187,Each,,,
167,"2017-11-07 22:18:07","J&P Cycles&reg; Keihin CV and Butterfly Carb Brass Fuel Inlet","J&P Part: 7500195",,,,,Each,,,
168,"2017-11-07 22:18:07","S&S Cycle Carburetor Bowl Assembly","J&P Part: 404-498",,,,11-2388P,Each,,,
169,"2017-11-07 22:18:07","J&P Cycles&reg; Choke Cable","J&P Part: 5200314",,,Black,,Each,,,
170,"2017-11-07 22:18:07","S&S Cycle Float Needle","J&P Part: 401-495",,,,11-2195,Each,,,
171,"2017-11-07 22:18:07","Boyesen Twinshot Adjustable Fuel Control for CV Carb","J&P Part: 404-516","Made in the USA",,,FB-03,Kit,,,
172,"2017-11-07 22:18:07","Fuel Fitting 90&deg; Needle Seat for Super &lsquo;E&rsquo;/&lsquo;G&rsquo;","J&P Part: 404-454",,,,106-2011,Each,,,
173,"2017-11-07 22:18:07","CV Performance Fuel Max Inlet","J&P Part: 504-461","Made in the USA",,,CVP-MAXINLET,Each,,,
174,"2017-11-07 22:18:07","J&P Cycles&reg; Keihin CV Carb Bolt Kit","J&P Part: 4000425",,,Chrome,,Kit,,,
175,"2017-11-07 22:18:07","Boyesen Power X-Wing for OEM CV Carb","J&P Part: 401-977","Made in the USA",,,PX-HCV-40,Each,,,
176,"2017-11-07 22:18:07","CV Performance Air Idle Mixture Needle Repacking Kit","J&P Part: 401-340",,,,,Kit,,,
177,"2017-11-07 22:18:07","S&S Cycle Accelerator Pump Diaphragm","J&P Part: 401-499",,,,11-2282,Each,,,
178,"2017-11-07 22:18:07","Drag Specialties Carburetor Choke Cable","J&P Part: 400-934",,,,29229-88D,Each,,,
179,"2017-11-07 22:18:07","CV Performance Velocity Tube","J&P Part: 402-825","Made in the USA",,,,Each,,,
180,"2017-11-07 22:18:07","S&S Cycle Float Bowl Only","J&P Part: 401-511",,,,11-2388,Each,,,
181,"2017-11-07 22:18:07","S&S Float Bowl Gasket","J&P Part: 401-020",,,,11-2386,Each,,,
182,"2017-11-07 22:18:07","V-Twin Manufacturing Choke Cable and Tube Assembly","J&P Part: 400-937",,,,,assembly,,,
183,"2017-11-07 22:18:07","V-Twin Manufacturing Float bowl","J&P Part: 401-098","Made in the USA",,,B3-140B-1-S,Each,,,
184,"2017-11-07 22:18:07","S&S Cycle Standard Needle Seat","J&P Part: 401-518",,,,11-2465,Each,,,
185,"2017-11-07 22:18:07","V-Twin Manufacturing Choke Rod Kit","J&P Part: 400-275",,,Raw,,Kit,,,
186,"2017-11-07 22:18:07","J&P Cycles&reg; Bendix Accelerator Pump","J&P Part: 4000055",,,,,Each,,,
187,"2017-11-07 22:18:11","J&P Cycles&reg; CV Carb Top Cover","J&P Part: 4000060",,,Chrome,,Each,,,
188,"2017-11-07 22:18:11","Mikuni Chrome Top Cover","J&P Part: 400-888",,,Chrome,KHS-029,Each,,,
189,"2017-11-07 22:18:11","Show Chrome Accessories Engine Side Carb Covers","J&P Part: ZZ43084",,,Chrome,2-439,Each,,,
190,"2017-11-07 22:18:11","Paughco Smooth Style Carburetor Cover for All Side Valve Linkert Carburetors","J&P Part: 400-0042",,Teardrop,Chrome,700L,Each,,,
191,"2017-11-07 22:18:11","Ribbed Top Cover","J&P Part: 4000300",,,Chrome,,Each,,,
192,"2017-11-07 22:18:11","Pro-One Carburetor Cover","J&P Part: ZZ40048","Made in the USA",,Chrome,870300,Each,,,
193,"2017-11-07 22:18:11","Biltwell Inc. Black Ripple Carb Tops","J&P Part: 712-770",,,,CT-RIP-AL-BK,Each,,,
194,"2017-11-07 22:18:11","Mikuni Chrome Top Cover","J&P Part: 601-100",,,Chrome,KHS-028,Each,,,
195,"2017-11-07 22:18:11","Pro-One Carburetor Cover","J&P Part: ZZ40046","Made in the USA",,Chrome,870290,Each,,,
196,"2017-11-07 22:18:11","Show Chrome Accessories Carb Covers","J&P Part: ZZ40400",,,Chrome,1-308,6-pk,,,
197,"2017-11-07 22:18:11","Paughco Smooth Style Carburetor Cover for Linkert Carburetors","J&P Part: 400-0041",,Teardrop,Chrome,700,Each,,,
198,"2017-11-07 22:18:12","Dynojet Jet Kit",,"Made in the USA",,,1192,Kit,,,
199,"2017-11-07 22:18:12","Vance & Hines Carburetor Jet Kit",,,,,22827,Kit,,,
200,"2017-11-07 22:18:12","Cobra Carburetor Jet Kit",,,,,92-1271,Each,,,
