watch_image_down.id,watch_image_down.ts,watch_image_down.source_content_type,watch_image_down.hash_file_content,watch_image_down.size,watch_image_down.path,watch_image_down.title,watch_image_down.access,watch_image.id,watch_image.ts,watch.id,watch.ts,watch.title,watch.price,watch.xilie,watch.bianhao,watch.jixinleixing,watch.jixinxinghao,watch.waikecaizhi,watch.biaopanhoudu,watch.biaopankuandu,watch.biaoguan,watch.jingmiancaizhi,watch.biaopanzhijing,watch.biaopanxingzhuang,watch.biaokedikai,watch.biaopankedu,watch.biaopanyanse,watch.biaodaicaizhi,watch.biaodaiyanse,watch.biaokouleixing,watch.gongneng,watch.shiherenqun,watch.baozhuang,watch.teshugongneng,watch.fangshui,watch.peidaichanghe,watch.songliduixing,brand.id,brand.ts,brand.title
101,"2019-01-28 04:29:01",image/jpeg,b48f37864443f632b016f217ed272b2556e8cfb4,150736,/b4/8f/37/86/b48f37864443f632b016f217ed272b2556e8cfb4.jpg,,https://songer.datasn.com/data/api/v1/u_bc75445a318997106583/watch_information_1/by_table/watch_image_down_access/b4/8f/37/86/b48f37864443f632b016f217ed272b2556e8cfb4.jpg,106,"2018-09-12 04:18:04",58,"2018-09-12 04:18:04","瑞士亨利·慕时 H.Moser & Cie勇创者系列 321-503-016 机械男表","￥102,400",321-503-016,110,手动机械,Array,白金,10.9mm,40.8mm,推拉式,蓝宝石水晶,主流35mm-40mm,圆形,,条形,棕色,鳄鱼皮,棕色,针扣,,男表,精美包装盒、说明书、保修卡等,,,收藏,,2,"2018-08-29 22:53:17",亨利慕时
102,"2019-01-28 04:29:07",image/jpeg,6e98d0e96d997d5c42f485d90689ff31ab9d29a3,199104,/6e/98/d0/e9/6e98d0e96d997d5c42f485d90689ff31ab9d29a3.jpg,,https://songer.datasn.com/data/api/v1/u_bc75445a318997106583/watch_information_1/by_table/watch_image_down_access/6e/98/d0/e9/6e98d0e96d997d5c42f485d90689ff31ab9d29a3.jpg,107,"2018-09-12 04:18:04",58,"2018-09-12 04:18:04","瑞士亨利·慕时 H.Moser & Cie勇创者系列 321-503-016 机械男表","￥102,400",321-503-016,110,手动机械,Array,白金,10.9mm,40.8mm,推拉式,蓝宝石水晶,主流35mm-40mm,圆形,,条形,棕色,鳄鱼皮,棕色,针扣,,男表,精美包装盒、说明书、保修卡等,,,收藏,,2,"2018-08-29 22:53:17",亨利慕时
103,"2019-01-28 04:29:07",image/jpeg,1de25bb750fd643312560c570a634d769aad0bce,105443,/1d/e2/5b/b7/1de25bb750fd643312560c570a634d769aad0bce.jpg,,https://songer.datasn.com/data/api/v1/u_bc75445a318997106583/watch_information_1/by_table/watch_image_down_access/1d/e2/5b/b7/1de25bb750fd643312560c570a634d769aad0bce.jpg,108,"2018-09-12 04:18:04",58,"2018-09-12 04:18:04","瑞士亨利·慕时 H.Moser & Cie勇创者系列 321-503-016 机械男表","￥102,400",321-503-016,110,手动机械,Array,白金,10.9mm,40.8mm,推拉式,蓝宝石水晶,主流35mm-40mm,圆形,,条形,棕色,鳄鱼皮,棕色,针扣,,男表,精美包装盒、说明书、保修卡等,,,收藏,,2,"2018-08-29 22:53:17",亨利慕时
104,"2019-01-28 04:29:17",image/jpeg,7483652ed63cdb60f3165fe8ec13c06ead93ff96,136126,/74/83/65/2e/7483652ed63cdb60f3165fe8ec13c06ead93ff96.jpg,,https://songer.datasn.com/data/api/v1/u_bc75445a318997106583/watch_information_1/by_table/watch_image_down_access/74/83/65/2e/7483652ed63cdb60f3165fe8ec13c06ead93ff96.jpg,109,"2018-09-12 04:18:04",58,"2018-09-12 04:18:04","瑞士亨利·慕时 H.Moser & Cie勇创者系列 321-503-016 机械男表","￥102,400",321-503-016,110,手动机械,Array,白金,10.9mm,40.8mm,推拉式,蓝宝石水晶,主流35mm-40mm,圆形,,条形,棕色,鳄鱼皮,棕色,针扣,,男表,精美包装盒、说明书、保修卡等,,,收藏,,2,"2018-08-29 22:53:17",亨利慕时
105,"2019-01-28 04:29:18",image/jpeg,d04b789cc2af0c806b6c6485b14a95d9c8a5a782,86689,/d0/4b/78/9c/d04b789cc2af0c806b6c6485b14a95d9c8a5a782.jpg,,https://songer.datasn.com/data/api/v1/u_bc75445a318997106583/watch_information_1/by_table/watch_image_down_access/d0/4b/78/9c/d04b789cc2af0c806b6c6485b14a95d9c8a5a782.jpg,110,"2018-09-12 04:18:04",58,"2018-09-12 04:18:04","瑞士亨利·慕时 H.Moser & Cie勇创者系列 321-503-016 机械男表","￥102,400",321-503-016,110,手动机械,Array,白金,10.9mm,40.8mm,推拉式,蓝宝石水晶,主流35mm-40mm,圆形,,条形,棕色,鳄鱼皮,棕色,针扣,,男表,精美包装盒、说明书、保修卡等,,,收藏,,2,"2018-08-29 22:53:17",亨利慕时
106,"2019-01-28 04:29:22",image/jpeg,ca11304d535dab53fb0aabcf41b3a23a1911cc57,91541,/ca/11/30/4d/ca11304d535dab53fb0aabcf41b3a23a1911cc57.jpg,,https://songer.datasn.com/data/api/v1/u_bc75445a318997106583/watch_information_1/by_table/watch_image_down_access/ca/11/30/4d/ca11304d535dab53fb0aabcf41b3a23a1911cc57.jpg,111,"2018-09-12 04:18:04",58,"2018-09-12 04:18:04","瑞士亨利·慕时 H.Moser & Cie勇创者系列 321-503-016 机械男表","￥102,400",321-503-016,110,手动机械,Array,白金,10.9mm,40.8mm,推拉式,蓝宝石水晶,主流35mm-40mm,圆形,,条形,棕色,鳄鱼皮,棕色,针扣,,男表,精美包装盒、说明书、保修卡等,,,收藏,,2,"2018-08-29 22:53:17",亨利慕时
107,"2019-01-28 04:29:26",image/jpeg,dc3c7b2f3a2cf88132615416d57cc3ef188f858f,154870,/dc/3c/7b/2f/dc3c7b2f3a2cf88132615416d57cc3ef188f858f.jpg,,https://songer.datasn.com/data/api/v1/u_bc75445a318997106583/watch_information_1/by_table/watch_image_down_access/dc/3c/7b/2f/dc3c7b2f3a2cf88132615416d57cc3ef188f858f.jpg,112,"2018-09-12 04:18:41",61,"2018-09-12 04:18:41","【尊享VIP专人送货礼遇】瑞士亨利·慕时 H.Moser & Cie勇创者系列 325-503-010 机械男表","￥136,800",325-503-010,110,手动机械,"自制手动上弦机芯 HMC 325.503 双游丝机芯",其它,10.9mm,40.8mm,推拉式,蓝宝石水晶,主流35mm-40mm,圆形,,条形,灰色,鳄鱼皮,黑色,针扣,,男表,精美包装盒、说明书、保修卡等,,,收藏,,2,"2018-08-29 22:53:17",亨利慕时
108,"2019-01-28 04:29:27",image/jpeg,729ea1c404adac244cd4d698ab9c80ae3eaf693f,206088,/72/9e/a1/c4/729ea1c404adac244cd4d698ab9c80ae3eaf693f.jpg,,https://songer.datasn.com/data/api/v1/u_bc75445a318997106583/watch_information_1/by_table/watch_image_down_access/72/9e/a1/c4/729ea1c404adac244cd4d698ab9c80ae3eaf693f.jpg,113,"2018-09-12 04:18:41",61,"2018-09-12 04:18:41","【尊享VIP专人送货礼遇】瑞士亨利·慕时 H.Moser & Cie勇创者系列 325-503-010 机械男表","￥136,800",325-503-010,110,手动机械,"自制手动上弦机芯 HMC 325.503 双游丝机芯",其它,10.9mm,40.8mm,推拉式,蓝宝石水晶,主流35mm-40mm,圆形,,条形,灰色,鳄鱼皮,黑色,针扣,,男表,精美包装盒、说明书、保修卡等,,,收藏,,2,"2018-08-29 22:53:17",亨利慕时
109,"2019-01-28 04:29:38",image/jpeg,40a838c2737c520a9dc7c4f111f23947375fd9a1,305054,/40/a8/38/c2/40a838c2737c520a9dc7c4f111f23947375fd9a1.jpg,,https://songer.datasn.com/data/api/v1/u_bc75445a318997106583/watch_information_1/by_table/watch_image_down_access/40/a8/38/c2/40a838c2737c520a9dc7c4f111f23947375fd9a1.jpg,114,"2018-09-12 04:18:41",61,"2018-09-12 04:18:41","【尊享VIP专人送货礼遇】瑞士亨利·慕时 H.Moser & Cie勇创者系列 325-503-010 机械男表","￥136,800",325-503-010,110,手动机械,"自制手动上弦机芯 HMC 325.503 双游丝机芯",其它,10.9mm,40.8mm,推拉式,蓝宝石水晶,主流35mm-40mm,圆形,,条形,灰色,鳄鱼皮,黑色,针扣,,男表,精美包装盒、说明书、保修卡等,,,收藏,,2,"2018-08-29 22:53:17",亨利慕时
110,"2019-01-28 04:29:42",image/jpeg,20e2e1f70023ae8d931214450865eccf1840fd1c,149439,/20/e2/e1/f7/20e2e1f70023ae8d931214450865eccf1840fd1c.jpg,,https://songer.datasn.com/data/api/v1/u_bc75445a318997106583/watch_information_1/by_table/watch_image_down_access/20/e2/e1/f7/20e2e1f70023ae8d931214450865eccf1840fd1c.jpg,115,"2018-09-12 04:18:41",61,"2018-09-12 04:18:41","【尊享VIP专人送货礼遇】瑞士亨利·慕时 H.Moser & Cie勇创者系列 325-503-010 机械男表","￥136,800",325-503-010,110,手动机械,"自制手动上弦机芯 HMC 325.503 双游丝机芯",其它,10.9mm,40.8mm,推拉式,蓝宝石水晶,主流35mm-40mm,圆形,,条形,灰色,鳄鱼皮,黑色,针扣,,男表,精美包装盒、说明书、保修卡等,,,收藏,,2,"2018-08-29 22:53:17",亨利慕时
111,"2019-01-28 04:29:51",image/jpeg,20a0e1eb714c27b816b785b9c6801afe01b50246,208284,/20/a0/e1/eb/20a0e1eb714c27b816b785b9c6801afe01b50246.jpg,,https://songer.datasn.com/data/api/v1/u_bc75445a318997106583/watch_information_1/by_table/watch_image_down_access/20/a0/e1/eb/20a0e1eb714c27b816b785b9c6801afe01b50246.jpg,116,"2018-09-12 04:18:41",61,"2018-09-12 04:18:41","【尊享VIP专人送货礼遇】瑞士亨利·慕时 H.Moser & Cie勇创者系列 325-503-010 机械男表","￥136,800",325-503-010,110,手动机械,"自制手动上弦机芯 HMC 325.503 双游丝机芯",其它,10.9mm,40.8mm,推拉式,蓝宝石水晶,主流35mm-40mm,圆形,,条形,灰色,鳄鱼皮,黑色,针扣,,男表,精美包装盒、说明书、保修卡等,,,收藏,,2,"2018-08-29 22:53:17",亨利慕时
112,"2019-01-28 04:29:53",image/jpeg,c5d4ada82a4874b5d14496a6d2b918b74b466634,172895,/c5/d4/ad/a8/c5d4ada82a4874b5d14496a6d2b918b74b466634.jpg,,https://songer.datasn.com/data/api/v1/u_bc75445a318997106583/watch_information_1/by_table/watch_image_down_access/c5/d4/ad/a8/c5d4ada82a4874b5d14496a6d2b918b74b466634.jpg,117,"2018-09-12 04:18:41",61,"2018-09-12 04:18:41","【尊享VIP专人送货礼遇】瑞士亨利·慕时 H.Moser & Cie勇创者系列 325-503-010 机械男表","￥136,800",325-503-010,110,手动机械,"自制手动上弦机芯 HMC 325.503 双游丝机芯",其它,10.9mm,40.8mm,推拉式,蓝宝石水晶,主流35mm-40mm,圆形,,条形,灰色,鳄鱼皮,黑色,针扣,,男表,精美包装盒、说明书、保修卡等,,,收藏,,2,"2018-08-29 22:53:17",亨利慕时
113,"2019-01-28 04:29:58",image/jpeg,b91ecdf839f772a9c7a80d9e18dfdf43f73419ce,103756,/b9/1e/cd/f8/b91ecdf839f772a9c7a80d9e18dfdf43f73419ce.jpg,,https://songer.datasn.com/data/api/v1/u_bc75445a318997106583/watch_information_1/by_table/watch_image_down_access/b9/1e/cd/f8/b91ecdf839f772a9c7a80d9e18dfdf43f73419ce.jpg,118,"2018-09-12 04:18:41",61,"2018-09-12 04:18:41","【尊享VIP专人送货礼遇】瑞士亨利·慕时 H.Moser & Cie勇创者系列 325-503-010 机械男表","￥136,800",325-503-010,110,手动机械,"自制手动上弦机芯 HMC 325.503 双游丝机芯",其它,10.9mm,40.8mm,推拉式,蓝宝石水晶,主流35mm-40mm,圆形,,条形,灰色,鳄鱼皮,黑色,针扣,,男表,精美包装盒、说明书、保修卡等,,,收藏,,2,"2018-08-29 22:53:17",亨利慕时
114,"2019-01-28 04:30:04",image/jpeg,20a0e1eb714c27b816b785b9c6801afe01b50246,208284,/20/a0/e1/eb/20a0e1eb714c27b816b785b9c6801afe01b50246.jpg,,https://songer.datasn.com/data/api/v1/u_bc75445a318997106583/watch_information_1/by_table/watch_image_down_access/20/a0/e1/eb/20a0e1eb714c27b816b785b9c6801afe01b50246.jpg,119,"2018-09-12 04:18:41",61,"2018-09-12 04:18:41","【尊享VIP专人送货礼遇】瑞士亨利·慕时 H.Moser & Cie勇创者系列 325-503-010 机械男表","￥136,800",325-503-010,110,手动机械,"自制手动上弦机芯 HMC 325.503 双游丝机芯",其它,10.9mm,40.8mm,推拉式,蓝宝石水晶,主流35mm-40mm,圆形,,条形,灰色,鳄鱼皮,黑色,针扣,,男表,精美包装盒、说明书、保修卡等,,,收藏,,2,"2018-08-29 22:53:17",亨利慕时
115,"2019-01-28 04:30:13",image/jpeg,0b8a05e7c32a568ef604906dfb6bb925a7d379a4,79603,/0b/8a/05/e7/0b8a05e7c32a568ef604906dfb6bb925a7d379a4.jpg,,https://songer.datasn.com/data/api/v1/u_bc75445a318997106583/watch_information_1/by_table/watch_image_down_access/0b/8a/05/e7/0b8a05e7c32a568ef604906dfb6bb925a7d379a4.jpg,120,"2018-09-12 04:18:41",61,"2018-09-12 04:18:41","【尊享VIP专人送货礼遇】瑞士亨利·慕时 H.Moser & Cie勇创者系列 325-503-010 机械男表","￥136,800",325-503-010,110,手动机械,"自制手动上弦机芯 HMC 325.503 双游丝机芯",其它,10.9mm,40.8mm,推拉式,蓝宝石水晶,主流35mm-40mm,圆形,,条形,灰色,鳄鱼皮,黑色,针扣,,男表,精美包装盒、说明书、保修卡等,,,收藏,,2,"2018-08-29 22:53:17",亨利慕时
116,"2019-01-28 04:30:15",image/jpeg,b4e75646874d8334318cceab306f1aefb99bde08,49368,/b4/e7/56/46/b4e75646874d8334318cceab306f1aefb99bde08.jpg,,https://songer.datasn.com/data/api/v1/u_bc75445a318997106583/watch_information_1/by_table/watch_image_down_access/b4/e7/56/46/b4e75646874d8334318cceab306f1aefb99bde08.jpg,121,"2018-09-12 04:19:12",63,"2018-09-12 04:19:12","瑞士亨利·慕时 H.Moser & Cie勇创者系列1343-0401 机械男表","￥136,800",1343-0401,110,手动机械,Array,玫瑰金,10.9mm,40.8mm,推拉式,蓝宝石水晶,主流35mm-40mm,圆形,透底,条形,蓝色,鳄鱼皮,棕色,针扣,大三针,男表,精美包装盒、说明书、保修卡等,大三针,,收藏,,2,"2018-08-29 22:53:17",亨利慕时
117,"2019-01-28 04:30:17",image/jpeg,79338cb5b1118ae6be9bc59ae7995f4ac41cf84d,122907,/79/33/8c/b5/79338cb5b1118ae6be9bc59ae7995f4ac41cf84d.jpg,,https://songer.datasn.com/data/api/v1/u_bc75445a318997106583/watch_information_1/by_table/watch_image_down_access/79/33/8c/b5/79338cb5b1118ae6be9bc59ae7995f4ac41cf84d.jpg,122,"2018-09-12 04:19:37",65,"2018-09-12 04:19:37","瑞士亨利·慕时 H.Moser & Cie 勇创者系列1321-0100 机械男表","￥102,400",1321-0100,110,手动机械,Array,玫瑰金,9.3mm,38.8mm,推拉式,蓝宝石水晶,主流35mm-40mm,圆形,,条形,银色,鳄鱼皮,棕色,针扣,,男表,精美包装盒、说明书、保修卡等,,,收藏,,2,"2018-08-29 22:53:17",亨利慕时
118,"2019-01-28 04:30:21",image/jpeg,a8d873f220a4dc24abd928bf4a6f138be9e908d2,227608,/a8/d8/73/f2/a8d873f220a4dc24abd928bf4a6f138be9e908d2.jpg,,https://songer.datasn.com/data/api/v1/u_bc75445a318997106583/watch_information_1/by_table/watch_image_down_access/a8/d8/73/f2/a8d873f220a4dc24abd928bf4a6f138be9e908d2.jpg,123,"2018-09-12 04:20:42",71,"2018-09-12 04:20:42","瑞士亨利·慕时 H.Moser & Cie ENDEAVOUR系列 1321-0116 机械男表","￥110,400",1321-0116,110,手动机械,Array,玫瑰金,9.3mm,38.8mm,双拉式表冠,蓝宝石水晶,主流35mm-40mm,圆形,透底,阿拉伯文,白色,真皮,棕色,,小三针,男表,精美包装盒、说明书、保修卡等,小三针,,时尚,,2,"2018-08-29 22:53:17",亨利慕时
119,"2019-01-28 04:30:25",image/jpeg,bf2b3573802f1eb492728b70cc22e658f64c88db,221328,/bf/2b/35/73/bf2b3573802f1eb492728b70cc22e658f64c88db.jpg,,https://songer.datasn.com/data/api/v1/u_bc75445a318997106583/watch_information_1/by_table/watch_image_down_access/bf/2b/35/73/bf2b3573802f1eb492728b70cc22e658f64c88db.jpg,124,"2018-09-12 04:20:56",72,"2018-09-12 04:20:56","瑞士亨利·慕时 H.Moser & Cie ENDEAVOUR系列 1343-0208 机械男表","￥142,400",1343-0208,110,手动机械,Array,白金,11mm,40.8mm,双拉式表冠,蓝宝石水晶,大盘40mm-45mm,圆形,透底,无刻度,黑色,鳄鱼皮,黑色,,大三针,男表,精美包装盒、说明书、保修卡等,大三针,,时尚,,2,"2018-08-29 22:53:17",亨利慕时
120,"2019-01-28 04:30:29",image/jpeg,8bd5ffb490bf7d8ee28593cc022e54597cee87da,180094,/8b/d5/ff/b4/8bd5ffb490bf7d8ee28593cc022e54597cee87da.jpg,,https://songer.datasn.com/data/api/v1/u_bc75445a318997106583/watch_information_1/by_table/watch_image_down_access/8b/d5/ff/b4/8bd5ffb490bf7d8ee28593cc022e54597cee87da.jpg,125,"2018-09-12 04:21:27",74,"2018-09-12 04:21:27","瑞士亨利·慕时 H.Moser & Cie ENDEAVOUR勇创者系列 1341-0200 机械男表","￥336,000",1341-0200,110,手动机械,Array,白金,11mm,40.8mm,双拉式表冠,蓝宝石水晶,大盘40mm-45mm,圆形,透底,条形,银色,鳄鱼皮,其它,针扣,动力储备显示,男表,精美包装盒、说明书、保修卡等,动力储备显示,,时尚,,2,"2018-08-29 22:53:17",亨利慕时
121,"2019-01-28 04:30:38",image/jpeg,443290f15752c54fa95c6111b29bda487ed09ff7,259057,/44/32/90/f1/443290f15752c54fa95c6111b29bda487ed09ff7.jpg,,https://songer.datasn.com/data/api/v1/u_bc75445a318997106583/watch_information_1/by_table/watch_image_down_access/44/32/90/f1/443290f15752c54fa95c6111b29bda487ed09ff7.jpg,126,"2018-09-12 04:21:44",75,"2018-09-12 04:21:44","瑞士亨利·慕时 H.Moser & Cie ENDEAVOUR系列 1341-0208 机械男表（限量10枚，全球售罄，仅供展示）","￥376,000",1341-0208,110,手动机械,Array,白金,11mm,40.8mm,双拉式表冠,蓝宝石水晶,大盘40mm-45mm,圆形,透底,无刻度,其它,真皮,其它,,动力储备显示,男表,精美包装盒、说明书、保修卡等,动力储备显示,,收藏,,2,"2018-08-29 22:53:17",亨利慕时
122,"2019-01-28 04:30:45",image/jpeg,e96cad4431ffa035a6861f15be8f925b32e5672e,194509,/e9/6c/ad/44/e96cad4431ffa035a6861f15be8f925b32e5672e.jpg,,https://songer.datasn.com/data/api/v1/u_bc75445a318997106583/watch_information_1/by_table/watch_image_down_access/e9/6c/ad/44/e96cad4431ffa035a6861f15be8f925b32e5672e.jpg,127,"2018-09-12 04:21:59",76,"2018-09-12 04:21:59","瑞士亨利·慕时 H.Moser & Cie ENDEAVOUR系列 1343-0209 机械男表","￥142,400",1343-0209,110,手动机械,Array,白金,11mm,40.8mm,双拉式表冠,蓝宝石水晶,大盘40mm-45mm,圆形,透底,无刻度,蓝色,真皮,棕色,,大三针,男表,精美包装盒、说明书、保修卡等,大三针,,时尚,,2,"2018-08-29 22:53:17",亨利慕时
123,"2019-01-28 04:30:52",image/jpeg,2a7c59e7a0531d09977e7b7ecfeb520edaad05a6,115547,/2a/7c/59/e7/2a7c59e7a0531d09977e7b7ecfeb520edaad05a6.jpg,,https://songer.datasn.com/data/api/v1/u_bc75445a318997106583/watch_information_1/by_table/watch_image_down_access/2a/7c/59/e7/2a7c59e7a0531d09977e7b7ecfeb520edaad05a6.jpg,128,"2018-09-12 04:22:14",78,"2018-09-12 04:22:14","瑞士亨利·慕时 H.Moser & Cie ENDEAVOUR 系列 1321-0601 机械男表","￥102,400",1321-0601,110,手动机械,Array,其它,10.9mm,40.8mm,,蓝宝石水晶,大盘40mm-45mm,圆形,透底,条形,蓝色,鳄鱼皮,黑色,针扣,小三针,男表,精美包装盒、说明书、保修卡等,小三针,,收藏,,2,"2018-08-29 22:53:17",亨利慕时
124,"2019-01-28 04:30:54",image/jpeg,7a3e56e151e10ee7a7a04d43a4b8e71cb089f137,133078,/7a/3e/56/e1/7a3e56e151e10ee7a7a04d43a4b8e71cb089f137.jpg,,https://songer.datasn.com/data/api/v1/u_bc75445a318997106583/watch_information_1/by_table/watch_image_down_access/7a/3e/56/e1/7a3e56e151e10ee7a7a04d43a4b8e71cb089f137.jpg,129,"2018-09-12 04:22:14",78,"2018-09-12 04:22:14","瑞士亨利·慕时 H.Moser & Cie ENDEAVOUR 系列 1321-0601 机械男表","￥102,400",1321-0601,110,手动机械,Array,其它,10.9mm,40.8mm,,蓝宝石水晶,大盘40mm-45mm,圆形,透底,条形,蓝色,鳄鱼皮,黑色,针扣,小三针,男表,精美包装盒、说明书、保修卡等,小三针,,收藏,,2,"2018-08-29 22:53:17",亨利慕时
125,"2019-01-28 04:31:00",image/jpeg,6c4cd55f1d4a34276cbc923c27f6bd0474412a54,53215,/6c/4c/d5/5f/6c4cd55f1d4a34276cbc923c27f6bd0474412a54.jpg,,https://songer.datasn.com/data/api/v1/u_bc75445a318997106583/watch_information_1/by_table/watch_image_down_access/6c/4c/d5/5f/6c4cd55f1d4a34276cbc923c27f6bd0474412a54.jpg,130,"2018-09-12 04:22:22",79,"2018-09-12 04:22:22","瑞士亨利·慕时 H.Moser & Cie VENTURER系列 2327-0203 机械男表","￥134,400",2327-0203,110,手动机械,"HMC 327",白金,12.6mm,43mm,,蓝宝石水晶,大盘40mm-45mm,圆形,透底,条形,蓝色,真皮,其它,,,男表,精美包装盒、说明书、保修卡等,,,收藏,,2,"2018-08-29 22:53:17",亨利慕时
126,"2019-01-28 04:31:00",image/jpeg,acec827dea581f43a4f87e7583e2812c91953b35,112122,/ac/ec/82/7d/acec827dea581f43a4f87e7583e2812c91953b35.jpg,,https://songer.datasn.com/data/api/v1/u_bc75445a318997106583/watch_information_1/by_table/watch_image_down_access/ac/ec/82/7d/acec827dea581f43a4f87e7583e2812c91953b35.jpg,131,"2018-09-12 04:22:51",82,"2018-09-12 04:22:51","瑞士亨利·慕时 H.Moser & Cie勇创者系列 1321-0101 机械男表","￥102,400",1321-0101,110,手动机械,Array,玫瑰金,9.3mm,38.8mm,推拉式,蓝宝石水晶,主流35mm-40mm,圆形,透底,条形,黑色,鳄鱼皮,黑色,针扣,,男表,精美包装盒、说明书、保修卡等,,,收藏,,2,"2018-08-29 22:53:17",亨利慕时
127,"2019-01-28 04:31:08",image/jpeg,e9a454bc8b46b13e0eb93e2cdc021e03e43bfd29,115426,/e9/a4/54/bc/e9a454bc8b46b13e0eb93e2cdc021e03e43bfd29.jpg,,https://songer.datasn.com/data/api/v1/u_bc75445a318997106583/watch_information_1/by_table/watch_image_down_access/e9/a4/54/bc/e9a454bc8b46b13e0eb93e2cdc021e03e43bfd29.jpg,132,"2018-09-12 04:23:23",84,"2018-09-12 04:23:23","瑞士亨利·慕时 H.Moser & Cie ENDEAVOUR系列 1348-0300 机械男表","￥318,400",1348-0300,110,手动机械,Array,铂金,11.1mm,40.8mm,双拉式表冠,蓝宝石水晶,大盘40mm-45mm,圆形,透底,其它,蓝色,鳄鱼皮,黑色,折叠扣,月相,男表,精美包装盒、说明书、保修卡等,月相,,收藏,,2,"2018-08-29 22:53:17",亨利慕时
128,"2019-01-28 04:31:10",image/jpeg,f9f0d7fd46c29db1e818dae301527d7801032381,99301,/f9/f0/d7/fd/f9f0d7fd46c29db1e818dae301527d7801032381.jpg,,https://songer.datasn.com/data/api/v1/u_bc75445a318997106583/watch_information_1/by_table/watch_image_down_access/f9/f0/d7/fd/f9f0d7fd46c29db1e818dae301527d7801032381.jpg,133,"2018-09-12 04:23:23",84,"2018-09-12 04:23:23","瑞士亨利·慕时 H.Moser & Cie ENDEAVOUR系列 1348-0300 机械男表","￥318,400",1348-0300,110,手动机械,Array,铂金,11.1mm,40.8mm,双拉式表冠,蓝宝石水晶,大盘40mm-45mm,圆形,透底,其它,蓝色,鳄鱼皮,黑色,折叠扣,月相,男表,精美包装盒、说明书、保修卡等,月相,,收藏,,2,"2018-08-29 22:53:17",亨利慕时
129,"2019-01-28 04:31:20",image/jpeg,65248ea80cd2e3f35ceff2ded1b6f85199de54b0,119665,/65/24/8e/a8/65248ea80cd2e3f35ceff2ded1b6f85199de54b0.jpg,,https://songer.datasn.com/data/api/v1/u_bc75445a318997106583/watch_information_1/by_table/watch_image_down_access/65/24/8e/a8/65248ea80cd2e3f35ceff2ded1b6f85199de54b0.jpg,134,"2018-09-12 04:23:46",86,"2018-09-12 04:23:46","瑞士亨利·慕时 H.Moser & Cie ENDEAVOUR 系列 1342-0100 机械男表","￥174,400",1342-0100,110,手动机械,Array,玫瑰金,10.9mm,40.8mm,双拉式表冠,蓝宝石水晶,大盘40mm-45mm,圆形,透底,其它,黑色,鳄鱼皮,黑色,针扣,大三针,男表,精美包装盒、说明书、保修卡等,大三针,,收藏,,2,"2018-08-29 22:53:17",亨利慕时
130,"2019-01-28 04:31:24",image/jpeg,2c23479d75d59fb896539a4ea861700c46c4decf,104182,/2c/23/47/9d/2c23479d75d59fb896539a4ea861700c46c4decf.jpg,,https://songer.datasn.com/data/api/v1/u_bc75445a318997106583/watch_information_1/by_table/watch_image_down_access/2c/23/47/9d/2c23479d75d59fb896539a4ea861700c46c4decf.jpg,135,"2018-09-12 04:23:46",86,"2018-09-12 04:23:46","瑞士亨利·慕时 H.Moser & Cie ENDEAVOUR 系列 1342-0100 机械男表","￥174,400",1342-0100,110,手动机械,Array,玫瑰金,10.9mm,40.8mm,双拉式表冠,蓝宝石水晶,大盘40mm-45mm,圆形,透底,其它,黑色,鳄鱼皮,黑色,针扣,大三针,男表,精美包装盒、说明书、保修卡等,大三针,,收藏,,2,"2018-08-29 22:53:17",亨利慕时
131,"2019-01-28 04:31:29",image/jpeg,48a621e7a04e125f0b9e1bf8f2b772758af7ad3f,206845,/48/a6/21/e7/48a621e7a04e125f0b9e1bf8f2b772758af7ad3f.jpg,,https://songer.datasn.com/data/api/v1/u_bc75445a318997106583/watch_information_1/by_table/watch_image_down_access/48/a6/21/e7/48a621e7a04e125f0b9e1bf8f2b772758af7ad3f.jpg,136,"2018-09-12 04:23:56",87,"2018-09-12 04:23:56","瑞士亨利·慕时 H.Moser & Cie勇创者系列 1321-0109 机械男表","￥102,400",1321-0109,110,手动机械,Array,玫瑰金,9.3mm,38.8mm,推拉式,蓝宝石水晶,主流35mm-40mm,圆形,透底,条形,棕色,鳄鱼皮,棕色,针扣,,男表,精美包装盒、说明书、保修卡等,,,收藏,,2,"2018-08-29 22:53:17",亨利慕时
132,"2019-01-28 04:31:40",image/jpeg,3dbba00be36ca8e9037595765b3e295459ee1b69,141195,/3d/bb/a0/0b/3dbba00be36ca8e9037595765b3e295459ee1b69.jpg,,https://songer.datasn.com/data/api/v1/u_bc75445a318997106583/watch_information_1/by_table/watch_image_down_access/3d/bb/a0/0b/3dbba00be36ca8e9037595765b3e295459ee1b69.jpg,137,"2018-09-12 04:23:56",87,"2018-09-12 04:23:56","瑞士亨利·慕时 H.Moser & Cie勇创者系列 1321-0109 机械男表","￥102,400",1321-0109,110,手动机械,Array,玫瑰金,9.3mm,38.8mm,推拉式,蓝宝石水晶,主流35mm-40mm,圆形,透底,条形,棕色,鳄鱼皮,棕色,针扣,,男表,精美包装盒、说明书、保修卡等,,,收藏,,2,"2018-08-29 22:53:17",亨利慕时
133,"2019-01-28 04:31:41",image/jpeg,f0dec213f7c2a894e2ae3ccf28ec988225f8af59,304739,/f0/de/c2/13/f0dec213f7c2a894e2ae3ccf28ec988225f8af59.jpg,,https://songer.datasn.com/data/api/v1/u_bc75445a318997106583/watch_information_1/by_table/watch_image_down_access/f0/de/c2/13/f0dec213f7c2a894e2ae3ccf28ec988225f8af59.jpg,138,"2018-09-12 04:23:56",87,"2018-09-12 04:23:56","瑞士亨利·慕时 H.Moser & Cie勇创者系列 1321-0109 机械男表","￥102,400",1321-0109,110,手动机械,Array,玫瑰金,9.3mm,38.8mm,推拉式,蓝宝石水晶,主流35mm-40mm,圆形,透底,条形,棕色,鳄鱼皮,棕色,针扣,,男表,精美包装盒、说明书、保修卡等,,,收藏,,2,"2018-08-29 22:53:17",亨利慕时
134,"2019-01-28 04:31:47",image/jpeg,aedfd461c7f5fcf688c7a60c7970514a36ee6719,158096,/ae/df/d4/61/aedfd461c7f5fcf688c7a60c7970514a36ee6719.jpg,,https://songer.datasn.com/data/api/v1/u_bc75445a318997106583/watch_information_1/by_table/watch_image_down_access/ae/df/d4/61/aedfd461c7f5fcf688c7a60c7970514a36ee6719.jpg,139,"2018-09-12 04:23:56",87,"2018-09-12 04:23:56","瑞士亨利·慕时 H.Moser & Cie勇创者系列 1321-0109 机械男表","￥102,400",1321-0109,110,手动机械,Array,玫瑰金,9.3mm,38.8mm,推拉式,蓝宝石水晶,主流35mm-40mm,圆形,透底,条形,棕色,鳄鱼皮,棕色,针扣,,男表,精美包装盒、说明书、保修卡等,,,收藏,,2,"2018-08-29 22:53:17",亨利慕时
135,"2019-01-28 04:31:54",image/jpeg,981bd320e48a82947231f59e28cb1fa8fe6df8cf,162370,/98/1b/d3/20/981bd320e48a82947231f59e28cb1fa8fe6df8cf.jpg,,https://songer.datasn.com/data/api/v1/u_bc75445a318997106583/watch_information_1/by_table/watch_image_down_access/98/1b/d3/20/981bd320e48a82947231f59e28cb1fa8fe6df8cf.jpg,140,"2018-09-12 04:23:56",87,"2018-09-12 04:23:56","瑞士亨利·慕时 H.Moser & Cie勇创者系列 1321-0109 机械男表","￥102,400",1321-0109,110,手动机械,Array,玫瑰金,9.3mm,38.8mm,推拉式,蓝宝石水晶,主流35mm-40mm,圆形,透底,条形,棕色,鳄鱼皮,棕色,针扣,,男表,精美包装盒、说明书、保修卡等,,,收藏,,2,"2018-08-29 22:53:17",亨利慕时
136,"2019-01-28 04:32:04",image/jpeg,b22f0a823f937c2809914404f571b7dfb98150b7,121313,/b2/2f/0a/82/b22f0a823f937c2809914404f571b7dfb98150b7.jpg,,https://songer.datasn.com/data/api/v1/u_bc75445a318997106583/watch_information_1/by_table/watch_image_down_access/b2/2f/0a/82/b22f0a823f937c2809914404f571b7dfb98150b7.jpg,141,"2018-09-12 04:23:56",87,"2018-09-12 04:23:56","瑞士亨利·慕时 H.Moser & Cie勇创者系列 1321-0109 机械男表","￥102,400",1321-0109,110,手动机械,Array,玫瑰金,9.3mm,38.8mm,推拉式,蓝宝石水晶,主流35mm-40mm,圆形,透底,条形,棕色,鳄鱼皮,棕色,针扣,,男表,精美包装盒、说明书、保修卡等,,,收藏,,2,"2018-08-29 22:53:17",亨利慕时
137,"2019-01-28 04:32:08",image/jpeg,32aa07e9344d801858898cc2ef5fb9b8944356d4,102362,/32/aa/07/e9/32aa07e9344d801858898cc2ef5fb9b8944356d4.jpg,,https://songer.datasn.com/data/api/v1/u_bc75445a318997106583/watch_information_1/by_table/watch_image_down_access/32/aa/07/e9/32aa07e9344d801858898cc2ef5fb9b8944356d4.jpg,142,"2018-09-12 04:23:56",87,"2018-09-12 04:23:56","瑞士亨利·慕时 H.Moser & Cie勇创者系列 1321-0109 机械男表","￥102,400",1321-0109,110,手动机械,Array,玫瑰金,9.3mm,38.8mm,推拉式,蓝宝石水晶,主流35mm-40mm,圆形,透底,条形,棕色,鳄鱼皮,棕色,针扣,,男表,精美包装盒、说明书、保修卡等,,,收藏,,2,"2018-08-29 22:53:17",亨利慕时
138,"2019-01-28 04:32:12",image/jpeg,c8f659f7d3a167e3f8cb728ff22b57814c738166,99151,/c8/f6/59/f7/c8f659f7d3a167e3f8cb728ff22b57814c738166.jpg,,https://songer.datasn.com/data/api/v1/u_bc75445a318997106583/watch_information_1/by_table/watch_image_down_access/c8/f6/59/f7/c8f659f7d3a167e3f8cb728ff22b57814c738166.jpg,143,"2018-09-12 04:23:56",87,"2018-09-12 04:23:56","瑞士亨利·慕时 H.Moser & Cie勇创者系列 1321-0109 机械男表","￥102,400",1321-0109,110,手动机械,Array,玫瑰金,9.3mm,38.8mm,推拉式,蓝宝石水晶,主流35mm-40mm,圆形,透底,条形,棕色,鳄鱼皮,棕色,针扣,,男表,精美包装盒、说明书、保修卡等,,,收藏,,2,"2018-08-29 22:53:17",亨利慕时
139,"2019-01-28 04:32:21",image/jpeg,b648d331d1acc83bdeaa6371ed7b9158737a04a3,127576,/b6/48/d3/31/b648d331d1acc83bdeaa6371ed7b9158737a04a3.jpg,,https://songer.datasn.com/data/api/v1/u_bc75445a318997106583/watch_information_1/by_table/watch_image_down_access/b6/48/d3/31/b648d331d1acc83bdeaa6371ed7b9158737a04a3.jpg,144,"2018-09-12 04:23:56",87,"2018-09-12 04:23:56","瑞士亨利·慕时 H.Moser & Cie勇创者系列 1321-0109 机械男表","￥102,400",1321-0109,110,手动机械,Array,玫瑰金,9.3mm,38.8mm,推拉式,蓝宝石水晶,主流35mm-40mm,圆形,透底,条形,棕色,鳄鱼皮,棕色,针扣,,男表,精美包装盒、说明书、保修卡等,,,收藏,,2,"2018-08-29 22:53:17",亨利慕时
140,"2019-01-28 04:32:27",image/jpeg,6d1efe11a0efad4333df9d70fdcbf62205c9938c,86167,/6d/1e/fe/11/6d1efe11a0efad4333df9d70fdcbf62205c9938c.jpg,,https://songer.datasn.com/data/api/v1/u_bc75445a318997106583/watch_information_1/by_table/watch_image_down_access/6d/1e/fe/11/6d1efe11a0efad4333df9d70fdcbf62205c9938c.jpg,145,"2018-09-12 04:23:56",87,"2018-09-12 04:23:56","瑞士亨利·慕时 H.Moser & Cie勇创者系列 1321-0109 机械男表","￥102,400",1321-0109,110,手动机械,Array,玫瑰金,9.3mm,38.8mm,推拉式,蓝宝石水晶,主流35mm-40mm,圆形,透底,条形,棕色,鳄鱼皮,棕色,针扣,,男表,精美包装盒、说明书、保修卡等,,,收藏,,2,"2018-08-29 22:53:17",亨利慕时