production_image.id,production_image.ts,production_image.source_content_type,production_image.hash_file_content,production_image.size,production_image.path,production_image.title,production_image.access,image_slug.id,image_slug.ts,production.id,production.ts,production.title,production.part_number,production.price,production.sale_price,production.category,production.mark,production.other_name,production.description,production.replaces,production.position,production.note
101,"2020-08-05 07:15:27",image/png,2db8e1f17fb5cba0eeb00257bca0b9ea55342b75,26539,/2d/b8/e1/f1/2db8e1f17fb5cba0eeb00257bca0b9ea55342b75.png,,https://songer.datasn.com/data/api/v1/u_e49e7f0fcb85c5451b03/accessories_and_parts_for_mazda/by_table/production_image_access/2d/b8/e1/f1/2db8e1f17fb5cba0eeb00257bca0b9ea55342b75.png,103,"2020-08-04 05:47:57",126,"2020-08-03 11:07:16","Radiator Coolant Hose",GY02-15-18XB,19.06,14.29,"Radiator & Cooling",part,"Hose Water","From 12/2000.",GY02-15-183A,Upper,
102,"2020-08-05 07:15:30",image/png,285c0b0eee82dbb3824aad9408aea0c222784d6e,25971,/28/5c/0b/0e/285c0b0eee82dbb3824aad9408aea0c222784d6e.png,,https://songer.datasn.com/data/api/v1/u_e49e7f0fcb85c5451b03/accessories_and_parts_for_mazda/by_table/production_image_access/28/5c/0b/0e/285c0b0eee82dbb3824aad9408aea0c222784d6e.png,104,"2020-08-04 05:47:57",126,"2020-08-03 11:07:16","Radiator Coolant Hose",GY02-15-18XB,19.06,14.29,"Radiator & Cooling",part,"Hose Water","From 12/2000.",GY02-15-183A,Upper,
103,"2020-08-05 07:15:49",image/png,4649b0587936195b49e9db260724b26e8a330862,22562,/46/49/b0/58/4649b0587936195b49e9db260724b26e8a330862.png,,https://songer.datasn.com/data/api/v1/u_e49e7f0fcb85c5451b03/accessories_and_parts_for_mazda/by_table/production_image_access/46/49/b0/58/4649b0587936195b49e9db260724b26e8a330862.png,105,"2020-08-04 05:48:07",127,"2020-08-03 11:07:27","Radiator Coolant Hose",L540-15-18YA,72.34,54.24,"Radiator & Cooling",part,"Hose Water","To 06/01/2009.",L540-15-18Y,Lower,
104,"2020-08-05 07:15:58",image/png,bec07dd63a688d492d148dc49650c9907fc6fff8,92364,/be/c0/7d/d6/bec07dd63a688d492d148dc49650c9907fc6fff8.png,,https://songer.datasn.com/data/api/v1/u_e49e7f0fcb85c5451b03/accessories_and_parts_for_mazda/by_table/production_image_access/be/c0/7d/d6/bec07dd63a688d492d148dc49650c9907fc6fff8.png,106,"2020-08-04 05:48:07",127,"2020-08-03 11:07:27","Radiator Coolant Hose",L540-15-18YA,72.34,54.24,"Radiator & Cooling",part,"Hose Water","To 06/01/2009.",L540-15-18Y,Lower,
105,"2020-08-05 07:16:09",image/png,7daa8a78eeda76608a0d8d5c37cf712e96aff9e2,40236,/7d/aa/8a/78/7daa8a78eeda76608a0d8d5c37cf712e96aff9e2.png,,https://songer.datasn.com/data/api/v1/u_e49e7f0fcb85c5451b03/accessories_and_parts_for_mazda/by_table/production_image_access/7d/aa/8a/78/7daa8a78eeda76608a0d8d5c37cf712e96aff9e2.png,107,"2020-08-04 05:48:07",127,"2020-08-03 11:07:27","Radiator Coolant Hose",L540-15-18YA,72.34,54.24,"Radiator & Cooling",part,"Hose Water","To 06/01/2009.",L540-15-18Y,Lower,
106,"2020-08-05 07:16:16",image/png,76a33acac294e94434297366aa9842ef4029faa2,9852,/76/a3/3a/ca/76a33acac294e94434297366aa9842ef4029faa2.png,,https://songer.datasn.com/data/api/v1/u_e49e7f0fcb85c5451b03/accessories_and_parts_for_mazda/by_table/production_image_access/76/a3/3a/ca/76a33acac294e94434297366aa9842ef4029faa2.png,108,"2020-08-04 05:48:12",128,"2020-08-03 11:07:40","Radiator Coolant Hose",L556-15-18X,39.22,29.41,"Radiator & Cooling",part,"Hose Water","From 05/01/2012.",,Upper,
107,"2020-08-05 07:16:35",image/png,d24aac1be11b38d79b5c31681e0b63bcd08a2ee1,60773,/d2/4a/ac/1b/d24aac1be11b38d79b5c31681e0b63bcd08a2ee1.png,,https://songer.datasn.com/data/api/v1/u_e49e7f0fcb85c5451b03/accessories_and_parts_for_mazda/by_table/production_image_access/d2/4a/ac/1b/d24aac1be11b38d79b5c31681e0b63bcd08a2ee1.png,109,"2020-08-04 05:48:12",128,"2020-08-03 11:07:40","Radiator Coolant Hose",L556-15-18X,39.22,29.41,"Radiator & Cooling",part,"Hose Water","From 05/01/2012.",,Upper,
108,"2020-08-05 07:16:54",image/png,9897ccd3abc77f3cc239aafe51b6d4c8fe580ddc,30557,/98/97/cc/d3/9897ccd3abc77f3cc239aafe51b6d4c8fe580ddc.png,,https://songer.datasn.com/data/api/v1/u_e49e7f0fcb85c5451b03/accessories_and_parts_for_mazda/by_table/production_image_access/98/97/cc/d3/9897ccd3abc77f3cc239aafe51b6d4c8fe580ddc.png,110,"2020-08-04 05:48:12",128,"2020-08-03 11:07:40","Radiator Coolant Hose",L556-15-18X,39.22,29.41,"Radiator & Cooling",part,"Hose Water","From 05/01/2012.",,Upper,
109,"2020-08-05 07:17:08",image/png,ecd76dcb400b50f3aebf75da798b512cfbc30fc6,5666,/ec/d7/6d/cb/ecd76dcb400b50f3aebf75da798b512cfbc30fc6.png,,https://songer.datasn.com/data/api/v1/u_e49e7f0fcb85c5451b03/accessories_and_parts_for_mazda/by_table/production_image_access/ec/d7/6d/cb/ecd76dcb400b50f3aebf75da798b512cfbc30fc6.png,111,"2020-08-04 05:48:53",130,"2020-08-03 11:08:07","Radiator Coolant Hose",1F22-15-185,30.01,22.5,"Radiator & Cooling",part,"Lower Hose, Hose Water","To 05/01/06. B4000.",,Lower,
110,"2020-08-05 07:17:25",image/png,2108d602bdb7a1f014df424958a6033eaa97fab5,69518,/21/08/d6/02/2108d602bdb7a1f014df424958a6033eaa97fab5.png,,https://songer.datasn.com/data/api/v1/u_e49e7f0fcb85c5451b03/accessories_and_parts_for_mazda/by_table/production_image_access/21/08/d6/02/2108d602bdb7a1f014df424958a6033eaa97fab5.png,112,"2020-08-04 05:48:53",130,"2020-08-03 11:08:07","Radiator Coolant Hose",1F22-15-185,30.01,22.5,"Radiator & Cooling",part,"Lower Hose, Hose Water","To 05/01/06. B4000.",,Lower,
111,"2020-08-05 07:17:36",image/png,ece00cc879596f893fe761c83e09907cc0a31916,32970,/ec/e0/0c/c8/ece00cc879596f893fe761c83e09907cc0a31916.png,,https://songer.datasn.com/data/api/v1/u_e49e7f0fcb85c5451b03/accessories_and_parts_for_mazda/by_table/production_image_access/ec/e0/0c/c8/ece00cc879596f893fe761c83e09907cc0a31916.png,113,"2020-08-04 05:48:53",130,"2020-08-03 11:08:07","Radiator Coolant Hose",1F22-15-185,30.01,22.5,"Radiator & Cooling",part,"Lower Hose, Hose Water","To 05/01/06. B4000.",,Lower,
112,"2020-08-05 07:17:55",image/png,3c73686b505af9915489d988d372e77dcf418a6d,5830,/3c/73/68/6b/3c73686b505af9915489d988d372e77dcf418a6d.png,,https://songer.datasn.com/data/api/v1/u_e49e7f0fcb85c5451b03/accessories_and_parts_for_mazda/by_table/production_image_access/3c/73/68/6b/3c73686b505af9915489d988d372e77dcf418a6d.png,114,"2020-08-04 05:49:14",131,"2020-08-03 11:08:20","Radiator Coolant Hose",AJC1-15-186A,79.65,59.73,"Radiator & Cooling",part,"Hose Water","To 10/03/2005.",,Upper,
113,"2020-08-05 07:18:01",image/png,7472b27f4f6b7212199f0437dbb42bbbf4c530a8,74065,/74/72/b2/7f/7472b27f4f6b7212199f0437dbb42bbbf4c530a8.png,,https://songer.datasn.com/data/api/v1/u_e49e7f0fcb85c5451b03/accessories_and_parts_for_mazda/by_table/production_image_access/74/72/b2/7f/7472b27f4f6b7212199f0437dbb42bbbf4c530a8.png,115,"2020-08-04 05:49:14",131,"2020-08-03 11:08:20","Radiator Coolant Hose",AJC1-15-186A,79.65,59.73,"Radiator & Cooling",part,"Hose Water","To 10/03/2005.",,Upper,
114,"2020-08-05 07:18:16",image/png,1e77cfd417dad2bbf777eb1e1560324fe6349b22,29970,/1e/77/cf/d4/1e77cfd417dad2bbf777eb1e1560324fe6349b22.png,,https://songer.datasn.com/data/api/v1/u_e49e7f0fcb85c5451b03/accessories_and_parts_for_mazda/by_table/production_image_access/1e/77/cf/d4/1e77cfd417dad2bbf777eb1e1560324fe6349b22.png,116,"2020-08-04 05:49:14",131,"2020-08-03 11:08:20","Radiator Coolant Hose",AJC1-15-186A,79.65,59.73,"Radiator & Cooling",part,"Hose Water","To 10/03/2005.",,Upper,
115,"2020-08-05 07:18:27",image/png,7e1a8faf2ffefb37407c512f6da281280e325de0,4799,/7e/1a/8f/af/7e1a8faf2ffefb37407c512f6da281280e325de0.png,,https://songer.datasn.com/data/api/v1/u_e49e7f0fcb85c5451b03/accessories_and_parts_for_mazda/by_table/production_image_access/7e/1a/8f/af/7e1a8faf2ffefb37407c512f6da281280e325de0.png,117,"2020-08-04 05:49:31",133,"2020-08-03 11:09:13","Radiator Coolant Hose",BP8J-15-186B,23.68,17.75,"Radiator & Cooling",part,"Hose Water",,,Upper,
116,"2020-08-05 07:18:35",image/png,c108370b222ac5757652d70546fccd4287380eea,64312,/c1/08/37/0b/c108370b222ac5757652d70546fccd4287380eea.png,,https://songer.datasn.com/data/api/v1/u_e49e7f0fcb85c5451b03/accessories_and_parts_for_mazda/by_table/production_image_access/c1/08/37/0b/c108370b222ac5757652d70546fccd4287380eea.png,118,"2020-08-04 05:49:31",133,"2020-08-03 11:09:13","Radiator Coolant Hose",BP8J-15-186B,23.68,17.75,"Radiator & Cooling",part,"Hose Water",,,Upper,
117,"2020-08-05 07:18:46",image/png,b1bd48f407eb896d67b0ad1c260acfbe4158fed3,24992,/b1/bd/48/f4/b1bd48f407eb896d67b0ad1c260acfbe4158fed3.png,,https://songer.datasn.com/data/api/v1/u_e49e7f0fcb85c5451b03/accessories_and_parts_for_mazda/by_table/production_image_access/b1/bd/48/f4/b1bd48f407eb896d67b0ad1c260acfbe4158fed3.png,119,"2020-08-04 05:49:31",133,"2020-08-03 11:09:13","Radiator Coolant Hose",BP8J-15-186B,23.68,17.75,"Radiator & Cooling",part,"Hose Water",,,Upper,
118,"2020-08-05 07:18:49",image/png,ecc14413f8cf7c2ce6c05dbaec174dc2c04a97bb,8409,/ec/c1/44/13/ecc14413f8cf7c2ce6c05dbaec174dc2c04a97bb.png,,https://songer.datasn.com/data/api/v1/u_e49e7f0fcb85c5451b03/accessories_and_parts_for_mazda/by_table/production_image_access/ec/c1/44/13/ecc14413f8cf7c2ce6c05dbaec174dc2c04a97bb.png,120,"2020-08-04 05:49:46",134,"2020-08-03 11:09:20","Radiator Coolant Hose",PEKK-15-18Z,52.82,39.6,"Radiator & Cooling",part,"Clamp Water Hose","Pipe to Engine.",,Lower,
119,"2020-08-05 07:19:06",image/png,01ed07bec90738e457f5571449fa6d546529a7d7,70469,/01/ed/07/be/01ed07bec90738e457f5571449fa6d546529a7d7.png,,https://songer.datasn.com/data/api/v1/u_e49e7f0fcb85c5451b03/accessories_and_parts_for_mazda/by_table/production_image_access/01/ed/07/be/01ed07bec90738e457f5571449fa6d546529a7d7.png,121,"2020-08-04 05:49:46",134,"2020-08-03 11:09:20","Radiator Coolant Hose",PEKK-15-18Z,52.82,39.6,"Radiator & Cooling",part,"Clamp Water Hose","Pipe to Engine.",,Lower,
120,"2020-08-05 07:19:21",image/png,9fba065f6d95fcdd839bf8e133f820c7c13d5425,27114,/9f/ba/06/5f/9fba065f6d95fcdd839bf8e133f820c7c13d5425.png,,https://songer.datasn.com/data/api/v1/u_e49e7f0fcb85c5451b03/accessories_and_parts_for_mazda/by_table/production_image_access/9f/ba/06/5f/9fba065f6d95fcdd839bf8e133f820c7c13d5425.png,122,"2020-08-04 05:49:46",134,"2020-08-03 11:09:20","Radiator Coolant Hose",PEKK-15-18Z,52.82,39.6,"Radiator & Cooling",part,"Clamp Water Hose","Pipe to Engine.",,Lower,
121,"2020-08-05 07:19:40",image/png,88cb0d06913f13ebbf8fc3cb13ab541a904bf50d,6373,/88/cb/0d/06/88cb0d06913f13ebbf8fc3cb13ab541a904bf50d.png,,https://songer.datasn.com/data/api/v1/u_e49e7f0fcb85c5451b03/accessories_and_parts_for_mazda/by_table/production_image_access/88/cb/0d/06/88cb0d06913f13ebbf8fc3cb13ab541a904bf50d.png,123,"2020-08-04 05:49:53",135,"2020-08-03 11:09:32","Radiator Coolant Hose",SH01-15-18XA,23.04,17.28,"Radiator & Cooling",part,"Hose Water",,,Upper,
122,"2020-08-05 07:19:54",image/png,2d06ec577a370fc968332e5869c24ff33df5cef8,87813,/2d/06/ec/57/2d06ec577a370fc968332e5869c24ff33df5cef8.png,,https://songer.datasn.com/data/api/v1/u_e49e7f0fcb85c5451b03/accessories_and_parts_for_mazda/by_table/production_image_access/2d/06/ec/57/2d06ec577a370fc968332e5869c24ff33df5cef8.png,124,"2020-08-04 05:49:53",135,"2020-08-03 11:09:32","Radiator Coolant Hose",SH01-15-18XA,23.04,17.28,"Radiator & Cooling",part,"Hose Water",,,Upper,
123,"2020-08-05 07:20:00",image/png,13048c694f1d3567d74d646c6719b2d5edda16af,35350,/13/04/8c/69/13048c694f1d3567d74d646c6719b2d5edda16af.png,,https://songer.datasn.com/data/api/v1/u_e49e7f0fcb85c5451b03/accessories_and_parts_for_mazda/by_table/production_image_access/13/04/8c/69/13048c694f1d3567d74d646c6719b2d5edda16af.png,125,"2020-08-04 05:49:53",135,"2020-08-03 11:09:32","Radiator Coolant Hose",SH01-15-18XA,23.04,17.28,"Radiator & Cooling",part,"Hose Water",,,Upper,
124,"2020-08-05 07:20:08",image/png,dc122e87cfadcd80639ff533a995de534651094a,15713,/dc/12/2e/87/dc122e87cfadcd80639ff533a995de534651094a.png,,https://songer.datasn.com/data/api/v1/u_e49e7f0fcb85c5451b03/accessories_and_parts_for_mazda/by_table/production_image_access/dc/12/2e/87/dc122e87cfadcd80639ff533a995de534651094a.png,126,"2020-08-04 05:50:38",138,"2020-08-03 11:10:11",Radiator,FS8M-15-200B,442.52,331.83,"Radiator & Cooling",part,,"Protege. With ac. Auto trans.","FS8M-15-200, FS8M-15-200A",,
125,"2020-08-05 07:20:16",image/png,d86b40677226af327774938a702c6efcccefb7f1,86208,/d8/6b/40/67/d86b40677226af327774938a702c6efcccefb7f1.png,,https://songer.datasn.com/data/api/v1/u_e49e7f0fcb85c5451b03/accessories_and_parts_for_mazda/by_table/production_image_access/d8/6b/40/67/d86b40677226af327774938a702c6efcccefb7f1.png,127,"2020-08-04 05:50:38",138,"2020-08-03 11:10:11",Radiator,FS8M-15-200B,442.52,331.83,"Radiator & Cooling",part,,"Protege. With ac. Auto trans.","FS8M-15-200, FS8M-15-200A",,
126,"2020-08-05 07:20:30",image/png,8d3fc78bfec66c2eb1032d62acf0c2790ae647bf,35784,/8d/3f/c7/8b/8d3fc78bfec66c2eb1032d62acf0c2790ae647bf.png,,https://songer.datasn.com/data/api/v1/u_e49e7f0fcb85c5451b03/accessories_and_parts_for_mazda/by_table/production_image_access/8d/3f/c7/8b/8d3fc78bfec66c2eb1032d62acf0c2790ae647bf.png,128,"2020-08-04 05:50:38",138,"2020-08-03 11:10:11",Radiator,FS8M-15-200B,442.52,331.83,"Radiator & Cooling",part,,"Protege. With ac. Auto trans.","FS8M-15-200, FS8M-15-200A",,
127,"2020-08-05 07:20:37",image/png,06fcfdb3d01cb1e18ce5808435f37e20e8dcce7e,10068,/06/fc/fd/b3/06fcfdb3d01cb1e18ce5808435f37e20e8dcce7e.png,,https://songer.datasn.com/data/api/v1/u_e49e7f0fcb85c5451b03/accessories_and_parts_for_mazda/by_table/production_image_access/06/fc/fd/b3/06fcfdb3d01cb1e18ce5808435f37e20e8dcce7e.png,129,"2020-08-04 05:51:07",140,"2020-08-03 11:10:42",Radiator,L33X-15-200,416.8,312.54,"Radiator & Cooling",part,,"Mazda3. Auto trans.",,,
128,"2020-08-05 07:20:54",image/png,4ed8096aed5057d9984c542354eabc56374d5a1e,80798,/4e/d8/09/6a/4ed8096aed5057d9984c542354eabc56374d5a1e.png,,https://songer.datasn.com/data/api/v1/u_e49e7f0fcb85c5451b03/accessories_and_parts_for_mazda/by_table/production_image_access/4e/d8/09/6a/4ed8096aed5057d9984c542354eabc56374d5a1e.png,130,"2020-08-04 05:51:07",140,"2020-08-03 11:10:42",Radiator,L33X-15-200,416.8,312.54,"Radiator & Cooling",part,,"Mazda3. Auto trans.",,,
129,"2020-08-05 07:20:58",image/png,050e2fb6ff35b21e144395eb22e03145cd47d9b0,32056,/05/0e/2f/b6/050e2fb6ff35b21e144395eb22e03145cd47d9b0.png,,https://songer.datasn.com/data/api/v1/u_e49e7f0fcb85c5451b03/accessories_and_parts_for_mazda/by_table/production_image_access/05/0e/2f/b6/050e2fb6ff35b21e144395eb22e03145cd47d9b0.png,131,"2020-08-04 05:51:07",140,"2020-08-03 11:10:42",Radiator,L33X-15-200,416.8,312.54,"Radiator & Cooling",part,,"Mazda3. Auto trans.",,,
130,"2020-08-05 07:21:15",image/png,530adcde0dd86fc6ccd243539ef4d397205e8e18,10008,/53/0a/dc/de/530adcde0dd86fc6ccd243539ef4d397205e8e18.png,,https://songer.datasn.com/data/api/v1/u_e49e7f0fcb85c5451b03/accessories_and_parts_for_mazda/by_table/production_image_access/53/0a/dc/de/530adcde0dd86fc6ccd243539ef4d397205e8e18.png,132,"2020-08-04 05:51:18",141,"2020-08-03 11:11:03",Radiator,PAF1-15-200,411.09,308.25,"Radiator & Cooling",part,,"Mazda3. Japan built.",,,
131,"2020-08-05 07:21:19",image/png,87b63761fea0fdcf6a2078714a5a834ffe064670,76312,/87/b6/37/61/87b63761fea0fdcf6a2078714a5a834ffe064670.png,,https://songer.datasn.com/data/api/v1/u_e49e7f0fcb85c5451b03/accessories_and_parts_for_mazda/by_table/production_image_access/87/b6/37/61/87b63761fea0fdcf6a2078714a5a834ffe064670.png,133,"2020-08-04 05:51:18",141,"2020-08-03 11:11:03",Radiator,PAF1-15-200,411.09,308.25,"Radiator & Cooling",part,,"Mazda3. Japan built.",,,
132,"2020-08-05 07:21:43",image/png,e40b5c355e1119e2e0899efffebfc6d5ea80a0d6,35361,/e4/0b/5c/35/e40b5c355e1119e2e0899efffebfc6d5ea80a0d6.png,,https://songer.datasn.com/data/api/v1/u_e49e7f0fcb85c5451b03/accessories_and_parts_for_mazda/by_table/production_image_access/e4/0b/5c/35/e40b5c355e1119e2e0899efffebfc6d5ea80a0d6.png,134,"2020-08-04 05:51:18",141,"2020-08-03 11:11:03",Radiator,PAF1-15-200,411.09,308.25,"Radiator & Cooling",part,,"Mazda3. Japan built.",,,
133,"2020-08-05 07:21:55",image/png,95936aca6dde8153e80c0e91f8641803d7498334,22581,/95/93/6a/ca/95936aca6dde8153e80c0e91f8641803d7498334.png,,https://songer.datasn.com/data/api/v1/u_e49e7f0fcb85c5451b03/accessories_and_parts_for_mazda/by_table/production_image_access/95/93/6a/ca/95936aca6dde8153e80c0e91f8641803d7498334.png,135,"2020-08-04 05:51:30",142,"2020-08-03 11:11:16",Radiator,PE18-15-20YA,274.53,205.86,"Radiator & Cooling",part,,"Mazda3. 2.0l. 2.5l. Japan built.",PE18-15-20Y,,
134,"2020-08-05 07:22:03",image/png,c4a1a15311ab2d46dd7ca21b41a9607ca4d5e73a,84066,/c4/a1/a1/53/c4a1a15311ab2d46dd7ca21b41a9607ca4d5e73a.png,,https://songer.datasn.com/data/api/v1/u_e49e7f0fcb85c5451b03/accessories_and_parts_for_mazda/by_table/production_image_access/c4/a1/a1/53/c4a1a15311ab2d46dd7ca21b41a9607ca4d5e73a.png,136,"2020-08-04 05:51:30",142,"2020-08-03 11:11:16",Radiator,PE18-15-20YA,274.53,205.86,"Radiator & Cooling",part,,"Mazda3. 2.0l. 2.5l. Japan built.",PE18-15-20Y,,
135,"2020-08-05 07:22:22",image/png,41c77806efb54c6e95bd1a92f488e9381a640237,34676,/41/c7/78/06/41c77806efb54c6e95bd1a92f488e9381a640237.png,,https://songer.datasn.com/data/api/v1/u_e49e7f0fcb85c5451b03/accessories_and_parts_for_mazda/by_table/production_image_access/41/c7/78/06/41c77806efb54c6e95bd1a92f488e9381a640237.png,137,"2020-08-04 05:51:30",142,"2020-08-03 11:11:16",Radiator,PE18-15-20YA,274.53,205.86,"Radiator & Cooling",part,,"Mazda3. 2.0l. 2.5l. Japan built.",PE18-15-20Y,,
136,"2020-08-05 07:22:30",image/png,95936aca6dde8153e80c0e91f8641803d7498334,22581,/95/93/6a/ca/95936aca6dde8153e80c0e91f8641803d7498334.png,,https://songer.datasn.com/data/api/v1/u_e49e7f0fcb85c5451b03/accessories_and_parts_for_mazda/by_table/production_image_access/95/93/6a/ca/95936aca6dde8153e80c0e91f8641803d7498334.png,138,"2020-08-04 05:51:33",143,"2020-08-03 11:11:25",Radiator,PEDD-15-200B,270.48,202.83,"Radiator & Cooling",part,,"Mazda3. 2.0l. Mexico built.","PEDD-15-200, PEDD-15-200A",,
137,"2020-08-05 07:22:32",image/png,c4a1a15311ab2d46dd7ca21b41a9607ca4d5e73a,84066,/c4/a1/a1/53/c4a1a15311ab2d46dd7ca21b41a9607ca4d5e73a.png,,https://songer.datasn.com/data/api/v1/u_e49e7f0fcb85c5451b03/accessories_and_parts_for_mazda/by_table/production_image_access/c4/a1/a1/53/c4a1a15311ab2d46dd7ca21b41a9607ca4d5e73a.png,139,"2020-08-04 05:51:33",143,"2020-08-03 11:11:25",Radiator,PEDD-15-200B,270.48,202.83,"Radiator & Cooling",part,,"Mazda3. 2.0l. Mexico built.","PEDD-15-200, PEDD-15-200A",,
138,"2020-08-05 07:22:51",image/png,41c77806efb54c6e95bd1a92f488e9381a640237,34676,/41/c7/78/06/41c77806efb54c6e95bd1a92f488e9381a640237.png,,https://songer.datasn.com/data/api/v1/u_e49e7f0fcb85c5451b03/accessories_and_parts_for_mazda/by_table/production_image_access/41/c7/78/06/41c77806efb54c6e95bd1a92f488e9381a640237.png,140,"2020-08-04 05:51:33",143,"2020-08-03 11:11:25",Radiator,PEDD-15-200B,270.48,202.83,"Radiator & Cooling",part,,"Mazda3. 2.0l. Mexico built.","PEDD-15-200, PEDD-15-200A",,
139,"2020-08-05 07:23:07",image/png,dc122e87cfadcd80639ff533a995de534651094a,15713,/dc/12/2e/87/dc122e87cfadcd80639ff533a995de534651094a.png,,https://songer.datasn.com/data/api/v1/u_e49e7f0fcb85c5451b03/accessories_and_parts_for_mazda/by_table/production_image_access/dc/12/2e/87/dc122e87cfadcd80639ff533a995de534651094a.png,141,"2020-08-04 05:51:49",144,"2020-08-03 11:11:37",Radiator,RF3F-15-200C,426.2,319.59,"Radiator & Cooling",part,,,RF3F-15-200B,,
140,"2020-08-05 07:23:29",image/png,d86b40677226af327774938a702c6efcccefb7f1,86208,/d8/6b/40/67/d86b40677226af327774938a702c6efcccefb7f1.png,,https://songer.datasn.com/data/api/v1/u_e49e7f0fcb85c5451b03/accessories_and_parts_for_mazda/by_table/production_image_access/d8/6b/40/67/d86b40677226af327774938a702c6efcccefb7f1.png,142,"2020-08-04 05:51:49",144,"2020-08-03 11:11:37",Radiator,RF3F-15-200C,426.2,319.59,"Radiator & Cooling",part,,,RF3F-15-200B,,
141,"2020-08-05 07:23:39",image/png,8d3fc78bfec66c2eb1032d62acf0c2790ae647bf,35784,/8d/3f/c7/8b/8d3fc78bfec66c2eb1032d62acf0c2790ae647bf.png,,https://songer.datasn.com/data/api/v1/u_e49e7f0fcb85c5451b03/accessories_and_parts_for_mazda/by_table/production_image_access/8d/3f/c7/8b/8d3fc78bfec66c2eb1032d62acf0c2790ae647bf.png,143,"2020-08-04 05:51:49",144,"2020-08-03 11:11:37",Radiator,RF3F-15-200C,426.2,319.59,"Radiator & Cooling",part,,,RF3F-15-200B,,
142,"2020-08-05 07:23:54",image/png,928f348d7bf419fa1f945f7be439edf57595492b,22513,/92/8f/34/8d/928f348d7bf419fa1f945f7be439edf57595492b.png,,https://songer.datasn.com/data/api/v1/u_e49e7f0fcb85c5451b03/accessories_and_parts_for_mazda/by_table/production_image_access/92/8f/34/8d/928f348d7bf419fa1f945f7be439edf57595492b.png,144,"2020-08-04 05:52:09",145,"2020-08-03 09:51:12",Radiator,SH9V-15-200,269.42,202.03,"Radiator & Cooling",part,,,,,
143,"2020-08-05 07:23:59",image/png,33724ca8b16cc4c75781d793480f062fcb3b75ed,89453,/33/72/4c/a8/33724ca8b16cc4c75781d793480f062fcb3b75ed.png,,https://songer.datasn.com/data/api/v1/u_e49e7f0fcb85c5451b03/accessories_and_parts_for_mazda/by_table/production_image_access/33/72/4c/a8/33724ca8b16cc4c75781d793480f062fcb3b75ed.png,145,"2020-08-04 05:52:09",145,"2020-08-03 09:51:12",Radiator,SH9V-15-200,269.42,202.03,"Radiator & Cooling",part,,,,,
144,"2020-08-05 07:24:05",image/png,13048c694f1d3567d74d646c6719b2d5edda16af,35350,/13/04/8c/69/13048c694f1d3567d74d646c6719b2d5edda16af.png,,https://songer.datasn.com/data/api/v1/u_e49e7f0fcb85c5451b03/accessories_and_parts_for_mazda/by_table/production_image_access/13/04/8c/69/13048c694f1d3567d74d646c6719b2d5edda16af.png,146,"2020-08-04 05:52:09",145,"2020-08-03 09:51:12",Radiator,SH9V-15-200,269.42,202.03,"Radiator & Cooling",part,,,,,
145,"2020-08-05 07:24:20",image/png,80492ec74ab69eb86a04a81562ca6d3ffe81fbec,19023,/80/49/2e/c7/80492ec74ab69eb86a04a81562ca6d3ffe81fbec.png,,https://songer.datasn.com/data/api/v1/u_e49e7f0fcb85c5451b03/accessories_and_parts_for_mazda/by_table/production_image_access/80/49/2e/c7/80492ec74ab69eb86a04a81562ca6d3ffe81fbec.png,147,"2020-08-04 05:52:16",146,"2020-08-03 11:11:48",Radiator,ZL01-15-200D,288.15,216.06,"Radiator & Cooling",part,,"Protege. Manual trans.",ZL01-15-200A,,
146,"2020-08-05 07:24:40",image/png,dde3c6af4c1c3af8de2221dbce8519f5bcf06f88,84390,/dd/e3/c6/af/dde3c6af4c1c3af8de2221dbce8519f5bcf06f88.png,,https://songer.datasn.com/data/api/v1/u_e49e7f0fcb85c5451b03/accessories_and_parts_for_mazda/by_table/production_image_access/dd/e3/c6/af/dde3c6af4c1c3af8de2221dbce8519f5bcf06f88.png,148,"2020-08-04 05:52:16",146,"2020-08-03 11:11:48",Radiator,ZL01-15-200D,288.15,216.06,"Radiator & Cooling",part,,"Protege. Manual trans.",ZL01-15-200A,,
147,"2020-08-05 07:24:50",image/png,a1a5f206c1e583a045a3a39157554785b0aceddd,35599,/a1/a5/f2/06/a1a5f206c1e583a045a3a39157554785b0aceddd.png,,https://songer.datasn.com/data/api/v1/u_e49e7f0fcb85c5451b03/accessories_and_parts_for_mazda/by_table/production_image_access/a1/a5/f2/06/a1a5f206c1e583a045a3a39157554785b0aceddd.png,149,"2020-08-04 05:52:16",146,"2020-08-03 11:11:48",Radiator,ZL01-15-200D,288.15,216.06,"Radiator & Cooling",part,,"Protege. Manual trans.",ZL01-15-200A,,
148,"2020-08-05 07:25:12",image/png,dc122e87cfadcd80639ff533a995de534651094a,15713,/dc/12/2e/87/dc122e87cfadcd80639ff533a995de534651094a.png,,https://songer.datasn.com/data/api/v1/u_e49e7f0fcb85c5451b03/accessories_and_parts_for_mazda/by_table/production_image_access/dc/12/2e/87/dc122e87cfadcd80639ff533a995de534651094a.png,150,"2020-08-04 05:52:28",147,"2020-08-03 11:12:05",Radiator,ZM39-15-200C,401.66,301.19,"Radiator & Cooling",part,,"Protege. 2.0l. With ac. Manual trans.","ZL05-15-200, ZM39-15-200, ZM39-15-200B",,