production_image.id,production_image.ts,production_image.source_content_type,production_image.hash_file_content,production_image.size,production_image.path,production_image.title,production_image.access,image_slug.id,image_slug.ts,production.id,production.ts,production.title,production.part_number,production.price,production.sale_price,production.category,production.mark,production.other_name,production.description,production.replaces,production.position,production.note
101,"2020-08-06 10:56:40",image/jpg,f7302668f627cee97f4c57921c5b3e1be7c940ba,34035,/f7/30/26/68/f7302668f627cee97f4c57921c5b3e1be7c940ba.jpg,,https://songer.datasn.com/data/api/v1/u_e49e7f0fcb85c5451b03/accessories_and_parts_for_volkswagen/by_table/production_image_access/f7/30/26/68/f7302668f627cee97f4c57921c5b3e1be7c940ba.jpg,102,"2020-08-05 05:49:03",42,"2020-08-05 03:38:38","Floor Mat",5N1-061-541-DSP,190,148.96,"Floor Mats",accessory,,,,,
102,"2020-08-06 10:56:54",image/gif,105b21275200d1490c31c94570019cd74aa57a92,66727,/10/5b/21/27/105b21275200d1490c31c94570019cd74aa57a92.gif,,https://songer.datasn.com/data/api/v1/u_e49e7f0fcb85c5451b03/accessories_and_parts_for_volkswagen/by_table/production_image_access/10/5b/21/27/105b21275200d1490c31c94570019cd74aa57a92.gif,103,"2020-08-05 05:49:21",43,"2020-08-05 03:38:38","Floor Mats",5NL-061-550-A-041,149,116.82,"Floor Mats",accessory,,,,,
103,"2020-08-06 11:00:11",image/gif,ab33b30b6921494b176e724e12746dc3e7515db9,168060,/ab/33/b3/0b/ab33b30b6921494b176e724e12746dc3e7515db9.gif,,https://songer.datasn.com/data/api/v1/u_e49e7f0fcb85c5451b03/accessories_and_parts_for_volkswagen/by_table/production_image_access/ab/33/b3/0b/ab33b30b6921494b176e724e12746dc3e7515db9.gif,104,"2020-08-05 05:49:24",44,"2020-08-05 03:38:38","Floor Mat",5NN-061-541-B-DSP,190,148.96,"Floor Mats",accessory,,,,,
104,"2020-08-06 11:04:41",image/gif,a3ff9c2d6cbf36a49d63c455ef9097f869e434e9,215217,/a3/ff/9c/2d/a3ff9c2d6cbf36a49d63c455ef9097f869e434e9.gif,,https://songer.datasn.com/data/api/v1/u_e49e7f0fcb85c5451b03/accessories_and_parts_for_volkswagen/by_table/production_image_access/a3/ff/9c/2d/a3ff9c2d6cbf36a49d63c455ef9097f869e434e9.gif,105,"2020-08-05 05:50:00",47,"2020-08-05 03:38:38","Floor Mat",3CN-061-541-E-DSP,190,148.96,"Floor Mats",accessory,,,,,
105,"2020-08-06 11:05:48",image/gif,7118420b46328d63d6c1def8cb0c5046a6da9598,229820,/71/18/42/0b/7118420b46328d63d6c1def8cb0c5046a6da9598.gif,,https://songer.datasn.com/data/api/v1/u_e49e7f0fcb85c5451b03/accessories_and_parts_for_volkswagen/by_table/production_image_access/71/18/42/0b/7118420b46328d63d6c1def8cb0c5046a6da9598.gif,106,"2020-08-05 05:50:14",49,"2020-08-05 03:38:38","Floor Mats",561-061-550-E-041,105,82.32,"Floor Mats",accessory,,,,,
106,"2020-08-06 11:06:06",image/jpg,114e745bcebacc0b1791af25cf10d61ae610025d,24219,/11/4e/74/5b/114e745bcebacc0b1791af25cf10d61ae610025d.jpg,,https://songer.datasn.com/data/api/v1/u_e49e7f0fcb85c5451b03/accessories_and_parts_for_volkswagen/by_table/production_image_access/11/4e/74/5b/114e745bcebacc0b1791af25cf10d61ae610025d.jpg,107,"2020-08-05 05:50:20",50,"2020-08-05 05:50:20","Floor Mats",1C1-061-550-A-041,105,82.32,"Floor Mats",accessory,,,"ZVW-179-001-A, ZVW-179-002-A",,
107,"2020-08-06 11:06:28",image/jpg,e8a3189cf1f8372316b4ba7c3f79488342a6d5fc,53876,/e8/a3/18/9c/e8a3189cf1f8372316b4ba7c3f79488342a6d5fc.jpg,,https://songer.datasn.com/data/api/v1/u_e49e7f0fcb85c5451b03/accessories_and_parts_for_volkswagen/by_table/production_image_access/e8/a3/18/9c/e8a3189cf1f8372316b4ba7c3f79488342a6d5fc.jpg,108,"2020-08-05 05:50:20",50,"2020-08-05 05:50:20","Floor Mats",1C1-061-550-A-041,105,82.32,"Floor Mats",accessory,,,"ZVW-179-001-A, ZVW-179-002-A",,
108,"2020-08-06 11:09:20",image/gif,1d2913aa2356f4dd40388553f55acebf93d51359,264924,/1d/29/13/aa/1d2913aa2356f4dd40388553f55acebf93d51359.gif,,https://songer.datasn.com/data/api/v1/u_e49e7f0fcb85c5451b03/accessories_and_parts_for_volkswagen/by_table/production_image_access/1d/29/13/aa/1d2913aa2356f4dd40388553f55acebf93d51359.gif,109,"2020-08-05 05:50:41",52,"2020-08-05 03:38:38","Floor Mats",3CM-061-530-82V,105,82.32,"Floor Mats",accessory,,,,,
109,"2020-08-06 11:09:39",image/gif,6c1418be1044a81ac9a7ea5cb114658490f01308,84774,/6c/14/18/be/6c1418be1044a81ac9a7ea5cb114658490f01308.gif,,https://songer.datasn.com/data/api/v1/u_e49e7f0fcb85c5451b03/accessories_and_parts_for_volkswagen/by_table/production_image_access/6c/14/18/be/6c1418be1044a81ac9a7ea5cb114658490f01308.gif,110,"2020-08-05 05:50:57",53,"2020-08-05 03:38:38","Floor Mat",3CN-061-541-B-DSP,80,62.72,"Floor Mats",accessory,,,,,
110,"2020-08-06 11:09:55",image/jpg,9906365e767506c8d9c740d91e98196b839747ff,43140,/99/06/36/5e/9906365e767506c8d9c740d91e98196b839747ff.jpg,,https://songer.datasn.com/data/api/v1/u_e49e7f0fcb85c5451b03/accessories_and_parts_for_volkswagen/by_table/production_image_access/99/06/36/5e/9906365e767506c8d9c740d91e98196b839747ff.jpg,111,"2020-08-05 05:50:57",53,"2020-08-05 03:38:38","Floor Mat",3CN-061-541-B-DSP,80,62.72,"Floor Mats",accessory,,,,,
111,"2020-08-06 11:10:16",image/gif,f0c35397254a2892b13b76c437e5949c600b4245,192677,/f0/c3/53/97/f0c35397254a2892b13b76c437e5949c600b4245.gif,,https://songer.datasn.com/data/api/v1/u_e49e7f0fcb85c5451b03/accessories_and_parts_for_volkswagen/by_table/production_image_access/f0/c3/53/97/f0c35397254a2892b13b76c437e5949c600b4245.gif,112,"2020-08-05 05:51:08",54,"2020-08-05 03:38:38","Floor Mat",3CN-061-541-D-DSP,190,148.96,"Floor Mats",accessory,,,,,
112,"2020-08-06 11:10:31",image/gif,e8a3189cf1f8372316b4ba7c3f79488342a6d5fc,53876,/e8/a3/18/9c/e8a3189cf1f8372316b4ba7c3f79488342a6d5fc.gif,,https://songer.datasn.com/data/api/v1/u_e49e7f0fcb85c5451b03/accessories_and_parts_for_volkswagen/by_table/production_image_access/e8/a3/18/9c/e8a3189cf1f8372316b4ba7c3f79488342a6d5fc.gif,113,"2020-08-05 05:51:52",57,"2020-08-05 05:51:52","Floor Mats",1C1-061-550-041,105,82.32,"Floor Mats",accessory,,,"ZVW-179-001, ZVW-179-002, ZVW-179-002-R, ZVW-179-004",,
113,"2020-08-06 11:10:51",image/jpg,541a276541d0bdd1cffae5cc5e75d961907629ef,20603,/54/1a/27/65/541a276541d0bdd1cffae5cc5e75d961907629ef.jpg,,https://songer.datasn.com/data/api/v1/u_e49e7f0fcb85c5451b03/accessories_and_parts_for_volkswagen/by_table/production_image_access/54/1a/27/65/541a276541d0bdd1cffae5cc5e75d961907629ef.jpg,114,"2020-08-05 05:51:52",57,"2020-08-05 05:51:52","Floor Mats",1C1-061-550-041,105,82.32,"Floor Mats",accessory,,,"ZVW-179-001, ZVW-179-002, ZVW-179-002-R, ZVW-179-004",,
114,"2020-08-06 11:11:02",image/jpg,b70370c61810f30191e6e973bb04b9f6f605057c,20632,/b7/03/70/c6/b70370c61810f30191e6e973bb04b9f6f605057c.jpg,,https://songer.datasn.com/data/api/v1/u_e49e7f0fcb85c5451b03/accessories_and_parts_for_volkswagen/by_table/production_image_access/b7/03/70/c6/b70370c61810f30191e6e973bb04b9f6f605057c.jpg,115,"2020-08-05 05:51:52",57,"2020-08-05 05:51:52","Floor Mats",1C1-061-550-041,105,82.32,"Floor Mats",accessory,,,"ZVW-179-001, ZVW-179-002, ZVW-179-002-R, ZVW-179-004",,
115,"2020-08-06 11:11:21",image/jpeg,40983a924f9e1b2218191bd0bcb6d824dfb3673d,27277,/40/98/3a/92/40983a924f9e1b2218191bd0bcb6d824dfb3673d.jpg,,https://songer.datasn.com/data/api/v1/u_e49e7f0fcb85c5451b03/accessories_and_parts_for_volkswagen/by_table/production_image_access/40/98/3a/92/40983a924f9e1b2218191bd0bcb6d824dfb3673d.jpg,116,"2020-08-05 05:52:56",62,"2020-08-05 03:38:38","Floor Mats",4F0-061-511-528,45,35.28,"Floor Mats",accessory,,,,,
116,"2020-08-06 11:12:37",image/gif,feca9ca2a5e88e4034864eba7648bfc73b890ec4,150171,/fe/ca/9c/a2/feca9ca2a5e88e4034864eba7648bfc73b890ec4.gif,,https://songer.datasn.com/data/api/v1/u_e49e7f0fcb85c5451b03/accessories_and_parts_for_volkswagen/by_table/production_image_access/fe/ca/9c/a2/feca9ca2a5e88e4034864eba7648bfc73b890ec4.gif,117,"2020-08-05 05:53:15",63,"2020-08-05 03:38:38","Floor Mats",5NN-061-550-A-041,105,82.32,"Floor Mats",accessory,,,,,
117,"2020-08-06 11:12:46",image/jpg,90c3fda37f96ce1b3aff73f6694cb1464dce3ab7,45481,/90/c3/fd/a3/90c3fda37f96ce1b3aff73f6694cb1464dce3ab7.jpg,,https://songer.datasn.com/data/api/v1/u_e49e7f0fcb85c5451b03/accessories_and_parts_for_volkswagen/by_table/production_image_access/90/c3/fd/a3/90c3fda37f96ce1b3aff73f6694cb1464dce3ab7.jpg,118,"2020-08-05 05:53:23",64,"2020-08-05 05:53:23","Floor Mats",7L1-061-550-H-041,105,82.32,"Floor Mats",accessory,,,ZVW-379-006-A,,
118,"2020-08-06 11:13:12",image/gif,82f59081f90caddcabf25343fcc633683b0f869b,106647,/82/f5/90/81/82f59081f90caddcabf25343fcc633683b0f869b.gif,,https://songer.datasn.com/data/api/v1/u_e49e7f0fcb85c5451b03/accessories_and_parts_for_volkswagen/by_table/production_image_access/82/f5/90/81/82f59081f90caddcabf25343fcc633683b0f869b.gif,119,"2020-08-05 05:53:56",66,"2020-08-05 03:38:38","Floor Mats",3CN-061-550-B-041,149,116.82,"Floor Mats",accessory,,,,,
119,"2020-08-06 11:14:57",image/gif,82f59081f90caddcabf25343fcc633683b0f869b,106647,/82/f5/90/81/82f59081f90caddcabf25343fcc633683b0f869b.gif,,https://songer.datasn.com/data/api/v1/u_e49e7f0fcb85c5451b03/accessories_and_parts_for_volkswagen/by_table/production_image_access/82/f5/90/81/82f59081f90caddcabf25343fcc633683b0f869b.gif,120,"2020-08-05 05:54:08",67,"2020-08-05 03:38:38","Floor Mats",3CN-061-550-C-041,149,116.82,"Floor Mats",accessory,,,,,
120,"2020-08-06 11:15:24",image/png,a38bac42ce503320cf4caf8b9228fdef7e4dc411,29114,/a3/8b/ac/42/a38bac42ce503320cf4caf8b9228fdef7e4dc411.png,,https://songer.datasn.com/data/api/v1/u_e49e7f0fcb85c5451b03/accessories_and_parts_for_volkswagen/by_table/production_image_access/a3/8b/ac/42/a38bac42ce503320cf4caf8b9228fdef7e4dc411.png,123,"2020-08-05 05:54:28",70,"2020-08-05 05:54:28",Wheel,5G0-601-025-DR-JFN,581.43,455.84,"Wheel Accessories",accessory,,"18, sevilla.",,,
121,"2020-08-06 11:15:53",image/png,6a58e4904e1a2a23feb99d2d57a372b1609abe8b,74608,/6a/58/e4/90/6a58e4904e1a2a23feb99d2d57a372b1609abe8b.png,,https://songer.datasn.com/data/api/v1/u_e49e7f0fcb85c5451b03/accessories_and_parts_for_volkswagen/by_table/production_image_access/6a/58/e4/90/6a58e4904e1a2a23feb99d2d57a372b1609abe8b.png,124,"2020-08-05 05:54:28",70,"2020-08-05 05:54:28",Wheel,5G0-601-025-DR-JFN,581.43,455.84,"Wheel Accessories",accessory,,"18, sevilla.",,,
122,"2020-08-06 11:16:14",image/png,992c20f9873f13bcaa5264e2932fa4eab5ae17dd,30375,/99/2c/20/f9/992c20f9873f13bcaa5264e2932fa4eab5ae17dd.png,,https://songer.datasn.com/data/api/v1/u_e49e7f0fcb85c5451b03/accessories_and_parts_for_volkswagen/by_table/production_image_access/99/2c/20/f9/992c20f9873f13bcaa5264e2932fa4eab5ae17dd.png,125,"2020-08-05 05:54:28",70,"2020-08-05 05:54:28",Wheel,5G0-601-025-DR-JFN,581.43,455.84,"Wheel Accessories",accessory,,"18, sevilla.",,,
123,"2020-08-06 11:16:36",image/png,3c0c9e56419cc74d520abd41ccbce2c8d4711772,23316,/3c/0c/9e/56/3c0c9e56419cc74d520abd41ccbce2c8d4711772.png,,https://songer.datasn.com/data/api/v1/u_e49e7f0fcb85c5451b03/accessories_and_parts_for_volkswagen/by_table/production_image_access/3c/0c/9e/56/3c0c9e56419cc74d520abd41ccbce2c8d4711772.png,126,"2020-08-05 05:54:41",71,"2020-08-05 05:54:41",Wheel,3G8-601-025-F-FZZ,350,274.4,"Wheel Accessories",accessory,,"18 wheel.",,"Left, Right",
124,"2020-08-06 11:17:02",image/png,47829e0cb9f5c95e6655781c5b8e01059cd51f78,108573,/47/82/9e/0c/47829e0cb9f5c95e6655781c5b8e01059cd51f78.png,,https://songer.datasn.com/data/api/v1/u_e49e7f0fcb85c5451b03/accessories_and_parts_for_volkswagen/by_table/production_image_access/47/82/9e/0c/47829e0cb9f5c95e6655781c5b8e01059cd51f78.png,127,"2020-08-05 05:54:41",71,"2020-08-05 05:54:41",Wheel,3G8-601-025-F-FZZ,350,274.4,"Wheel Accessories",accessory,,"18 wheel.",,"Left, Right",
125,"2020-08-06 11:17:18",image/png,fa6abecee92e40c088a467b2c4947ae5b5e98478,57165,/fa/6a/be/ce/fa6abecee92e40c088a467b2c4947ae5b5e98478.png,,https://songer.datasn.com/data/api/v1/u_e49e7f0fcb85c5451b03/accessories_and_parts_for_volkswagen/by_table/production_image_access/fa/6a/be/ce/fa6abecee92e40c088a467b2c4947ae5b5e98478.png,128,"2020-08-05 05:54:41",71,"2020-08-05 05:54:41",Wheel,3G8-601-025-F-FZZ,350,274.4,"Wheel Accessories",accessory,,"18 wheel.",,"Left, Right",
126,"2020-08-06 11:17:24",image/png,43a679f327ef312b14088ec3b8b377cab1986476,19715,/43/a6/79/f3/43a679f327ef312b14088ec3b8b377cab1986476.png,,https://songer.datasn.com/data/api/v1/u_e49e7f0fcb85c5451b03/accessories_and_parts_for_volkswagen/by_table/production_image_access/43/a6/79/f3/43a679f327ef312b14088ec3b8b377cab1986476.png,129,"2020-08-05 05:54:51",72,"2020-08-05 05:54:51",Wheel,3G8-601-025-P-FZZ,404.29,316.96,"Wheel Accessories",accessory,,"19 wheel, montevideo.",,"Left, Right",
127,"2020-08-06 11:17:41",image/png,0f8eb947d058999c943de20e40bf8bf27dc9a78e,109435,/0f/8e/b9/47/0f8eb947d058999c943de20e40bf8bf27dc9a78e.png,,https://songer.datasn.com/data/api/v1/u_e49e7f0fcb85c5451b03/accessories_and_parts_for_volkswagen/by_table/production_image_access/0f/8e/b9/47/0f8eb947d058999c943de20e40bf8bf27dc9a78e.png,130,"2020-08-05 05:54:51",72,"2020-08-05 05:54:51",Wheel,3G8-601-025-P-FZZ,404.29,316.96,"Wheel Accessories",accessory,,"19 wheel, montevideo.",,"Left, Right",
128,"2020-08-06 11:17:47",image/png,fa6abecee92e40c088a467b2c4947ae5b5e98478,57165,/fa/6a/be/ce/fa6abecee92e40c088a467b2c4947ae5b5e98478.png,,https://songer.datasn.com/data/api/v1/u_e49e7f0fcb85c5451b03/accessories_and_parts_for_volkswagen/by_table/production_image_access/fa/6a/be/ce/fa6abecee92e40c088a467b2c4947ae5b5e98478.png,131,"2020-08-05 05:54:51",72,"2020-08-05 05:54:51",Wheel,3G8-601-025-P-FZZ,404.29,316.96,"Wheel Accessories",accessory,,"19 wheel, montevideo.",,"Left, Right",
129,"2020-08-06 11:18:05",image/png,2207eefb3e622f1534dc448c69006425e8603f0a,25158,/22/07/ee/fb/2207eefb3e622f1534dc448c69006425e8603f0a.png,,https://songer.datasn.com/data/api/v1/u_e49e7f0fcb85c5451b03/accessories_and_parts_for_volkswagen/by_table/production_image_access/22/07/ee/fb/2207eefb3e622f1534dc448c69006425e8603f0a.png,132,"2020-08-05 05:55:00",73,"2020-08-05 05:55:00",Wheel,5GM-601-025-N-FZZ,415.71,325.92,"Wheel Accessories",accessory,,"18, polanka.",,,
130,"2020-08-06 11:18:57",image/png,0288473174104d1d3f92ae7300b5beb8449fe116,74478,/02/88/47/31/0288473174104d1d3f92ae7300b5beb8449fe116.png,,https://songer.datasn.com/data/api/v1/u_e49e7f0fcb85c5451b03/accessories_and_parts_for_volkswagen/by_table/production_image_access/02/88/47/31/0288473174104d1d3f92ae7300b5beb8449fe116.png,133,"2020-08-05 05:55:00",73,"2020-08-05 05:55:00",Wheel,5GM-601-025-N-FZZ,415.71,325.92,"Wheel Accessories",accessory,,"18, polanka.",,,
131,"2020-08-06 11:19:13",image/png,a8371fda1ba2db5fec45378d977d6f2e73648d98,32428,/a8/37/1f/da/a8371fda1ba2db5fec45378d977d6f2e73648d98.png,,https://songer.datasn.com/data/api/v1/u_e49e7f0fcb85c5451b03/accessories_and_parts_for_volkswagen/by_table/production_image_access/a8/37/1f/da/a8371fda1ba2db5fec45378d977d6f2e73648d98.png,134,"2020-08-05 05:55:00",73,"2020-08-05 05:55:00",Wheel,5GM-601-025-N-FZZ,415.71,325.92,"Wheel Accessories",accessory,,"18, polanka.",,,
132,"2020-08-06 11:20:01",image/png,00cdf2b1898b0a11b8fb88bab744e42247b86b26,24940,/00/cd/f2/b1/00cdf2b1898b0a11b8fb88bab744e42247b86b26.png,,https://songer.datasn.com/data/api/v1/u_e49e7f0fcb85c5451b03/accessories_and_parts_for_volkswagen/by_table/production_image_access/00/cd/f2/b1/00cdf2b1898b0a11b8fb88bab744e42247b86b26.png,135,"2020-08-05 05:55:17",74,"2020-08-05 05:55:17",Wheel,5GM-601-025-AC-8Z8,437.14,342.72,"Wheel Accessories",accessory,,"16, diamond silver.",,,
133,"2020-08-06 11:22:36",image/png,b6a830c5e891a0e6a537cfa37109f3df7a798bc4,74786,/b6/a8/30/c5/b6a830c5e891a0e6a537cfa37109f3df7a798bc4.png,,https://songer.datasn.com/data/api/v1/u_e49e7f0fcb85c5451b03/accessories_and_parts_for_volkswagen/by_table/production_image_access/b6/a8/30/c5/b6a830c5e891a0e6a537cfa37109f3df7a798bc4.png,136,"2020-08-05 05:55:17",74,"2020-08-05 05:55:17",Wheel,5GM-601-025-AC-8Z8,437.14,342.72,"Wheel Accessories",accessory,,"16, diamond silver.",,,
134,"2020-08-06 11:23:00",image/png,b0c903f32b492d0380c62f9afc38863be2a48868,30375,/b0/c9/03/f3/b0c903f32b492d0380c62f9afc38863be2a48868.png,,https://songer.datasn.com/data/api/v1/u_e49e7f0fcb85c5451b03/accessories_and_parts_for_volkswagen/by_table/production_image_access/b0/c9/03/f3/b0c903f32b492d0380c62f9afc38863be2a48868.png,137,"2020-08-05 05:55:17",74,"2020-08-05 05:55:17",Wheel,5GM-601-025-AC-8Z8,437.14,342.72,"Wheel Accessories",accessory,,"16, diamond silver.",,,
135,"2020-08-06 11:23:31",image/png,e65dfd07e5c56678b707225e0943ce43a984f54e,31902,/e6/5d/fd/07/e65dfd07e5c56678b707225e0943ce43a984f54e.png,,https://songer.datasn.com/data/api/v1/u_e49e7f0fcb85c5451b03/accessories_and_parts_for_volkswagen/by_table/production_image_access/e6/5d/fd/07/e65dfd07e5c56678b707225e0943ce43a984f54e.png,138,"2020-08-05 05:55:40",75,"2020-08-05 05:55:40",Wheel,1J0-601-025-BB-8Z8,348.57,273.28,"Wheel Accessories",accessory,,"With R32. 17"".",,,
136,"2020-08-06 11:23:53",image/png,18ee1c5b78c4bdb03a97bbb8a5b693b7afe19716,59407,/18/ee/1c/5b/18ee1c5b78c4bdb03a97bbb8a5b693b7afe19716.png,,https://songer.datasn.com/data/api/v1/u_e49e7f0fcb85c5451b03/accessories_and_parts_for_volkswagen/by_table/production_image_access/18/ee/1c/5b/18ee1c5b78c4bdb03a97bbb8a5b693b7afe19716.png,139,"2020-08-05 05:55:40",75,"2020-08-05 05:55:40",Wheel,1J0-601-025-BB-8Z8,348.57,273.28,"Wheel Accessories",accessory,,"With R32. 17"".",,,
137,"2020-08-06 11:24:08",image/png,a805a3998b19cc1294a9c974e97a0ec127f4f144,23298,/a8/05/a3/99/a805a3998b19cc1294a9c974e97a0ec127f4f144.png,,https://songer.datasn.com/data/api/v1/u_e49e7f0fcb85c5451b03/accessories_and_parts_for_volkswagen/by_table/production_image_access/a8/05/a3/99/a805a3998b19cc1294a9c974e97a0ec127f4f144.png,140,"2020-08-05 05:55:40",75,"2020-08-05 05:55:40",Wheel,1J0-601-025-BB-8Z8,348.57,273.28,"Wheel Accessories",accessory,,"With R32. 17"".",,,
138,"2020-08-06 11:25:07",image/png,f18849a608d4d54eb97b0063cbf33f5a93406e09,22472,/f1/88/49/a6/f18849a608d4d54eb97b0063cbf33f5a93406e09.png,,https://songer.datasn.com/data/api/v1/u_e49e7f0fcb85c5451b03/accessories_and_parts_for_volkswagen/by_table/production_image_access/f1/88/49/a6/f18849a608d4d54eb97b0063cbf33f5a93406e09.png,141,"2020-08-05 05:55:54",76,"2020-08-05 05:55:54",Wheel,3G8-601-025-D-2ZT,595.71,467.04,"Wheel Accessories",accessory,,"20 wheel.",,"Left, Right",
139,"2020-08-06 11:26:40",image/png,dfff6ace4145f60adf0fab641c381fe00334011d,107900,/df/ff/6a/ce/dfff6ace4145f60adf0fab641c381fe00334011d.png,,https://songer.datasn.com/data/api/v1/u_e49e7f0fcb85c5451b03/accessories_and_parts_for_volkswagen/by_table/production_image_access/df/ff/6a/ce/dfff6ace4145f60adf0fab641c381fe00334011d.png,142,"2020-08-05 05:55:54",76,"2020-08-05 05:55:54",Wheel,3G8-601-025-D-2ZT,595.71,467.04,"Wheel Accessories",accessory,,"20 wheel.",,"Left, Right",
140,"2020-08-06 11:27:32",image/png,fa6abecee92e40c088a467b2c4947ae5b5e98478,57165,/fa/6a/be/ce/fa6abecee92e40c088a467b2c4947ae5b5e98478.png,,https://songer.datasn.com/data/api/v1/u_e49e7f0fcb85c5451b03/accessories_and_parts_for_volkswagen/by_table/production_image_access/fa/6a/be/ce/fa6abecee92e40c088a467b2c4947ae5b5e98478.png,143,"2020-08-05 05:55:54",76,"2020-08-05 05:55:54",Wheel,3G8-601-025-D-2ZT,595.71,467.04,"Wheel Accessories",accessory,,"20 wheel.",,"Left, Right",
141,"2020-08-06 11:27:56",image/png,80887b42a75fd5560fbf5463233174edc163e15e,19699,/80/88/7b/42/80887b42a75fd5560fbf5463233174edc163e15e.png,,https://songer.datasn.com/data/api/v1/u_e49e7f0fcb85c5451b03/accessories_and_parts_for_volkswagen/by_table/production_image_access/80/88/7b/42/80887b42a75fd5560fbf5463233174edc163e15e.png,144,"2020-08-05 05:55:56",77,"2020-08-05 05:55:56",Wheel,3G8-601-025-G-DM9,404.29,316.96,"Wheel Accessories",accessory,,"19 wheel, chennai.",,"Left, Right",
142,"2020-08-06 11:28:23",image/png,0d12e5c74d42a9ae9ac92ff180229d88b74fb5a7,108545,/0d/12/e5/c7/0d12e5c74d42a9ae9ac92ff180229d88b74fb5a7.png,,https://songer.datasn.com/data/api/v1/u_e49e7f0fcb85c5451b03/accessories_and_parts_for_volkswagen/by_table/production_image_access/0d/12/e5/c7/0d12e5c74d42a9ae9ac92ff180229d88b74fb5a7.png,145,"2020-08-05 05:55:56",77,"2020-08-05 05:55:56",Wheel,3G8-601-025-G-DM9,404.29,316.96,"Wheel Accessories",accessory,,"19 wheel, chennai.",,"Left, Right",
143,"2020-08-06 11:28:26",image/png,fa6abecee92e40c088a467b2c4947ae5b5e98478,57165,/fa/6a/be/ce/fa6abecee92e40c088a467b2c4947ae5b5e98478.png,,https://songer.datasn.com/data/api/v1/u_e49e7f0fcb85c5451b03/accessories_and_parts_for_volkswagen/by_table/production_image_access/fa/6a/be/ce/fa6abecee92e40c088a467b2c4947ae5b5e98478.png,146,"2020-08-05 05:55:56",77,"2020-08-05 05:55:56",Wheel,3G8-601-025-G-DM9,404.29,316.96,"Wheel Accessories",accessory,,"19 wheel, chennai.",,"Left, Right",
144,"2020-08-06 11:28:37",image/png,e65dfd07e5c56678b707225e0943ce43a984f54e,31902,/e6/5d/fd/07/e65dfd07e5c56678b707225e0943ce43a984f54e.png,,https://songer.datasn.com/data/api/v1/u_e49e7f0fcb85c5451b03/accessories_and_parts_for_volkswagen/by_table/production_image_access/e6/5d/fd/07/e65dfd07e5c56678b707225e0943ce43a984f54e.png,147,"2020-08-05 05:56:13",78,"2020-08-05 05:56:13",Wheel,1J0-601-025-BA-88Z,361.43,283.36,"Wheel Accessories",accessory,,"With R32. 18"".",1J0-601-025-BA-8Z8,,
145,"2020-08-06 11:29:19",image/png,18ee1c5b78c4bdb03a97bbb8a5b693b7afe19716,59407,/18/ee/1c/5b/18ee1c5b78c4bdb03a97bbb8a5b693b7afe19716.png,,https://songer.datasn.com/data/api/v1/u_e49e7f0fcb85c5451b03/accessories_and_parts_for_volkswagen/by_table/production_image_access/18/ee/1c/5b/18ee1c5b78c4bdb03a97bbb8a5b693b7afe19716.png,148,"2020-08-05 05:56:13",78,"2020-08-05 05:56:13",Wheel,1J0-601-025-BA-88Z,361.43,283.36,"Wheel Accessories",accessory,,"With R32. 18"".",1J0-601-025-BA-8Z8,,
146,"2020-08-06 11:29:42",image/png,a805a3998b19cc1294a9c974e97a0ec127f4f144,23298,/a8/05/a3/99/a805a3998b19cc1294a9c974e97a0ec127f4f144.png,,https://songer.datasn.com/data/api/v1/u_e49e7f0fcb85c5451b03/accessories_and_parts_for_volkswagen/by_table/production_image_access/a8/05/a3/99/a805a3998b19cc1294a9c974e97a0ec127f4f144.png,149,"2020-08-05 05:56:13",78,"2020-08-05 05:56:13",Wheel,1J0-601-025-BA-88Z,361.43,283.36,"Wheel Accessories",accessory,,"With R32. 18"".",1J0-601-025-BA-8Z8,,
147,"2020-08-06 11:29:56",image/png,c14d35921a8535313ec8f6fc305c49b770a24670,13465,/c1/4d/35/92/c14d35921a8535313ec8f6fc305c49b770a24670.png,,https://songer.datasn.com/data/api/v1/u_e49e7f0fcb85c5451b03/accessories_and_parts_for_volkswagen/by_table/production_image_access/c1/4d/35/92/c14d35921a8535313ec8f6fc305c49b770a24670.png,150,"2020-08-05 05:56:18",79,"2020-08-05 05:56:18","Outer Joint Assembly",5N0-498-099-B,575,386.4,"Wheel Accessories",accessory,"Cv Joint Kit, Wheelshaft","From 05/28/2013. 2.0L, auto trans, new, from 02/25/2013.",,"Left, Right, Front Outer",
148,"2020-08-06 11:30:48",image/png,c3e92154ff5ae8d7c784fa5037976505dd0832f9,56114,/c3/e9/21/54/c3e92154ff5ae8d7c784fa5037976505dd0832f9.png,,https://songer.datasn.com/data/api/v1/u_e49e7f0fcb85c5451b03/accessories_and_parts_for_volkswagen/by_table/production_image_access/c3/e9/21/54/c3e92154ff5ae8d7c784fa5037976505dd0832f9.png,151,"2020-08-05 05:56:18",79,"2020-08-05 05:56:18","Outer Joint Assembly",5N0-498-099-B,575,386.4,"Wheel Accessories",accessory,"Cv Joint Kit, Wheelshaft","From 05/28/2013. 2.0L, auto trans, new, from 02/25/2013.",,"Left, Right, Front Outer",
149,"2020-08-06 11:31:11",image/png,b7255fa5fb3ec1473f849835b7aec8bc561069b8,21766,/b7/25/5f/a5/b7255fa5fb3ec1473f849835b7aec8bc561069b8.png,,https://songer.datasn.com/data/api/v1/u_e49e7f0fcb85c5451b03/accessories_and_parts_for_volkswagen/by_table/production_image_access/b7/25/5f/a5/b7255fa5fb3ec1473f849835b7aec8bc561069b8.png,152,"2020-08-05 05:56:18",79,"2020-08-05 05:56:18","Outer Joint Assembly",5N0-498-099-B,575,386.4,"Wheel Accessories",accessory,"Cv Joint Kit, Wheelshaft","From 05/28/2013. 2.0L, auto trans, new, from 02/25/2013.",,"Left, Right, Front Outer",