part_image.id,part_image.ts,part_image.source_content_type,part_image.hash_file_content,part_image.size,part_image.path,part_image.title,part_image.access,image_slug.id,image_slug.ts,part.id,part.ts,part.title,part.price,part.category,part.mpn,part.sku,part.vin,part.placement,part.color,part.part_number,part.trivetrain,part.engine,part.exterior_color,part.interior_color
1,"2021-10-17 10:22:46",image/jpeg,5eae03f1e64f30ec4cf21750d4a59d2fe40a09eb,75918,/5e/ae/03/f1/5eae03f1e64f30ec4cf21750d4a59d2fe40a09eb.jpg,,https://songer.datasn.com/data/api/v1/u_e49e7f0fcb85c5451b03/auto_parts_for_world/by_table/part_image_access/5e/ae/03/f1/5eae03f1e64f30ec4cf21750d4a59d2fe40a09eb.jpg,1,"2021-10-13 00:32:27",1,"2021-10-13 00:32:27","07-11 MERCEDES BENZ ML63 W164 A/C AC COMPRESSOR AUTOMATIC PUMP THRU 10/07 3 ZONE #MB010917",$199.99,A/C-HEATER-VENTILATION,"A 002 230 23 11, A0022302311, 22302311",MB010917-024,4JGBB77E07A217982,,,,4WD,,"LASURITE BLUE METALLIC PAINT (349)","EXCLUSIVE LEATHER - GRAY (508)"
2,"2021-10-17 10:29:59",image/jpeg,78145de1084e4278330a6fd3f044a3d1ce777d0e,80795,/78/14/5d/e1/78145de1084e4278330a6fd3f044a3d1ce777d0e.jpg,,https://songer.datasn.com/data/api/v1/u_e49e7f0fcb85c5451b03/auto_parts_for_world/by_table/part_image_access/78/14/5d/e1/78145de1084e4278330a6fd3f044a3d1ce777d0e.jpg,2,"2021-10-13 00:32:27",1,"2021-10-13 00:32:27","07-11 MERCEDES BENZ ML63 W164 A/C AC COMPRESSOR AUTOMATIC PUMP THRU 10/07 3 ZONE #MB010917",$199.99,A/C-HEATER-VENTILATION,"A 002 230 23 11, A0022302311, 22302311",MB010917-024,4JGBB77E07A217982,,,,4WD,,"LASURITE BLUE METALLIC PAINT (349)","EXCLUSIVE LEATHER - GRAY (508)"
3,"2021-10-17 10:30:39",image/jpeg,4b691eb85fd9a5daa69e92ee2c85bc55fce1de23,93139,/4b/69/1e/b8/4b691eb85fd9a5daa69e92ee2c85bc55fce1de23.jpg,,https://songer.datasn.com/data/api/v1/u_e49e7f0fcb85c5451b03/auto_parts_for_world/by_table/part_image_access/4b/69/1e/b8/4b691eb85fd9a5daa69e92ee2c85bc55fce1de23.jpg,3,"2021-10-13 00:32:27",1,"2021-10-13 00:32:27","07-11 MERCEDES BENZ ML63 W164 A/C AC COMPRESSOR AUTOMATIC PUMP THRU 10/07 3 ZONE #MB010917",$199.99,A/C-HEATER-VENTILATION,"A 002 230 23 11, A0022302311, 22302311",MB010917-024,4JGBB77E07A217982,,,,4WD,,"LASURITE BLUE METALLIC PAINT (349)","EXCLUSIVE LEATHER - GRAY (508)"
4,"2021-10-17 10:31:05",image/jpeg,71d1cb0a40c6d18f51303ea8dc68f9d4b31544c2,74373,/71/d1/cb/0a/71d1cb0a40c6d18f51303ea8dc68f9d4b31544c2.jpg,,https://songer.datasn.com/data/api/v1/u_e49e7f0fcb85c5451b03/auto_parts_for_world/by_table/part_image_access/71/d1/cb/0a/71d1cb0a40c6d18f51303ea8dc68f9d4b31544c2.jpg,4,"2021-10-13 00:32:27",1,"2021-10-13 00:32:27","07-11 MERCEDES BENZ ML63 W164 A/C AC COMPRESSOR AUTOMATIC PUMP THRU 10/07 3 ZONE #MB010917",$199.99,A/C-HEATER-VENTILATION,"A 002 230 23 11, A0022302311, 22302311",MB010917-024,4JGBB77E07A217982,,,,4WD,,"LASURITE BLUE METALLIC PAINT (349)","EXCLUSIVE LEATHER - GRAY (508)"
5,"2021-10-17 10:31:43",image/jpeg,952a67e40c2a06b65f6c27e033707ce8117ab03a,185003,/95/2a/67/e4/952a67e40c2a06b65f6c27e033707ce8117ab03a.jpg,,https://songer.datasn.com/data/api/v1/u_e49e7f0fcb85c5451b03/auto_parts_for_world/by_table/part_image_access/95/2a/67/e4/952a67e40c2a06b65f6c27e033707ce8117ab03a.jpg,5,"2021-10-13 00:32:27",1,"2021-10-13 00:32:27","07-11 MERCEDES BENZ ML63 W164 A/C AC COMPRESSOR AUTOMATIC PUMP THRU 10/07 3 ZONE #MB010917",$199.99,A/C-HEATER-VENTILATION,"A 002 230 23 11, A0022302311, 22302311",MB010917-024,4JGBB77E07A217982,,,,4WD,,"LASURITE BLUE METALLIC PAINT (349)","EXCLUSIVE LEATHER - GRAY (508)"
6,"2021-10-17 10:32:35",image/jpeg,56fb38cf6069cd07320b011378d1624468140630,137411,/56/fb/38/cf/56fb38cf6069cd07320b011378d1624468140630.jpg,,https://songer.datasn.com/data/api/v1/u_e49e7f0fcb85c5451b03/auto_parts_for_world/by_table/part_image_access/56/fb/38/cf/56fb38cf6069cd07320b011378d1624468140630.jpg,41743,"2021-10-14 05:32:46",6240,"2021-10-14 05:32:46","2015-2017 MERCEDES S550 W222 LEFT DRIVER ROOF DRIP REVEAL PROFILE MOLDING TRIM #MB012220",$199.99,"EXTERIOR & BODY PANELS","A2226906701 / A 222 690 67 01 / 2226906701",MB012220-205,WDDUG8CB8FA132280,Left,Black,"2226906701289040 / 222 690 67 01 289 040",RWD,,"Silver, Iridium Silver Metallic, 775","Black, Anthracite, 201"
7,"2021-10-17 10:32:44",image/jpeg,e2fe2aa890e51802dce1850ddb5d208bf1544789,158940,/e2/fe/2a/a8/e2fe2aa890e51802dce1850ddb5d208bf1544789.jpg,,https://songer.datasn.com/data/api/v1/u_e49e7f0fcb85c5451b03/auto_parts_for_world/by_table/part_image_access/e2/fe/2a/a8/e2fe2aa890e51802dce1850ddb5d208bf1544789.jpg,41744,"2021-10-14 05:32:46",6240,"2021-10-14 05:32:46","2015-2017 MERCEDES S550 W222 LEFT DRIVER ROOF DRIP REVEAL PROFILE MOLDING TRIM #MB012220",$199.99,"EXTERIOR & BODY PANELS","A2226906701 / A 222 690 67 01 / 2226906701",MB012220-205,WDDUG8CB8FA132280,Left,Black,"2226906701289040 / 222 690 67 01 289 040",RWD,,"Silver, Iridium Silver Metallic, 775","Black, Anthracite, 201"
8,"2021-10-17 10:33:02",image/jpeg,43467abdafe9f19109e7d1ea04c3374ef1474df5,144969,/43/46/7a/bd/43467abdafe9f19109e7d1ea04c3374ef1474df5.jpg,,https://songer.datasn.com/data/api/v1/u_e49e7f0fcb85c5451b03/auto_parts_for_world/by_table/part_image_access/43/46/7a/bd/43467abdafe9f19109e7d1ea04c3374ef1474df5.jpg,41745,"2021-10-14 05:32:46",6240,"2021-10-14 05:32:46","2015-2017 MERCEDES S550 W222 LEFT DRIVER ROOF DRIP REVEAL PROFILE MOLDING TRIM #MB012220",$199.99,"EXTERIOR & BODY PANELS","A2226906701 / A 222 690 67 01 / 2226906701",MB012220-205,WDDUG8CB8FA132280,Left,Black,"2226906701289040 / 222 690 67 01 289 040",RWD,,"Silver, Iridium Silver Metallic, 775","Black, Anthracite, 201"
9,"2021-10-17 10:33:12",image/jpeg,da93ec0fb451ceaeb755cceafb5b0930c2b784db,24592,/da/93/ec/0f/da93ec0fb451ceaeb755cceafb5b0930c2b784db.jpg,,https://songer.datasn.com/data/api/v1/u_e49e7f0fcb85c5451b03/auto_parts_for_world/by_table/part_image_access/da/93/ec/0f/da93ec0fb451ceaeb755cceafb5b0930c2b784db.jpg,6,"2021-10-13 00:33:50",2,"2021-10-13 00:33:50","07-12 LEXUS LS460 FRONT LEFT DRIVER SIDE DASH VENT GRILLE AIR COWL TRIM PANEL",$24.77,A/C-HEATER-VENTILATION,"5558110080 / 55581 10080 / 555 811 0080 / 555 811",231618588291,,"Front, Left",Black,"555744-0080 / 5557440080 / 5557 440080 / 555 744 0080",,,,
10,"2021-10-17 10:33:34",image/jpeg,98f59b9d338b7d33fd5054f3226f950a01dcc322,103360,/98/f5/9b/9d/98f59b9d338b7d33fd5054f3226f950a01dcc322.jpg,,https://songer.datasn.com/data/api/v1/u_e49e7f0fcb85c5451b03/auto_parts_for_world/by_table/part_image_access/98/f5/9b/9d/98f59b9d338b7d33fd5054f3226f950a01dcc322.jpg,41746,"2021-10-14 05:32:46",6240,"2021-10-14 05:32:46","2015-2017 MERCEDES S550 W222 LEFT DRIVER ROOF DRIP REVEAL PROFILE MOLDING TRIM #MB012220",$199.99,"EXTERIOR & BODY PANELS","A2226906701 / A 222 690 67 01 / 2226906701",MB012220-205,WDDUG8CB8FA132280,Left,Black,"2226906701289040 / 222 690 67 01 289 040",RWD,,"Silver, Iridium Silver Metallic, 775","Black, Anthracite, 201"
11,"2021-10-17 10:33:53",image/jpeg,b746796bd8b343fe09f54e357a3e89da37754426,134027,/b7/46/79/6b/b746796bd8b343fe09f54e357a3e89da37754426.jpg,,https://songer.datasn.com/data/api/v1/u_e49e7f0fcb85c5451b03/auto_parts_for_world/by_table/part_image_access/b7/46/79/6b/b746796bd8b343fe09f54e357a3e89da37754426.jpg,41747,"2021-10-14 05:32:46",6240,"2021-10-14 05:32:46","2015-2017 MERCEDES S550 W222 LEFT DRIVER ROOF DRIP REVEAL PROFILE MOLDING TRIM #MB012220",$199.99,"EXTERIOR & BODY PANELS","A2226906701 / A 222 690 67 01 / 2226906701",MB012220-205,WDDUG8CB8FA132280,Left,Black,"2226906701289040 / 222 690 67 01 289 040",RWD,,"Silver, Iridium Silver Metallic, 775","Black, Anthracite, 201"
12,"2021-10-17 10:34:17",image/jpeg,1dddcc4853b5d16ec65890b92627346c3f6a2333,163300,/1d/dd/cc/48/1dddcc4853b5d16ec65890b92627346c3f6a2333.jpg,,https://songer.datasn.com/data/api/v1/u_e49e7f0fcb85c5451b03/auto_parts_for_world/by_table/part_image_access/1d/dd/cc/48/1dddcc4853b5d16ec65890b92627346c3f6a2333.jpg,41748,"2021-10-14 05:32:46",6240,"2021-10-14 05:32:46","2015-2017 MERCEDES S550 W222 LEFT DRIVER ROOF DRIP REVEAL PROFILE MOLDING TRIM #MB012220",$199.99,"EXTERIOR & BODY PANELS","A2226906701 / A 222 690 67 01 / 2226906701",MB012220-205,WDDUG8CB8FA132280,Left,Black,"2226906701289040 / 222 690 67 01 289 040",RWD,,"Silver, Iridium Silver Metallic, 775","Black, Anthracite, 201"
13,"2021-10-17 10:34:56",image/jpeg,dc1a5f72810df0d328266874c21a3b0d49fcd869,26038,/dc/1a/5f/72/dc1a5f72810df0d328266874c21a3b0d49fcd869.jpg,,https://songer.datasn.com/data/api/v1/u_e49e7f0fcb85c5451b03/auto_parts_for_world/by_table/part_image_access/dc/1a/5f/72/dc1a5f72810df0d328266874c21a3b0d49fcd869.jpg,7,"2021-10-13 00:33:50",2,"2021-10-13 00:33:50","07-12 LEXUS LS460 FRONT LEFT DRIVER SIDE DASH VENT GRILLE AIR COWL TRIM PANEL",$24.77,A/C-HEATER-VENTILATION,"5558110080 / 55581 10080 / 555 811 0080 / 555 811",231618588291,,"Front, Left",Black,"555744-0080 / 5557440080 / 5557 440080 / 555 744 0080",,,,
14,"2021-10-17 10:35:07",image/jpeg,ec2ad28021550a48a055f77452e41123f360e147,25512,/ec/2a/d2/80/ec2ad28021550a48a055f77452e41123f360e147.jpg,,https://songer.datasn.com/data/api/v1/u_e49e7f0fcb85c5451b03/auto_parts_for_world/by_table/part_image_access/ec/2a/d2/80/ec2ad28021550a48a055f77452e41123f360e147.jpg,8,"2021-10-13 00:33:50",2,"2021-10-13 00:33:50","07-12 LEXUS LS460 FRONT LEFT DRIVER SIDE DASH VENT GRILLE AIR COWL TRIM PANEL",$24.77,A/C-HEATER-VENTILATION,"5558110080 / 55581 10080 / 555 811 0080 / 555 811",231618588291,,"Front, Left",Black,"555744-0080 / 5557440080 / 5557 440080 / 555 744 0080",,,,
15,"2021-10-17 10:35:15",image/jpeg,e4493c7f4a4cee96b2e2c0e070d46b1394a8d17c,126384,/e4/49/3c/7f/e4493c7f4a4cee96b2e2c0e070d46b1394a8d17c.jpg,,https://songer.datasn.com/data/api/v1/u_e49e7f0fcb85c5451b03/auto_parts_for_world/by_table/part_image_access/e4/49/3c/7f/e4493c7f4a4cee96b2e2c0e070d46b1394a8d17c.jpg,41749,"2021-10-14 05:32:46",6240,"2021-10-14 05:32:46","2015-2017 MERCEDES S550 W222 LEFT DRIVER ROOF DRIP REVEAL PROFILE MOLDING TRIM #MB012220",$199.99,"EXTERIOR & BODY PANELS","A2226906701 / A 222 690 67 01 / 2226906701",MB012220-205,WDDUG8CB8FA132280,Left,Black,"2226906701289040 / 222 690 67 01 289 040",RWD,,"Silver, Iridium Silver Metallic, 775","Black, Anthracite, 201"
16,"2021-10-17 10:35:18",image/jpeg,22c2f69e8f5a0331a615301592e423c8a668a029,18973,/22/c2/f6/9e/22c2f69e8f5a0331a615301592e423c8a668a029.jpg,,https://songer.datasn.com/data/api/v1/u_e49e7f0fcb85c5451b03/auto_parts_for_world/by_table/part_image_access/22/c2/f6/9e/22c2f69e8f5a0331a615301592e423c8a668a029.jpg,9,"2021-10-13 00:33:50",2,"2021-10-13 00:33:50","07-12 LEXUS LS460 FRONT LEFT DRIVER SIDE DASH VENT GRILLE AIR COWL TRIM PANEL",$24.77,A/C-HEATER-VENTILATION,"5558110080 / 55581 10080 / 555 811 0080 / 555 811",231618588291,,"Front, Left",Black,"555744-0080 / 5557440080 / 5557 440080 / 555 744 0080",,,,
17,"2021-10-17 10:35:56",image/jpeg,e2795c0df3ec923bc64f311a063c7422e1363e42,93565,/e2/79/5c/0d/e2795c0df3ec923bc64f311a063c7422e1363e42.jpg,,https://songer.datasn.com/data/api/v1/u_e49e7f0fcb85c5451b03/auto_parts_for_world/by_table/part_image_access/e2/79/5c/0d/e2795c0df3ec923bc64f311a063c7422e1363e42.jpg,10,"2021-10-13 00:34:01",3,"2021-10-13 00:34:01","08-10 MERCEDES BENZ CL63 AMG CL W216 A/C AC CONDITIONER COMPRESSOR PUMP ASSEMBLY #CL033018",$249.99,A/C-HEATER-VENTILATION,"A0022300911 / A 002 230 09 11 / 0022300911",CL033018-102,WDDEJ77X88A008521,Front,,"22300911 / 2230 0911",RWD,,"CALCITE WHITE - STANDARD FINISH (650U)","LEATHER/NAPPA/SEMI-ANILINE - BLACK/ANTHRACITE (801A)"
18,"2021-10-17 10:36:17",image/jpeg,79fa12d28a8d2f80cf57f3995ccedda7eadf6d9d,85564,/79/fa/12/d2/79fa12d28a8d2f80cf57f3995ccedda7eadf6d9d.jpg,,https://songer.datasn.com/data/api/v1/u_e49e7f0fcb85c5451b03/auto_parts_for_world/by_table/part_image_access/79/fa/12/d2/79fa12d28a8d2f80cf57f3995ccedda7eadf6d9d.jpg,11,"2021-10-13 00:34:01",3,"2021-10-13 00:34:01","08-10 MERCEDES BENZ CL63 AMG CL W216 A/C AC CONDITIONER COMPRESSOR PUMP ASSEMBLY #CL033018",$249.99,A/C-HEATER-VENTILATION,"A0022300911 / A 002 230 09 11 / 0022300911",CL033018-102,WDDEJ77X88A008521,Front,,"22300911 / 2230 0911",RWD,,"CALCITE WHITE - STANDARD FINISH (650U)","LEATHER/NAPPA/SEMI-ANILINE - BLACK/ANTHRACITE (801A)"
19,"2021-10-17 10:36:38",image/jpeg,1b5f2b8af52f8baa074de662fe03e6bca609bb22,72360,/1b/5f/2b/8a/1b5f2b8af52f8baa074de662fe03e6bca609bb22.jpg,,https://songer.datasn.com/data/api/v1/u_e49e7f0fcb85c5451b03/auto_parts_for_world/by_table/part_image_access/1b/5f/2b/8a/1b5f2b8af52f8baa074de662fe03e6bca609bb22.jpg,12,"2021-10-13 00:34:01",3,"2021-10-13 00:34:01","08-10 MERCEDES BENZ CL63 AMG CL W216 A/C AC CONDITIONER COMPRESSOR PUMP ASSEMBLY #CL033018",$249.99,A/C-HEATER-VENTILATION,"A0022300911 / A 002 230 09 11 / 0022300911",CL033018-102,WDDEJ77X88A008521,Front,,"22300911 / 2230 0911",RWD,,"CALCITE WHITE - STANDARD FINISH (650U)","LEATHER/NAPPA/SEMI-ANILINE - BLACK/ANTHRACITE (801A)"
20,"2021-10-17 10:37:34",image/jpeg,5ec22e70704f2e212ac42f989ba25d60e0494656,129896,/5e/c2/2e/70/5ec22e70704f2e212ac42f989ba25d60e0494656.jpg,,https://songer.datasn.com/data/api/v1/u_e49e7f0fcb85c5451b03/auto_parts_for_world/by_table/part_image_access/5e/c2/2e/70/5ec22e70704f2e212ac42f989ba25d60e0494656.jpg,13,"2021-10-13 00:34:01",3,"2021-10-13 00:34:01","08-10 MERCEDES BENZ CL63 AMG CL W216 A/C AC CONDITIONER COMPRESSOR PUMP ASSEMBLY #CL033018",$249.99,A/C-HEATER-VENTILATION,"A0022300911 / A 002 230 09 11 / 0022300911",CL033018-102,WDDEJ77X88A008521,Front,,"22300911 / 2230 0911",RWD,,"CALCITE WHITE - STANDARD FINISH (650U)","LEATHER/NAPPA/SEMI-ANILINE - BLACK/ANTHRACITE (801A)"
21,"2021-10-17 10:38:21",image/jpeg,5793e653bad82209bd389b17b600fab023b15dab,91955,/57/93/e6/53/5793e653bad82209bd389b17b600fab023b15dab.jpg,,https://songer.datasn.com/data/api/v1/u_e49e7f0fcb85c5451b03/auto_parts_for_world/by_table/part_image_access/57/93/e6/53/5793e653bad82209bd389b17b600fab023b15dab.jpg,14,"2021-10-13 00:34:01",3,"2021-10-13 00:34:01","08-10 MERCEDES BENZ CL63 AMG CL W216 A/C AC CONDITIONER COMPRESSOR PUMP ASSEMBLY #CL033018",$249.99,A/C-HEATER-VENTILATION,"A0022300911 / A 002 230 09 11 / 0022300911",CL033018-102,WDDEJ77X88A008521,Front,,"22300911 / 2230 0911",RWD,,"CALCITE WHITE - STANDARD FINISH (650U)","LEATHER/NAPPA/SEMI-ANILINE - BLACK/ANTHRACITE (801A)"
22,"2021-10-17 10:38:21",image/jpeg,9b3b5d57cdd2e23a47a4fd72c2339cbbe935c7cc,286575,/9b/3b/5d/57/9b3b5d57cdd2e23a47a4fd72c2339cbbe935c7cc.jpg,,https://songer.datasn.com/data/api/v1/u_e49e7f0fcb85c5451b03/auto_parts_for_world/by_table/part_image_access/9b/3b/5d/57/9b3b5d57cdd2e23a47a4fd72c2339cbbe935c7cc.jpg,41750,"2021-10-14 05:32:58",6241,"2021-10-14 05:32:58","2014-2017 MERCEDES S550 W222 REAR LEFT QUARTER PANEL STRUCTURAL METAL FRAME CUT #MB012220","$1,499.99","EXTERIOR & BODY PANELS","2226306901 / 222 630 69 01",MB012220-220,WDDUG8CB8FA132280,"Left, Rear","Silver, Iridium Silver Metallic, 775","2226300102 / 222 630 01 02",RWD,,"Silver, Iridium Silver Metallic, 775","Black, Anthracite, 201"
23,"2021-10-17 10:38:28",image/jpeg,6605ae3a7fda4bed87d554002bc6b8c069050c21,111880,/66/05/ae/3a/6605ae3a7fda4bed87d554002bc6b8c069050c21.jpg,,https://songer.datasn.com/data/api/v1/u_e49e7f0fcb85c5451b03/auto_parts_for_world/by_table/part_image_access/66/05/ae/3a/6605ae3a7fda4bed87d554002bc6b8c069050c21.jpg,41751,"2021-10-14 05:32:58",6241,"2021-10-14 05:32:58","2014-2017 MERCEDES S550 W222 REAR LEFT QUARTER PANEL STRUCTURAL METAL FRAME CUT #MB012220","$1,499.99","EXTERIOR & BODY PANELS","2226306901 / 222 630 69 01",MB012220-220,WDDUG8CB8FA132280,"Left, Rear","Silver, Iridium Silver Metallic, 775","2226300102 / 222 630 01 02",RWD,,"Silver, Iridium Silver Metallic, 775","Black, Anthracite, 201"
24,"2021-10-17 10:38:52",image/jpeg,082c7ac92aa24d96d37a943dbc595d0dad76fd55,183527,/08/2c/7a/c9/082c7ac92aa24d96d37a943dbc595d0dad76fd55.jpg,,https://songer.datasn.com/data/api/v1/u_e49e7f0fcb85c5451b03/auto_parts_for_world/by_table/part_image_access/08/2c/7a/c9/082c7ac92aa24d96d37a943dbc595d0dad76fd55.jpg,15,"2021-10-13 00:34:01",3,"2021-10-13 00:34:01","08-10 MERCEDES BENZ CL63 AMG CL W216 A/C AC CONDITIONER COMPRESSOR PUMP ASSEMBLY #CL033018",$249.99,A/C-HEATER-VENTILATION,"A0022300911 / A 002 230 09 11 / 0022300911",CL033018-102,WDDEJ77X88A008521,Front,,"22300911 / 2230 0911",RWD,,"CALCITE WHITE - STANDARD FINISH (650U)","LEATHER/NAPPA/SEMI-ANILINE - BLACK/ANTHRACITE (801A)"
25,"2021-10-17 10:39:07",image/jpeg,d46945d29eeebd30d802c116945a9fe65ac2b013,289000,/d4/69/45/d2/d46945d29eeebd30d802c116945a9fe65ac2b013.jpg,,https://songer.datasn.com/data/api/v1/u_e49e7f0fcb85c5451b03/auto_parts_for_world/by_table/part_image_access/d4/69/45/d2/d46945d29eeebd30d802c116945a9fe65ac2b013.jpg,41752,"2021-10-14 05:32:58",6241,"2021-10-14 05:32:58","2014-2017 MERCEDES S550 W222 REAR LEFT QUARTER PANEL STRUCTURAL METAL FRAME CUT #MB012220","$1,499.99","EXTERIOR & BODY PANELS","2226306901 / 222 630 69 01",MB012220-220,WDDUG8CB8FA132280,"Left, Rear","Silver, Iridium Silver Metallic, 775","2226300102 / 222 630 01 02",RWD,,"Silver, Iridium Silver Metallic, 775","Black, Anthracite, 201"
26,"2021-10-17 10:39:16",image/jpeg,e1de49530901f309a1723863133884034aad70fa,172702,/e1/de/49/53/e1de49530901f309a1723863133884034aad70fa.jpg,,https://songer.datasn.com/data/api/v1/u_e49e7f0fcb85c5451b03/auto_parts_for_world/by_table/part_image_access/e1/de/49/53/e1de49530901f309a1723863133884034aad70fa.jpg,16,"2021-10-13 00:34:01",3,"2021-10-13 00:34:01","08-10 MERCEDES BENZ CL63 AMG CL W216 A/C AC CONDITIONER COMPRESSOR PUMP ASSEMBLY #CL033018",$249.99,A/C-HEATER-VENTILATION,"A0022300911 / A 002 230 09 11 / 0022300911",CL033018-102,WDDEJ77X88A008521,Front,,"22300911 / 2230 0911",RWD,,"CALCITE WHITE - STANDARD FINISH (650U)","LEATHER/NAPPA/SEMI-ANILINE - BLACK/ANTHRACITE (801A)"
27,"2021-10-17 10:39:33",image/jpeg,2d5c51c4c9c80c5e0df93de822aa95c93d3fae0f,17514,/2d/5c/51/c4/2d5c51c4c9c80c5e0df93de822aa95c93d3fae0f.jpg,,https://songer.datasn.com/data/api/v1/u_e49e7f0fcb85c5451b03/auto_parts_for_world/by_table/part_image_access/2d/5c/51/c4/2d5c51c4c9c80c5e0df93de822aa95c93d3fae0f.jpg,17,"2021-10-13 00:34:14",4,"2021-10-13 00:34:14","08-12 LAND ROVER LR2 HSE 3.2L AC A/C HOSE TUBE LINE PIPE DISCHARGE SET PRESSURE #LR010616",$74.77,A/C-HEATER-VENTILATION,"LR016638 / LR0 166 38 / LR01 6638 / LRO16638",231877487684,SALFR2BNXCH316508,Front,,"LR066867 / LR0 668 67 / LR06 6867 / LRO66867",AWD,,"FUJI WHITE",TAN
28,"2021-10-17 10:39:40",image/jpeg,3a003801f3e6d26971ae60581b5d843753978539,261778,/3a/00/38/01/3a003801f3e6d26971ae60581b5d843753978539.jpg,,https://songer.datasn.com/data/api/v1/u_e49e7f0fcb85c5451b03/auto_parts_for_world/by_table/part_image_access/3a/00/38/01/3a003801f3e6d26971ae60581b5d843753978539.jpg,41753,"2021-10-14 05:32:58",6241,"2021-10-14 05:32:58","2014-2017 MERCEDES S550 W222 REAR LEFT QUARTER PANEL STRUCTURAL METAL FRAME CUT #MB012220","$1,499.99","EXTERIOR & BODY PANELS","2226306901 / 222 630 69 01",MB012220-220,WDDUG8CB8FA132280,"Left, Rear","Silver, Iridium Silver Metallic, 775","2226300102 / 222 630 01 02",RWD,,"Silver, Iridium Silver Metallic, 775","Black, Anthracite, 201"
29,"2021-10-17 10:39:54",image/jpeg,0885f1fd8a3ba6bb33ddf7fbab791a1a25f4de98,234868,/08/85/f1/fd/0885f1fd8a3ba6bb33ddf7fbab791a1a25f4de98.jpg,,https://songer.datasn.com/data/api/v1/u_e49e7f0fcb85c5451b03/auto_parts_for_world/by_table/part_image_access/08/85/f1/fd/0885f1fd8a3ba6bb33ddf7fbab791a1a25f4de98.jpg,41754,"2021-10-14 05:32:58",6241,"2021-10-14 05:32:58","2014-2017 MERCEDES S550 W222 REAR LEFT QUARTER PANEL STRUCTURAL METAL FRAME CUT #MB012220","$1,499.99","EXTERIOR & BODY PANELS","2226306901 / 222 630 69 01",MB012220-220,WDDUG8CB8FA132280,"Left, Rear","Silver, Iridium Silver Metallic, 775","2226300102 / 222 630 01 02",RWD,,"Silver, Iridium Silver Metallic, 775","Black, Anthracite, 201"
30,"2021-10-17 10:40:04",image/jpeg,47a33865a45461d23a27570a820d25354d5db4d6,190074,/47/a3/38/65/47a33865a45461d23a27570a820d25354d5db4d6.jpg,,https://songer.datasn.com/data/api/v1/u_e49e7f0fcb85c5451b03/auto_parts_for_world/by_table/part_image_access/47/a3/38/65/47a33865a45461d23a27570a820d25354d5db4d6.jpg,41755,"2021-10-14 05:32:58",6241,"2021-10-14 05:32:58","2014-2017 MERCEDES S550 W222 REAR LEFT QUARTER PANEL STRUCTURAL METAL FRAME CUT #MB012220","$1,499.99","EXTERIOR & BODY PANELS","2226306901 / 222 630 69 01",MB012220-220,WDDUG8CB8FA132280,"Left, Rear","Silver, Iridium Silver Metallic, 775","2226300102 / 222 630 01 02",RWD,,"Silver, Iridium Silver Metallic, 775","Black, Anthracite, 201"
31,"2021-10-17 10:41:58",image/jpeg,e306b4bdc1aa437eed323097a5b2da06983c7528,135435,/e3/06/b4/bd/e306b4bdc1aa437eed323097a5b2da06983c7528.jpg,,https://songer.datasn.com/data/api/v1/u_e49e7f0fcb85c5451b03/auto_parts_for_world/by_table/part_image_access/e3/06/b4/bd/e306b4bdc1aa437eed323097a5b2da06983c7528.jpg,41756,"2021-10-14 05:33:12",6242,"2021-10-14 05:33:12","2017-2020 MASERATI LEVANTE M161 LEFT CENTER B PILLAR OUTER TRIM MOLDING COVER LH #MZ032420",$74.95,"EXTERIOR & BODY PANELS",670061899,MZ032420-064,ZN661XUS9HX220301,Left,Black,,AWD,,"820 BLACK","Black, Red, BSS"
32,"2021-10-17 10:42:25",image/jpeg,8608e9e777df07aa6768f6a8e5c7399fe9b6922c,128539,/86/08/e9/e7/8608e9e777df07aa6768f6a8e5c7399fe9b6922c.jpg,,https://songer.datasn.com/data/api/v1/u_e49e7f0fcb85c5451b03/auto_parts_for_world/by_table/part_image_access/86/08/e9/e7/8608e9e777df07aa6768f6a8e5c7399fe9b6922c.jpg,41757,"2021-10-14 05:33:12",6242,"2021-10-14 05:33:12","2017-2020 MASERATI LEVANTE M161 LEFT CENTER B PILLAR OUTER TRIM MOLDING COVER LH #MZ032420",$74.95,"EXTERIOR & BODY PANELS",670061899,MZ032420-064,ZN661XUS9HX220301,Left,Black,,AWD,,"820 BLACK","Black, Red, BSS"
33,"2021-10-17 10:42:45",image/jpeg,b16af503fe92f725ed3c14830a9b043b60700c13,45498,/b1/6a/f5/03/b16af503fe92f725ed3c14830a9b043b60700c13.jpg,,https://songer.datasn.com/data/api/v1/u_e49e7f0fcb85c5451b03/auto_parts_for_world/by_table/part_image_access/b1/6a/f5/03/b16af503fe92f725ed3c14830a9b043b60700c13.jpg,41758,"2021-10-14 05:33:12",6242,"2021-10-14 05:33:12","2017-2020 MASERATI LEVANTE M161 LEFT CENTER B PILLAR OUTER TRIM MOLDING COVER LH #MZ032420",$74.95,"EXTERIOR & BODY PANELS",670061899,MZ032420-064,ZN661XUS9HX220301,Left,Black,,AWD,,"820 BLACK","Black, Red, BSS"
34,"2021-10-17 10:43:39",image/jpeg,d44e9fa99c4c04b2fa16a7269b5fb55367617441,18888,/d4/4e/9f/a9/d44e9fa99c4c04b2fa16a7269b5fb55367617441.jpg,,https://songer.datasn.com/data/api/v1/u_e49e7f0fcb85c5451b03/auto_parts_for_world/by_table/part_image_access/d4/4e/9f/a9/d44e9fa99c4c04b2fa16a7269b5fb55367617441.jpg,18,"2021-10-13 00:34:14",4,"2021-10-13 00:34:14","08-12 LAND ROVER LR2 HSE 3.2L AC A/C HOSE TUBE LINE PIPE DISCHARGE SET PRESSURE #LR010616",$74.77,A/C-HEATER-VENTILATION,"LR016638 / LR0 166 38 / LR01 6638 / LRO16638",231877487684,SALFR2BNXCH316508,Front,,"LR066867 / LR0 668 67 / LR06 6867 / LRO66867",AWD,,"FUJI WHITE",TAN
35,"2021-10-17 10:43:45",image/jpeg,c523d979afe8035f37929e02327c537e4d44097c,128076,/c5/23/d9/79/c523d979afe8035f37929e02327c537e4d44097c.jpg,,https://songer.datasn.com/data/api/v1/u_e49e7f0fcb85c5451b03/auto_parts_for_world/by_table/part_image_access/c5/23/d9/79/c523d979afe8035f37929e02327c537e4d44097c.jpg,41759,"2021-10-14 05:33:12",6242,"2021-10-14 05:33:12","2017-2020 MASERATI LEVANTE M161 LEFT CENTER B PILLAR OUTER TRIM MOLDING COVER LH #MZ032420",$74.95,"EXTERIOR & BODY PANELS",670061899,MZ032420-064,ZN661XUS9HX220301,Left,Black,,AWD,,"820 BLACK","Black, Red, BSS"