part_x_car.id,part.id,part.ts,part.title,part.price,part.category,part.mpn,part.sku,part.vin,part.placement,part.color,part.part_number,part.trivetrain,part.engine,part.exterior_color,part.interior_color,car.id,car.ts,car.car_model,car.uniq
101,45,"2021-10-13 00:44:52","2012-2016 RANGE ROVER EVOQUE L538 FRONT RIGHT PASSENGER SEAT AIRBAG SIDE IMPACT #XX092421",$159.99,"AIR BAGS & SEAT BELTS","BJ32-611D32-AC BJ32 611D32 AC BJ32611D32AC",XX092421-016,,"Right, Front",White,LR026019,,,,,101,"2021-10-13 00:44:52","2012-2016  Land Rover  Range Rover Evoque",7bd46615922c4f64208c00c1b73c6401
102,46,"2021-10-13 00:45:12","2018-2019 RANGE ROVER L405 REAR LEFT OR RIGHT OUTER SEATBELT RETRACTOR ASSEMBLY #RR080521",$179.95,"AIR BAGS & SEAT BELTS",LR112814,XX092421-037,,"Left, Rear","Black, Ebony",,,,,,102,"2021-10-13 00:45:12","2018-2019  Land Rover  Range Rover",3e3dbfd7f300aa9b1e6c3caa2c72ab40
103,47,"2021-10-13 00:45:32","2019-2021 BMW X5 G05 REAR 2ND ROW LEFT OUTER SEATBELT RETRACTOR LAP ASSEMBLY OEM #BX020821",$164.95,"AIR BAGS & SEAT BELTS",HU34212590C,XX092421-031,,"Left, Rear",Black,"34133471F,72117941623,72117941639",,,,,103,"2021-10-13 00:45:32",2019-2021  BMW  X5,fdcf0f513cd1124a4ff8d4d3e8ab7e21
104,48,"2021-10-13 00:45:51","2014-2017 RANGE ROVER SPORT L494 REAR RIGHT OR LEFT OUTER ESPRESSO SEATBELT ASSY #RR021521",$199.99,"AIR BAGS & SEAT BELTS",LR076631,XX092421-036,,"Right, Rear","Brown, Espresso",,,,,,104,"2021-10-13 00:45:51","2014-2017  Land Rover  Range Rover Sport",2efa4621486f3c50f883972c68b41a71
105,49,"2021-10-13 00:46:13","2020-2021 RANGE ROVER EVOQUE FRONT LEFT DRIVER SEATBELT RETRACTOR PRETENSIONER #EQ030421",$319.95,"AIR BAGS & SEAT BELTS",34257876C,XX092421-035,,"Left, Front","Black, Ebony","LR123825,LR122723",,,,,105,"2021-10-13 00:46:13","2020-2021  Land Rover  Range Rover Evoque",d2da8aa21b0c09a059f564ccb010a079
106,50,"2021-10-13 00:46:34","2020-2021 RANGE ROVER EVOQUE FRONT LEFT DRIVER SEATBELT RETRACTOR PRETENSIONER #EQ051821",$319.99,"AIR BAGS & SEAT BELTS",34257876C,XX092421-034,,"Left, Front","Black, Ebony","LR123825,LR122723",,,,,105,"2021-10-13 00:46:13","2020-2021  Land Rover  Range Rover Evoque",d2da8aa21b0c09a059f564ccb010a079
107,51,"2021-10-13 00:46:50","2018-2019 RANGE ROVER L405 REAR RIGHT OR LEFT OUTER SEATBELT RETRACTOR FULL SIZE #RR080521",$179.99,"AIR BAGS & SEAT BELTS",LR112814,XX092421-033,,"Right, Rear","Black, Ebony",,,,,,102,"2021-10-13 00:45:12","2018-2019  Land Rover  Range Rover",3e3dbfd7f300aa9b1e6c3caa2c72ab40
108,52,"2021-10-13 00:47:04","2017-21 LAND ROVER DISCOVERY 5 FRONT LEFT DRIVER SEATBELT RETRACTOR PRETENSIONER #LD081721",$294.95,"AIR BAGS & SEAT BELTS",LR095401,XX092421-029,,"Left, Front","Black, Ebony","0589P10021,LR081140",,,,,108,"2021-10-13 00:47:04","2017-2021  Land Rover  Discovery",73787a23402706c6a59ead2d28383717
109,53,"2021-10-13 00:47:26","2018-2021 RANGE ROVER L405 FRONT LEFT SEATBELT RETRACTOR PRETENSIONER ASSEMBLY #RR080521",$349.95,"AIR BAGS & SEAT BELTS","JK52-614B03-AA,JK52 614B03 AA,JK52614B03AA",XX092421-028,,"Left, Front","Black, Ebony","LR104659,LR104504",,,,,109,"2021-10-13 00:47:26","2018-2021  Land Rover  Range Rover",fd949fa73aa00f671f376467aef50f13
110,54,"2021-10-13 00:47:47","2020 RANGE ROVER EVOQUE REAR ROW LEFT OR RIGHT OUTER SEATBELT RETRACTOR LAP L551 #EQ051821",$194.99,"AIR BAGS & SEAT BELTS",LR122836,XX092421-026,,"Left, Rear","Black, Ebony",34133468F,,,,,110,"2021-10-13 00:47:47","2020-2020  Land Rover  Range Rover Evoque",8bf5eeda1e7ec1e41a5ac073a756f89c
111,55,"2021-10-13 00:48:17","2020 RANGE ROVER EVOQUE REAR RIGHT OR LEFT SEATBELT RETRACTOR OUTER LAP ASSEMBLY #EQ030421",$194.95,"AIR BAGS & SEAT BELTS",LR122836,XX092421-027,,"Right, Rear","Black, Ebony",34133468D,,,,,110,"2021-10-13 00:47:47","2020-2020  Land Rover  Range Rover Evoque",8bf5eeda1e7ec1e41a5ac073a756f89c
112,56,"2021-10-13 00:48:38","2017-2021 LAND ROVER DISCOVERY 5 FRONT RIGHT SEATBELT REATRACTOR SEAT BELT L462 #LD081721",$194.77,"AIR BAGS & SEAT BELTS",635385100B,XX092421-025,,"Right, Front","Black, Ebony",LR081125,,,,,108,"2021-10-13 00:47:04","2017-2021  Land Rover  Discovery",73787a23402706c6a59ead2d28383717
113,57,"2021-10-13 00:49:00","2017-2018 LAND ROVER DISCOVERY 5 REAR RIGHT 2D ROW SEATBELT RETRACTOR ASSEMBLY #LD081721",$163.95,"AIR BAGS & SEAT BELTS","HY32-612D94-AA HY32 612D94 AA HY32612D94AA",XX092421-024,,"Right, Rear","Black, Ebony",LR081175,,,,,113,"2021-10-13 00:49:00","2017-2018  Land Rover  Discovery",eda7a3d55d4320fa1f1ad57d2ed3d99e
114,58,"2021-10-13 00:49:05","2019-2021 BMW X5 G05 REAR 2ND ROW RIGHT SEATBELT RETRACTOP LAP BELT ASSEMBLY OEM #BX020821",$164.99,"AIR BAGS & SEAT BELTS",34133470E,XX092421-032,,"Right, Rear",Black,"72117941624,72117941640",,,,,103,"2021-10-13 00:45:32",2019-2021  BMW  X5,fdcf0f513cd1124a4ff8d4d3e8ab7e21
115,59,"2021-10-13 00:49:25","2020 RANGE ROVER EVOQUE L551 REAR RIGHT OR LEFT OUTER SEATBELT RETRACTOR LAP OEM #EQ051821",$194.95,"AIR BAGS & SEAT BELTS",LR122836,XX092421-023,,"Right, Rear","Black, Ebony",34133468D,,,,,110,"2021-10-13 00:47:47","2020-2020  Land Rover  Range Rover Evoque",8bf5eeda1e7ec1e41a5ac073a756f89c
116,60,"2021-10-13 00:49:39","2017-2018 LAND ROVER DISCOVERY 5 REAR 2D ROW LEFT SEATBELT RETRACTOR ASSY L462 #LD081721",$164.99,"AIR BAGS & SEAT BELTS","HY32-612D94-AA HY32 612D94 AA HY32612D94AA",XX092421-022,,"Left, Rear","Black, Ebony",LR081177,,,,,113,"2021-10-13 00:49:00","2017-2018  Land Rover  Discovery",eda7a3d55d4320fa1f1ad57d2ed3d99e
118,61,"2021-10-13 00:49:56","2014-2020 MASERATI GHIBLI REAR TANK GAS FUEL PUMP SENDER GHIBLI QUATTROPORTE OEM #MZ100920",$69.95,"AIR INTAKE & FUEL DELIVERY",670031555,MZ100920-157,ZAM57XSA6F1161449,Rear,Black,670035006,RWD,,"BIANCO VR 268 (WHITE)","BLACK/DARK GRAY METALLIC",95,"2021-10-13 00:44:04","2014-2020  MASERATI  Ghibli   ",2a83b327e97aea2017608f85a5b3e96a
117,61,"2021-10-13 00:49:56","2014-2020 MASERATI GHIBLI REAR TANK GAS FUEL PUMP SENDER GHIBLI QUATTROPORTE OEM #MZ100920",$69.95,"AIR INTAKE & FUEL DELIVERY",670031555,MZ100920-157,ZAM57XSA6F1161449,Rear,Black,670035006,RWD,,"BIANCO VR 268 (WHITE)","BLACK/DARK GRAY METALLIC",117,"2021-10-13 00:49:56","2013-2020  MASERATI  Quattroporte   ",3da040f426ca6a22c0e729ff4edf1d44
119,61,"2021-10-13 00:49:56","2014-2020 MASERATI GHIBLI REAR TANK GAS FUEL PUMP SENDER GHIBLI QUATTROPORTE OEM #MZ100920",$69.95,"AIR INTAKE & FUEL DELIVERY",670031555,MZ100920-157,ZAM57XSA6F1161449,Rear,Black,670035006,RWD,,"BIANCO VR 268 (WHITE)","BLACK/DARK GRAY METALLIC",119,"2021-10-13 00:49:56","2017-2020  MASERATI  Levante   ",278d99fbc2e45f99142269077836de6e
121,62,"2021-10-13 00:50:16","14-20 MASERATI GHIBLI FRONT EXHAUST OXYGEN O2 LAMBDA SENSOR QUATTROPORTE LEVANTE #MZ100920",$49.99,"AIR INTAKE & FUEL DELIVERY",670002200,MZ100920-136,ZAM57XSA6F1161449,Front,Black,,RWD,,"BIANCO VR 268 (WHITE)","BLACK/DARK GRAY METALLIC",95,"2021-10-13 00:44:04","2014-2020  MASERATI  Ghibli   ",2a83b327e97aea2017608f85a5b3e96a
122,62,"2021-10-13 00:50:16","14-20 MASERATI GHIBLI FRONT EXHAUST OXYGEN O2 LAMBDA SENSOR QUATTROPORTE LEVANTE #MZ100920",$49.99,"AIR INTAKE & FUEL DELIVERY",670002200,MZ100920-136,ZAM57XSA6F1161449,Front,Black,,RWD,,"BIANCO VR 268 (WHITE)","BLACK/DARK GRAY METALLIC",119,"2021-10-13 00:49:56","2017-2020  MASERATI  Levante   ",278d99fbc2e45f99142269077836de6e
120,62,"2021-10-13 00:50:16","14-20 MASERATI GHIBLI FRONT EXHAUST OXYGEN O2 LAMBDA SENSOR QUATTROPORTE LEVANTE #MZ100920",$49.99,"AIR INTAKE & FUEL DELIVERY",670002200,MZ100920-136,ZAM57XSA6F1161449,Front,Black,,RWD,,"BIANCO VR 268 (WHITE)","BLACK/DARK GRAY METALLIC",120,"2021-10-13 00:50:16","2013-2016  MASERATI  Quattroporte   ",50886a00582110517a80de8f714a55d7
124,63,"2021-10-13 00:50:27","14-20 MASERATI GHIBLI FRONT EXHAUST OXYGEN O2 SENSOR LAMBDA QUATTROPORTE LEVANTE #MZ100920",$59.99,"AIR INTAKE & FUEL DELIVERY",670002200,MZ100920-134,ZAM57XSA6F1161449,Front,Black,,RWD,,"BIANCO VR 268 (WHITE)","BLACK/DARK GRAY METALLIC",95,"2021-10-13 00:44:04","2014-2020  MASERATI  Ghibli   ",2a83b327e97aea2017608f85a5b3e96a
125,63,"2021-10-13 00:50:27","14-20 MASERATI GHIBLI FRONT EXHAUST OXYGEN O2 SENSOR LAMBDA QUATTROPORTE LEVANTE #MZ100920",$59.99,"AIR INTAKE & FUEL DELIVERY",670002200,MZ100920-134,ZAM57XSA6F1161449,Front,Black,,RWD,,"BIANCO VR 268 (WHITE)","BLACK/DARK GRAY METALLIC",119,"2021-10-13 00:49:56","2017-2020  MASERATI  Levante   ",278d99fbc2e45f99142269077836de6e
123,63,"2021-10-13 00:50:27","14-20 MASERATI GHIBLI FRONT EXHAUST OXYGEN O2 SENSOR LAMBDA QUATTROPORTE LEVANTE #MZ100920",$59.99,"AIR INTAKE & FUEL DELIVERY",670002200,MZ100920-134,ZAM57XSA6F1161449,Front,Black,,RWD,,"BIANCO VR 268 (WHITE)","BLACK/DARK GRAY METALLIC",120,"2021-10-13 00:50:16","2013-2016  MASERATI  Quattroporte   ",50886a00582110517a80de8f714a55d7
127,64,"2021-10-13 00:50:48","2014-2020 MASERATI GHIBLI FRONT EXHAUST OXYGEN O2 LAMBDA SENSOR QUATTROPORTE OEM #MZ100920",$74.95,"AIR INTAKE & FUEL DELIVERY",670009076,MZ100920-135,ZAM57XSA6F1161449,,Blue,,RWD,,"BIANCO VR 268 (WHITE)","BLACK/DARK GRAY METALLIC",95,"2021-10-13 00:44:04","2014-2020  MASERATI  Ghibli   ",2a83b327e97aea2017608f85a5b3e96a
126,64,"2021-10-13 00:50:48","2014-2020 MASERATI GHIBLI FRONT EXHAUST OXYGEN O2 LAMBDA SENSOR QUATTROPORTE OEM #MZ100920",$74.95,"AIR INTAKE & FUEL DELIVERY",670009076,MZ100920-135,ZAM57XSA6F1161449,,Blue,,RWD,,"BIANCO VR 268 (WHITE)","BLACK/DARK GRAY METALLIC",117,"2021-10-13 00:49:56","2013-2020  MASERATI  Quattroporte   ",3da040f426ca6a22c0e729ff4edf1d44
128,65,"2021-10-13 00:51:05","2014-2020 MASERATI GHIBLI REAR LEFT FUEL FILLER DOOR LID CAP TRIM HOUSING ASSY #MZ100920",$94.95,"AIR INTAKE & FUEL DELIVERY",670028351,MZ100920-106,ZAM57XSA6F1161449,"Left,Rear","White, BIANCO VR 268",670108040,RWD,,"BIANCO VR 268 (WHITE)","BLACK/DARK GRAY METALLIC",95,"2021-10-13 00:44:04","2014-2020  MASERATI  Ghibli   ",2a83b327e97aea2017608f85a5b3e96a
130,66,"2021-10-13 00:51:27","2014-20 MASERATI GHIBLI AIR INTAKE HOSE CENTER CROSS PIPE DUCT TUBE SLEEVE ASSY #MZ100920",$239.77,"AIR INTAKE & FUEL DELIVERY",670001350,MZ100920-105,ZAM57XSA6F1161449,Front,Black,0281006028,RWD,,"BIANCO VR 268 (WHITE)","BLACK/DARK GRAY METALLIC",95,"2021-10-13 00:44:04","2014-2020  MASERATI  Ghibli   ",2a83b327e97aea2017608f85a5b3e96a
129,66,"2021-10-13 00:51:27","2014-20 MASERATI GHIBLI AIR INTAKE HOSE CENTER CROSS PIPE DUCT TUBE SLEEVE ASSY #MZ100920",$239.77,"AIR INTAKE & FUEL DELIVERY",670001350,MZ100920-105,ZAM57XSA6F1161449,Front,Black,0281006028,RWD,,"BIANCO VR 268 (WHITE)","BLACK/DARK GRAY METALLIC",120,"2021-10-13 00:50:16","2013-2016  MASERATI  Quattroporte   ",50886a00582110517a80de8f714a55d7
132,67,"2021-10-13 00:51:32","2014-2020 MASERATI GHIBLI LEFT DRIVER AIR BOX CLEANER FILTER MASS SENSOR LEVANTE #MZ100920",$114.95,"AIR INTAKE & FUEL DELIVERY",673007391,MZ100920-102,ZAM57XSA6F1161449,Left,Black,0280218281,RWD,,"BIANCO VR 268 (WHITE)","BLACK/DARK GRAY METALLIC",95,"2021-10-13 00:44:04","2014-2020  MASERATI  Ghibli   ",2a83b327e97aea2017608f85a5b3e96a
133,67,"2021-10-13 00:51:32","2014-2020 MASERATI GHIBLI LEFT DRIVER AIR BOX CLEANER FILTER MASS SENSOR LEVANTE #MZ100920",$114.95,"AIR INTAKE & FUEL DELIVERY",673007391,MZ100920-102,ZAM57XSA6F1161449,Left,Black,0280218281,RWD,,"BIANCO VR 268 (WHITE)","BLACK/DARK GRAY METALLIC",119,"2021-10-13 00:49:56","2017-2020  MASERATI  Levante   ",278d99fbc2e45f99142269077836de6e
131,67,"2021-10-13 00:51:32","2014-2020 MASERATI GHIBLI LEFT DRIVER AIR BOX CLEANER FILTER MASS SENSOR LEVANTE #MZ100920",$114.95,"AIR INTAKE & FUEL DELIVERY",673007391,MZ100920-102,ZAM57XSA6F1161449,Left,Black,0280218281,RWD,,"BIANCO VR 268 (WHITE)","BLACK/DARK GRAY METALLIC",120,"2021-10-13 00:50:16","2013-2016  MASERATI  Quattroporte   ",50886a00582110517a80de8f714a55d7
135,68,"2021-10-13 00:51:34","2014-2020 MASERATI GHIBLI RIGHT AIR BOX CLEANER FILTER MASS SENSOR LEVANTE ASSY #MZ100920",$114.99,"AIR INTAKE & FUEL DELIVERY",673007389,MZ100920-103,ZAM57XSA6F1161449,Right,Black,"0280218281,329452445",RWD,,"BIANCO VR 268 (WHITE)","BLACK/DARK GRAY METALLIC",95,"2021-10-13 00:44:04","2014-2020  MASERATI  Ghibli   ",2a83b327e97aea2017608f85a5b3e96a
136,68,"2021-10-13 00:51:34","2014-2020 MASERATI GHIBLI RIGHT AIR BOX CLEANER FILTER MASS SENSOR LEVANTE ASSY #MZ100920",$114.99,"AIR INTAKE & FUEL DELIVERY",673007389,MZ100920-103,ZAM57XSA6F1161449,Right,Black,"0280218281,329452445",RWD,,"BIANCO VR 268 (WHITE)","BLACK/DARK GRAY METALLIC",119,"2021-10-13 00:49:56","2017-2020  MASERATI  Levante   ",278d99fbc2e45f99142269077836de6e
134,68,"2021-10-13 00:51:34","2014-2020 MASERATI GHIBLI RIGHT AIR BOX CLEANER FILTER MASS SENSOR LEVANTE ASSY #MZ100920",$114.99,"AIR INTAKE & FUEL DELIVERY",673007389,MZ100920-103,ZAM57XSA6F1161449,Right,Black,"0280218281,329452445",RWD,,"BIANCO VR 268 (WHITE)","BLACK/DARK GRAY METALLIC",120,"2021-10-13 00:50:16","2013-2016  MASERATI  Quattroporte   ",50886a00582110517a80de8f714a55d7
137,69,"2021-10-13 00:52:16","2017-20 LAND ROVER DISCOVERY L462 LEFT AIR INTAKE PIPE HOSE CLEANER LINE DUCT LH #LD081721",$84.99,"AIR INTAKE & FUEL DELIVERY","JY32-9H707-AA JY32 9H707 AA JY329H707AA",LD081721-089,SALRGBBV3HA021480,Left,Black,LR095884,4WD,,"LRC LKH CORRIS GREY","EBONY/NIMBUS/GLOSS BLACK",137,"2021-10-13 00:52:16","2017-2020  Land Rover  Discovery  3.0L; turbo; (6-183); 3.0 LITER DIESEL; Air inlet duct",6119b863ce069690bde313cfd1481532
138,69,"2021-10-13 00:52:16","2017-20 LAND ROVER DISCOVERY L462 LEFT AIR INTAKE PIPE HOSE CLEANER LINE DUCT LH #LD081721",$84.99,"AIR INTAKE & FUEL DELIVERY","JY32-9H707-AA JY32 9H707 AA JY329H707AA",LD081721-089,SALRGBBV3HA021480,Left,Black,LR095884,4WD,,"LRC LKH CORRIS GREY","EBONY/NIMBUS/GLOSS BLACK",138,"2021-10-13 00:52:16","2017-2020  Land Rover  Discovery  Left; 3.0L; Supercharged; (6-183); 3.0 LITER GAS; Inlet duct",f537605fd06c9bb3fb55724660501d78
139,70,"2021-10-13 00:52:35","2017-20 LAND ROVER DISCOVERY L462 3.0L AIR INTAKE HOSE PIPE CROSS TUBE RESONATOR #LD081721",$184.99,"AIR INTAKE & FUEL DELIVERY","DPLA-6C700-AA DPLA 6C700 AA DPLA6C700AA",LD081721-085,SALRGBBV3HA021480,Front,Black,"LR044457,LR036445,LR036446",4WD,,"LRC LKH CORRIS GREY","EBONY/NIMBUS/GLOSS BLACK",139,"2021-10-13 00:52:35","2017-2020  Land Rover  Discovery  3.0L; Supercharged; (6-183); 3.0 LITER GAS; Air inlet hose",53615fb33c25f3426bce7f7fb444a45e
140,70,"2021-10-13 00:52:35","2017-20 LAND ROVER DISCOVERY L462 3.0L AIR INTAKE HOSE PIPE CROSS TUBE RESONATOR #LD081721",$184.99,"AIR INTAKE & FUEL DELIVERY","DPLA-6C700-AA DPLA 6C700 AA DPLA6C700AA",LD081721-085,SALRGBBV3HA021480,Front,Black,"LR044457,LR036445,LR036446",4WD,,"LRC LKH CORRIS GREY","EBONY/NIMBUS/GLOSS BLACK",140,"2021-10-13 00:52:35","2014-2019  Land Rover  Range Rover  3.0L; Gas; Supercharged; (6-183); 3.0 LITER GAS",b21bc343e1bb73a8c7e1f9f3eaffbbb2
141,70,"2021-10-13 00:52:35","2017-20 LAND ROVER DISCOVERY L462 3.0L AIR INTAKE HOSE PIPE CROSS TUBE RESONATOR #LD081721",$184.99,"AIR INTAKE & FUEL DELIVERY","DPLA-6C700-AA DPLA 6C700 AA DPLA6C700AA",LD081721-085,SALRGBBV3HA021480,Front,Black,"LR044457,LR036445,LR036446",4WD,,"LRC LKH CORRIS GREY","EBONY/NIMBUS/GLOSS BLACK",141,"2021-10-13 00:52:35","2014-2019  Land Rover  Range Rover Sport  3.0L; Gas; Supercharged; (6-183); 3.0 LITER V6 GAS; Air inlet hose",8d20b56fc74ea44216ec5b5fb0272cc2
142,71,"2021-10-13 00:52:37","2017-2018 LAND ROVER DISCOVERY L462 FRONT BUMPER SENSOR PARKING AID PDC HARNESS #LD081721",$74.95,"AIR INTAKE & FUEL DELIVERY","FK72-15K859-AA FK72 15K859 AA FK7215K859AA",LD081721-131,SALRGBBV3HA021480,Front,Black,LR081444,4WD,,"LRC LKH CORRIS GREY","EBONY/NIMBUS/GLOSS BLACK",113,"2021-10-13 00:49:00","2017-2018  Land Rover  Discovery",eda7a3d55d4320fa1f1ad57d2ed3d99e
143,72,"2021-10-13 00:52:56","2017-2018 LAND ROVER DISCOVERY 5 FRONT BUMPER PARKING AID PDC SENSOR PLUG MOUNT #LD081721",$94.99,"AIR INTAKE & FUEL DELIVERY","FK72-15K859-AA FK72 15K859 AA FK7215K859AA",LD081721-129,SALRGBBV3HA021480,Front,"Gray, Corris Grey, LRC LKH",LR081448,4WD,,"LRC LKH CORRIS GREY","EBONY/NIMBUS/GLOSS BLACK",113,"2021-10-13 00:49:00","2017-2018  Land Rover  Discovery",eda7a3d55d4320fa1f1ad57d2ed3d99e
146,73,"2021-10-13 00:53:16","2017-2018 LAND ROVER DISCOVERY L462 FRONT BUMPER PARK ASSIST PDC SENSOR HARNESS #LD081721",$74.99,"AIR INTAKE & FUEL DELIVERY","HK83-15C868-AA HK83 15C868 AA HK8315C868AA",LD081721-130,SALRGBBV3HA021480,Front,"Black,Brown","LR081444,LR081451,LR059786",4WD,,"LRC LKH CORRIS GREY","EBONY/NIMBUS/GLOSS BLACK",113,"2021-10-13 00:49:00","2017-2018  Land Rover  Discovery",eda7a3d55d4320fa1f1ad57d2ed3d99e
147,74,"2021-10-13 00:53:26","2017-2018 LAND ROVER DISCOVERY 5 FRONT INNER BUMPER PARK AID ASSIST SENSOR ASSY #LD081721",$94.95,"AIR INTAKE & FUEL DELIVERY","HK83-15K859-AA HK83 15K859 AA HK8315K859AA",LD081721-128,SALRGBBV3HA021480,Front,Black,LR081449,4WD,,"LRC LKH CORRIS GREY","EBONY/NIMBUS/GLOSS BLACK",147,"2021-10-13 00:53:26","2017-2018  Land Rover  Discovery  Front Inner; W/DYNAMIC DESIGN PKG; inner",f25172a331242793bc4837ca3cc9b6ab
148,74,"2021-10-13 00:53:26","2017-2018 LAND ROVER DISCOVERY 5 FRONT INNER BUMPER PARK AID ASSIST SENSOR ASSY #LD081721",$94.95,"AIR INTAKE & FUEL DELIVERY","HK83-15K859-AA HK83 15K859 AA HK8315K859AA",LD081721-128,SALRGBBV3HA021480,Front,Black,LR081449,4WD,,"LRC LKH CORRIS GREY","EBONY/NIMBUS/GLOSS BLACK",148,"2021-10-13 00:53:26","2017-2018  Land Rover  Discovery  Front Inner; W/O DYNAMIC DESIGN PKG; inner",4cf24a2271f13c6b5736cca3420f0675
149,74,"2021-10-13 00:53:26","2017-2018 LAND ROVER DISCOVERY 5 FRONT INNER BUMPER PARK AID ASSIST SENSOR ASSY #LD081721",$94.95,"AIR INTAKE & FUEL DELIVERY","HK83-15K859-AA HK83 15K859 AA HK8315K859AA",LD081721-128,SALRGBBV3HA021480,Front,Black,LR081449,4WD,,"LRC LKH CORRIS GREY","EBONY/NIMBUS/GLOSS BLACK",149,"2021-10-13 00:53:26","2017-2018  Land Rover  Discovery  Rear; Park sensor",a185d64d655906e82e29fbc96b9210ea
150,75,"2021-10-13 00:53:30","2017-2018 LAND ROVER DISCOVERY L462 FRONT INNER BUMPER PARKING PDC SENSOR MOUNT #LD081721",$94.95,"AIR INTAKE & FUEL DELIVERY","HK83-15K859-AA HK83 15K859 AA HK8315K859AA",LD081721-127,SALRGBBV3HA021480,Front,Black,LR081449,4WD,,"LRC LKH CORRIS GREY","EBONY/NIMBUS/GLOSS BLACK",147,"2021-10-13 00:53:26","2017-2018  Land Rover  Discovery  Front Inner; W/DYNAMIC DESIGN PKG; inner",f25172a331242793bc4837ca3cc9b6ab
151,75,"2021-10-13 00:53:30","2017-2018 LAND ROVER DISCOVERY L462 FRONT INNER BUMPER PARKING PDC SENSOR MOUNT #LD081721",$94.95,"AIR INTAKE & FUEL DELIVERY","HK83-15K859-AA HK83 15K859 AA HK8315K859AA",LD081721-127,SALRGBBV3HA021480,Front,Black,LR081449,4WD,,"LRC LKH CORRIS GREY","EBONY/NIMBUS/GLOSS BLACK",148,"2021-10-13 00:53:26","2017-2018  Land Rover  Discovery  Front Inner; W/O DYNAMIC DESIGN PKG; inner",4cf24a2271f13c6b5736cca3420f0675
152,75,"2021-10-13 00:53:30","2017-2018 LAND ROVER DISCOVERY L462 FRONT INNER BUMPER PARKING PDC SENSOR MOUNT #LD081721",$94.95,"AIR INTAKE & FUEL DELIVERY","HK83-15K859-AA HK83 15K859 AA HK8315K859AA",LD081721-127,SALRGBBV3HA021480,Front,Black,LR081449,4WD,,"LRC LKH CORRIS GREY","EBONY/NIMBUS/GLOSS BLACK",149,"2021-10-13 00:53:26","2017-2018  Land Rover  Discovery  Rear; Park sensor",a185d64d655906e82e29fbc96b9210ea
161,76,"2021-10-13 00:54:53","2017-2020 LAND ROVER DISCOVERY L462 CENTER EXHAUST OXYGEN O2 LAMBDA SENSOR RANGE #LD081721",$99.99,"AIR INTAKE & FUEL DELIVERY","FPLA-9G444-AC FPLA 9G444 AC FPLA9G444AC",LD081721-114,SALRGBBV3HA021480,Center,Yellow,LR098287,4WD,,"LRC LKH CORRIS GREY","EBONY/NIMBUS/GLOSS BLACK",102,"2021-10-13 00:45:12","2018-2019  Land Rover  Range Rover",3e3dbfd7f300aa9b1e6c3caa2c72ab40
154,76,"2021-10-13 00:54:53","2017-2020 LAND ROVER DISCOVERY L462 CENTER EXHAUST OXYGEN O2 LAMBDA SENSOR RANGE #LD081721",$99.99,"AIR INTAKE & FUEL DELIVERY","FPLA-9G444-AC FPLA 9G444 AC FPLA9G444AC",LD081721-114,SALRGBBV3HA021480,Center,Yellow,LR098287,4WD,,"LRC LKH CORRIS GREY","EBONY/NIMBUS/GLOSS BLACK",113,"2021-10-13 00:49:00","2017-2018  Land Rover  Discovery",eda7a3d55d4320fa1f1ad57d2ed3d99e
153,76,"2021-10-13 00:54:53","2017-2020 LAND ROVER DISCOVERY L462 CENTER EXHAUST OXYGEN O2 LAMBDA SENSOR RANGE #LD081721",$99.99,"AIR INTAKE & FUEL DELIVERY","FPLA-9G444-AC FPLA 9G444 AC FPLA9G444AC",LD081721-114,SALRGBBV3HA021480,Center,Yellow,LR098287,4WD,,"LRC LKH CORRIS GREY","EBONY/NIMBUS/GLOSS BLACK",153,"2021-10-13 00:54:53","2017-2017  Land Rover  Discovery",4812b7f372bbc37ab4d1c4f8303ecd32
155,76,"2021-10-13 00:54:53","2017-2020 LAND ROVER DISCOVERY L462 CENTER EXHAUST OXYGEN O2 LAMBDA SENSOR RANGE #LD081721",$99.99,"AIR INTAKE & FUEL DELIVERY","FPLA-9G444-AC FPLA 9G444 AC FPLA9G444AC",LD081721-114,SALRGBBV3HA021480,Center,Yellow,LR098287,4WD,,"LRC LKH CORRIS GREY","EBONY/NIMBUS/GLOSS BLACK",155,"2021-10-13 00:54:53","2018-2018  Land Rover  Discovery",e1a42a12ca3c30704cecbf65b0732d28
156,76,"2021-10-13 00:54:53","2017-2020 LAND ROVER DISCOVERY L462 CENTER EXHAUST OXYGEN O2 LAMBDA SENSOR RANGE #LD081721",$99.99,"AIR INTAKE & FUEL DELIVERY","FPLA-9G444-AC FPLA 9G444 AC FPLA9G444AC",LD081721-114,SALRGBBV3HA021480,Center,Yellow,LR098287,4WD,,"LRC LKH CORRIS GREY","EBONY/NIMBUS/GLOSS BLACK",156,"2021-10-13 00:54:53","2019-2020  Land Rover  Discovery",9241f51fbe2a2bbd3d61547ebb254114
157,76,"2021-10-13 00:54:53","2017-2020 LAND ROVER DISCOVERY L462 CENTER EXHAUST OXYGEN O2 LAMBDA SENSOR RANGE #LD081721",$99.99,"AIR INTAKE & FUEL DELIVERY","FPLA-9G444-AC FPLA 9G444 AC FPLA9G444AC",LD081721-114,SALRGBBV3HA021480,Center,Yellow,LR098287,4WD,,"LRC LKH CORRIS GREY","EBONY/NIMBUS/GLOSS BLACK",157,"2021-10-13 00:54:53","2020-2020  Land Rover  Discovery",3851ee02ba2f488097e5d3e1a2ac885c
158,76,"2021-10-13 00:54:53","2017-2020 LAND ROVER DISCOVERY L462 CENTER EXHAUST OXYGEN O2 LAMBDA SENSOR RANGE #LD081721",$99.99,"AIR INTAKE & FUEL DELIVERY","FPLA-9G444-AC FPLA 9G444 AC FPLA9G444AC",LD081721-114,SALRGBBV3HA021480,Center,Yellow,LR098287,4WD,,"LRC LKH CORRIS GREY","EBONY/NIMBUS/GLOSS BLACK",158,"2021-10-13 00:54:53","2015-2015  Land Rover  Range Rover",c61420324a6f9eab4e0eb3945871ba06
159,76,"2021-10-13 00:54:53","2017-2020 LAND ROVER DISCOVERY L462 CENTER EXHAUST OXYGEN O2 LAMBDA SENSOR RANGE #LD081721",$99.99,"AIR INTAKE & FUEL DELIVERY","FPLA-9G444-AC FPLA 9G444 AC FPLA9G444AC",LD081721-114,SALRGBBV3HA021480,Center,Yellow,LR098287,4WD,,"LRC LKH CORRIS GREY","EBONY/NIMBUS/GLOSS BLACK",159,"2021-10-13 00:54:53","2016-2017  Land Rover  Range Rover",0b9331a9fafc7b695db50c0145688198
160,76,"2021-10-13 00:54:53","2017-2020 LAND ROVER DISCOVERY L462 CENTER EXHAUST OXYGEN O2 LAMBDA SENSOR RANGE #LD081721",$99.99,"AIR INTAKE & FUEL DELIVERY","FPLA-9G444-AC FPLA 9G444 AC FPLA9G444AC",LD081721-114,SALRGBBV3HA021480,Center,Yellow,LR098287,4WD,,"LRC LKH CORRIS GREY","EBONY/NIMBUS/GLOSS BLACK",160,"2021-10-13 00:54:53","2016-2019  Land Rover  Range Rover",09d61d4235718efa66b663a6eb76d2fb
162,76,"2021-10-13 00:54:53","2017-2020 LAND ROVER DISCOVERY L462 CENTER EXHAUST OXYGEN O2 LAMBDA SENSOR RANGE #LD081721",$99.99,"AIR INTAKE & FUEL DELIVERY","FPLA-9G444-AC FPLA 9G444 AC FPLA9G444AC",LD081721-114,SALRGBBV3HA021480,Center,Yellow,LR098287,4WD,,"LRC LKH CORRIS GREY","EBONY/NIMBUS/GLOSS BLACK",162,"2021-10-13 00:54:53","2020-2020  Land Rover  Range Rover",11ea1b348a5ae9a0b3d92d7e16ff246b
164,76,"2021-10-13 00:54:53","2017-2020 LAND ROVER DISCOVERY L462 CENTER EXHAUST OXYGEN O2 LAMBDA SENSOR RANGE #LD081721",$99.99,"AIR INTAKE & FUEL DELIVERY","FPLA-9G444-AC FPLA 9G444 AC FPLA9G444AC",LD081721-114,SALRGBBV3HA021480,Center,Yellow,LR098287,4WD,,"LRC LKH CORRIS GREY","EBONY/NIMBUS/GLOSS BLACK",164,"2021-10-13 00:54:53","2021-2021  Land Rover  Range Rover",28edd969591bda68f358976ffff4a69a
165,76,"2021-10-13 00:54:53","2017-2020 LAND ROVER DISCOVERY L462 CENTER EXHAUST OXYGEN O2 LAMBDA SENSOR RANGE #LD081721",$99.99,"AIR INTAKE & FUEL DELIVERY","FPLA-9G444-AC FPLA 9G444 AC FPLA9G444AC",LD081721-114,SALRGBBV3HA021480,Center,Yellow,LR098287,4WD,,"LRC LKH CORRIS GREY","EBONY/NIMBUS/GLOSS BLACK",165,"2021-10-13 00:54:53","2015-2015  Land Rover  Range Rover Sport",1c59acc7e794f58501d938f463adfda3