part_x_car.id,part.id,part.ts,part.title,part.price,part.category,part.mpn,part.sku,part.vin,part.placement,part.color,part.part_number,part.trivetrain,part.engine,part.exterior_color,part.interior_color,car.id,car.ts,car.car_model,car.uniq
1,1,"2021-10-13 00:32:27","07-11 MERCEDES BENZ ML63 W164 A/C AC COMPRESSOR AUTOMATIC PUMP THRU 10/07 3 ZONE #MB010917",$199.99,A/C-HEATER-VENTILATION,"A 002 230 23 11, A0022302311, 22302311",MB010917-024,4JGBB77E07A217982,,,,4WD,,"LASURITE BLUE METALLIC PAINT (349)","EXCLUSIVE LEATHER - GRAY (508)",1,"2021-10-13 00:32:27","<td>2007</td><td>2011</td><td>MERCEDES-BENZ</td><td>ML63 AMG</td><td>Base</td><td>w/o rear AC, 6.3L</td>",65b237fff9167c86e79304fd0258bc1f
2,2,"2021-10-13 00:33:50","07-12 LEXUS LS460 FRONT LEFT DRIVER SIDE DASH VENT GRILLE AIR COWL TRIM PANEL",$24.77,A/C-HEATER-VENTILATION,"5558110080 / 55581 10080 / 555 811 0080 / 555 811",231618588291,,"Front, Left",Black,"555744-0080 / 5557440080 / 5557 440080 / 555 744 0080",,,,,2,"2021-10-13 00:33:50","<td>2007 </td><td>2012 </td><td>LEXUS</td><td>LS460</td><td>L</td><td>outer, black</td><td>Left</td><td>Vent grille</td>",53752cfd810224020fd5d1a6ff084c13
3,2,"2021-10-13 00:33:50","07-12 LEXUS LS460 FRONT LEFT DRIVER SIDE DASH VENT GRILLE AIR COWL TRIM PANEL",$24.77,A/C-HEATER-VENTILATION,"5558110080 / 55581 10080 / 555 811 0080 / 555 811",231618588291,,"Front, Left",Black,"555744-0080 / 5557440080 / 5557 440080 / 555 744 0080",,,,,3,"2021-10-13 00:33:50","<td>2007 </td><td>2012 </td><td>LEXUS</td><td>LS460</td><td> </td><td>outer, black</td><td>Left</td><td>Vent grille</td>",af5a31b26e81f8ad2370ec04bba3d2fb
4,2,"2021-10-13 00:33:50","07-12 LEXUS LS460 FRONT LEFT DRIVER SIDE DASH VENT GRILLE AIR COWL TRIM PANEL",$24.77,A/C-HEATER-VENTILATION,"5558110080 / 55581 10080 / 555 811 0080 / 555 811",231618588291,,"Front, Left",Black,"555744-0080 / 5557440080 / 5557 440080 / 555 744 0080",,,,,4,"2021-10-13 00:33:50","<td>2008 </td><td>2012 </td><td>LEXUS</td><td>LS600H</td><td>L</td><td>outer, black</td><td>Left</td><td>Vent grille</td>",4b621f85442c09764715b1611cc4b490
5,3,"2021-10-13 00:34:01","08-10 MERCEDES BENZ CL63 AMG CL W216 A/C AC CONDITIONER COMPRESSOR PUMP ASSEMBLY #CL033018",$249.99,A/C-HEATER-VENTILATION,"A0022300911 / A 002 230 09 11 / 0022300911",CL033018-102,WDDEJ77X88A008521,Front,,"22300911 / 2230 0911",RWD,,"CALCITE WHITE - STANDARD FINISH (650U)","LEATHER/NAPPA/SEMI-ANILINE - BLACK/ANTHRACITE (801A)",5,"2021-10-13 00:34:01","<td>2008</td><td>2010</td><td>MERCEDES-BENZ</td><td>CL63 AMG</td><td>Base</td>",067fa234550668edd9c8372bf50b62fe
6,3,"2021-10-13 00:34:01","08-10 MERCEDES BENZ CL63 AMG CL W216 A/C AC CONDITIONER COMPRESSOR PUMP ASSEMBLY #CL033018",$249.99,A/C-HEATER-VENTILATION,"A0022300911 / A 002 230 09 11 / 0022300911",CL033018-102,WDDEJ77X88A008521,Front,,"22300911 / 2230 0911",RWD,,"CALCITE WHITE - STANDARD FINISH (650U)","LEATHER/NAPPA/SEMI-ANILINE - BLACK/ANTHRACITE (801A)",6,"2021-10-13 00:34:01","<td>2008</td><td>2010</td><td>MERCEDES-BENZ</td><td>S63 AMG</td><td>Base</td>",6b9e99e40c36b318b29d6862cabdfe26
7,5,"2021-10-13 00:34:21","08-12 TOYOTA HIGHLANDER QUICK HEATER CORE ELEMENT ASSEMBLY OEM 877100E020",$49.77,A/C-HEATER-VENTILATION,"0948000093 877100E020",301744650093,,,,,,,,,7,"2021-10-13 00:34:21","<td>2012</td><td>2012</td><td>TOYOTA</td><td>HIGHLANDER</td><td>HYBRID LIMITED</td><td>US BUILT</td><td></td><td>Heater assy</td>",57e78c3cc88c55cc16abb392119a348c
8,5,"2021-10-13 00:34:21","08-12 TOYOTA HIGHLANDER QUICK HEATER CORE ELEMENT ASSEMBLY OEM 877100E020",$49.77,A/C-HEATER-VENTILATION,"0948000093 877100E020",301744650093,,,,,,,,,8,"2021-10-13 00:34:21","<td>2008</td><td>2010</td><td>TOYOTA</td><td>HIGHLANDER</td><td>LIMITED</td><td>JAPAN BUILT</td><td></td><td>Heater assy</td>",29e7b7c5b184f058e94b50fdfbd23a78
9,5,"2021-10-13 00:34:21","08-12 TOYOTA HIGHLANDER QUICK HEATER CORE ELEMENT ASSEMBLY OEM 877100E020",$49.77,A/C-HEATER-VENTILATION,"0948000093 877100E020",301744650093,,,,,,,,,9,"2021-10-13 00:34:21","<td>2010</td><td>2011</td><td>TOYOTA</td><td>HIGHLANDER</td><td>LIMITED</td><td>US BUILT</td><td></td><td>Heater assy</td>",e62b3d61fb010d44948246170cbcd59e
10,5,"2021-10-13 00:34:21","08-12 TOYOTA HIGHLANDER QUICK HEATER CORE ELEMENT ASSEMBLY OEM 877100E020",$49.77,A/C-HEATER-VENTILATION,"0948000093 877100E020",301744650093,,,,,,,,,10,"2021-10-13 00:34:21","<td>2008</td><td>2010</td><td>TOYOTA</td><td>HIGHLANDER</td><td>SPORT</td><td>JAPAN BUILT</td><td></td><td>Heater assy</td>",e57dbd164a853be3cd1ddf07226ff7b0
11,5,"2021-10-13 00:34:21","08-12 TOYOTA HIGHLANDER QUICK HEATER CORE ELEMENT ASSEMBLY OEM 877100E020",$49.77,A/C-HEATER-VENTILATION,"0948000093 877100E020",301744650093,,,,,,,,,11,"2021-10-13 00:34:21","<td>2010</td><td>2010</td><td>TOYOTA</td><td>HIGHLANDER</td><td>SPORT</td><td>US BUILT</td><td></td><td>Heater assy</td>",c669b26f4f468525c404828a78c7cee5
12,5,"2021-10-13 00:34:21","08-12 TOYOTA HIGHLANDER QUICK HEATER CORE ELEMENT ASSEMBLY OEM 877100E020",$49.77,A/C-HEATER-VENTILATION,"0948000093 877100E020",301744650093,,,,,,,,,12,"2021-10-13 00:34:21","<td>2008</td><td>2010</td><td>TOYOTA</td><td>HIGHLANDER</td><td></td><td>JAPAN BUILT</td><td></td><td>Heater assy</td>",ac9a1150a4553d5a702d606ba00d0f6b
13,5,"2021-10-13 00:34:21","08-12 TOYOTA HIGHLANDER QUICK HEATER CORE ELEMENT ASSEMBLY OEM 877100E020",$49.77,A/C-HEATER-VENTILATION,"0948000093 877100E020",301744650093,,,,,,,,,13,"2021-10-13 00:34:21","<td>2010</td><td>2012</td><td>TOYOTA</td><td>HIGHLANDER</td><td></td><td>US BUILT</td><td></td><td>Heater assy</td>",9f3daea9f0d3255de0954f7bd8ef92b3
14,7,"2021-10-13 00:34:43","10-13 BMW 550I GT F07 4.4L V8 AC AIR CONDITIONER LINE HOSE HOSES PIPE TUBES SET #BM052018",$94.95,A/C-HEATER-VENTILATION,"64539201923 / 64 53 9 201 923 / 64 53 9201923",BM052018-136,WBASP4C5XBC341438,Front,,"64539201926 / 64539119995 / 64539201925",AWD,,"Dark Graphite Metallic (A90)","Ivory White/Black (LCEW)",14,"2021-10-13 00:34:43","<td>2011</td><td>2013</td><td>BMW</td><td>550i</td><td>Base</td><td>4.4 LITER TURBO (N63T)</td>",07dd90cf8389f91ce368eaf93fb6da74
15,7,"2021-10-13 00:34:43","10-13 BMW 550I GT F07 4.4L V8 AC AIR CONDITIONER LINE HOSE HOSES PIPE TUBES SET #BM052018",$94.95,A/C-HEATER-VENTILATION,"64539201923 / 64 53 9 201 923 / 64 53 9201923",BM052018-136,WBASP4C5XBC341438,Front,,"64539201926 / 64539119995 / 64539201925",AWD,,"Dark Graphite Metallic (A90)","Ivory White/Black (LCEW)",15,"2021-10-13 00:34:43","<td>2010</td><td>2012</td><td>BMW</td><td>550i GT</td><td>Base</td><td>4.4 LITER</td>",d33e24838f7ae22411dd902eeb5dddba
16,7,"2021-10-13 00:34:43","10-13 BMW 550I GT F07 4.4L V8 AC AIR CONDITIONER LINE HOSE HOSES PIPE TUBES SET #BM052018",$94.95,A/C-HEATER-VENTILATION,"64539201923 / 64 53 9 201 923 / 64 53 9201923",BM052018-136,WBASP4C5XBC341438,Front,,"64539201926 / 64539119995 / 64539201925",AWD,,"Dark Graphite Metallic (A90)","Ivory White/Black (LCEW)",16,"2021-10-13 00:34:43","<td>2010</td><td>2012</td><td>BMW</td><td>550i GT xDrive</td><td>Base</td><td>4.4 LITER</td>",b80a968ef26340a957cf1197f3f88503
17,7,"2021-10-13 00:34:43","10-13 BMW 550I GT F07 4.4L V8 AC AIR CONDITIONER LINE HOSE HOSES PIPE TUBES SET #BM052018",$94.95,A/C-HEATER-VENTILATION,"64539201923 / 64 53 9 201 923 / 64 53 9201923",BM052018-136,WBASP4C5XBC341438,Front,,"64539201926 / 64539119995 / 64539201925",AWD,,"Dark Graphite Metallic (A90)","Ivory White/Black (LCEW)",17,"2021-10-13 00:34:43","<td>2011</td><td>2013</td><td>BMW</td><td>550i xDrive</td><td>Base</td><td>4.4 LITER TURBO (N63T)</td>",26f460a712e703e72d4ecb7833030648
18,7,"2021-10-13 00:34:43","10-13 BMW 550I GT F07 4.4L V8 AC AIR CONDITIONER LINE HOSE HOSES PIPE TUBES SET #BM052018",$94.95,A/C-HEATER-VENTILATION,"64539201923 / 64 53 9 201 923 / 64 53 9201923",BM052018-136,WBASP4C5XBC341438,Front,,"64539201926 / 64539119995 / 64539201925",AWD,,"Dark Graphite Metallic (A90)","Ivory White/Black (LCEW)",18,"2021-10-13 00:34:43","<td>2012</td><td>2013</td><td>BMW</td><td>650i</td><td>Base</td><td>4.4 LITER TURBO, w/o M6</td>",5b2034f7c6a693a5e3bd525277cc23df
19,7,"2021-10-13 00:34:43","10-13 BMW 550I GT F07 4.4L V8 AC AIR CONDITIONER LINE HOSE HOSES PIPE TUBES SET #BM052018",$94.95,A/C-HEATER-VENTILATION,"64539201923 / 64 53 9 201 923 / 64 53 9201923",BM052018-136,WBASP4C5XBC341438,Front,,"64539201926 / 64539119995 / 64539201925",AWD,,"Dark Graphite Metallic (A90)","Ivory White/Black (LCEW)",19,"2021-10-13 00:34:43","<td>2013</td><td>2013</td><td>BMW</td><td>650i Gran Coupe</td><td>Base</td><td>4.4 LITER TURBO, w/o M6</td>",c920cde47354ebf79d4a0a7e6d720094
20,7,"2021-10-13 00:34:43","10-13 BMW 550I GT F07 4.4L V8 AC AIR CONDITIONER LINE HOSE HOSES PIPE TUBES SET #BM052018",$94.95,A/C-HEATER-VENTILATION,"64539201923 / 64 53 9 201 923 / 64 53 9201923",BM052018-136,WBASP4C5XBC341438,Front,,"64539201926 / 64539119995 / 64539201925",AWD,,"Dark Graphite Metallic (A90)","Ivory White/Black (LCEW)",20,"2021-10-13 00:34:43","<td>2012</td><td>2013</td><td>BMW</td><td>650i xDrive</td><td>Base</td><td>4.4 LITER TURBO, w/o M6</td>",170f0256d5876db9ebd2a50fa1f79f7f
21,7,"2021-10-13 00:34:43","10-13 BMW 550I GT F07 4.4L V8 AC AIR CONDITIONER LINE HOSE HOSES PIPE TUBES SET #BM052018",$94.95,A/C-HEATER-VENTILATION,"64539201923 / 64 53 9 201 923 / 64 53 9201923",BM052018-136,WBASP4C5XBC341438,Front,,"64539201926 / 64539119995 / 64539201925",AWD,,"Dark Graphite Metallic (A90)","Ivory White/Black (LCEW)",21,"2021-10-13 00:34:43","<td>2013</td><td>2013</td><td>BMW</td><td>650i xDrive Gran Coupe</td><td>Base</td><td>4.4 LITER TURBO, w/o M6</td>",9e477e402c36dfae41aeab486b991cd4
22,7,"2021-10-13 00:34:43","10-13 BMW 550I GT F07 4.4L V8 AC AIR CONDITIONER LINE HOSE HOSES PIPE TUBES SET #BM052018",$94.95,A/C-HEATER-VENTILATION,"64539201923 / 64 53 9 201 923 / 64 53 9201923",BM052018-136,WBASP4C5XBC341438,Front,,"64539201926 / 64539119995 / 64539201925",AWD,,"Dark Graphite Metallic (A90)","Ivory White/Black (LCEW)",22,"2021-10-13 00:34:43","<td>2009</td><td>2009</td><td>BMW</td><td>750Li</td><td>Base</td><td>750 MODELS, 760</td>",a470a1743fa44ff992082960635709b8
23,7,"2021-10-13 00:34:43","10-13 BMW 550I GT F07 4.4L V8 AC AIR CONDITIONER LINE HOSE HOSES PIPE TUBES SET #BM052018",$94.95,A/C-HEATER-VENTILATION,"64539201923 / 64 53 9 201 923 / 64 53 9201923",BM052018-136,WBASP4C5XBC341438,Front,,"64539201926 / 64539119995 / 64539201925",AWD,,"Dark Graphite Metallic (A90)","Ivory White/Black (LCEW)",23,"2021-10-13 00:34:43","<td>2009</td><td>2009</td><td>BMW</td><td>750i</td><td>Base</td><td>750 MODELS, 760</td>",b29a21ee09612291bb92ad11682907f4
24,8,"2021-10-13 00:34:51","10-13 LEXUS RX350 FRONT RIGHT DASH VENT GRILLE AC A/C AIR HEATER OUTLET TRIM #RX060115",$23.77,A/C-HEATER-VENTILATION,"556600E020C0 / 5566 00E0 20C0 / 556 600 E02 0C0",301706517681,2T2ZK1BA7AC024960,"Right, Front","Black, BLACK LB20","556600E020 / 55660 0E020 / 55660-0E020 / 556 600 E020 / 556 600 E02 0",FWD,,"SMOKY GRANITE MICA GRAY 1G0Â","BLACK LB20",24,"2021-10-13 00:34:51","<td>2010</td><td>2015</td><td>LEXUS</td><td>RX350</td><td>Base</td><td>outer, black</td>",da2cc6d5f3b9b3f0e9cf349d3dfd3776
25,8,"2021-10-13 00:34:51","10-13 LEXUS RX350 FRONT RIGHT DASH VENT GRILLE AC A/C AIR HEATER OUTLET TRIM #RX060115",$23.77,A/C-HEATER-VENTILATION,"556600E020C0 / 5566 00E0 20C0 / 556 600 E02 0C0",301706517681,2T2ZK1BA7AC024960,"Right, Front","Black, BLACK LB20","556600E020 / 55660 0E020 / 55660-0E020 / 556 600 E020 / 556 600 E02 0",FWD,,"SMOKY GRANITE MICA GRAY 1G0Â","BLACK LB20",25,"2021-10-13 00:34:51","<td>2013</td><td>2015</td><td>LEXUS</td><td>RX350</td><td>F Sport</td><td>outer, black</td>",094811f9e99191d033799f65f0c13fd9
26,8,"2021-10-13 00:34:51","10-13 LEXUS RX350 FRONT RIGHT DASH VENT GRILLE AC A/C AIR HEATER OUTLET TRIM #RX060115",$23.77,A/C-HEATER-VENTILATION,"556600E020C0 / 5566 00E0 20C0 / 556 600 E02 0C0",301706517681,2T2ZK1BA7AC024960,"Right, Front","Black, BLACK LB20","556600E020 / 55660 0E020 / 55660-0E020 / 556 600 E020 / 556 600 E02 0",FWD,,"SMOKY GRANITE MICA GRAY 1G0Â","BLACK LB20",26,"2021-10-13 00:34:51","<td>2010</td><td>2015</td><td>LEXUS</td><td>RX450h</td><td>Base</td><td>outer, black</td>",98b27099a8abf9b1897eae7e83de0c17
27,9,"2021-10-13 00:36:26","10-15 JAGUAR XJ REAR CENTER CONSOLE CLIMATE CONTROL COOLED SEAT HEATER AC SWITCH #XJ100820",$64.95,A/C-HEATER-VENTILATION,"AW9318D687JA AW93-18D687-JA AW93 18D687 JA",XJ100820-044,SAJWA3HT2FMV87702,Rear,Black,C2D47276,RWD,,"PEL BLACK METALLIC","BLACK/PIANO BLACK/PDB",27,"2021-10-13 00:36:26","2010-2013  Jaguar  XJ  Rear; w/cooled seats",050d776dfaaa15b8fe403f2b1309438e
28,9,"2021-10-13 00:36:26","10-15 JAGUAR XJ REAR CENTER CONSOLE CLIMATE CONTROL COOLED SEAT HEATER AC SWITCH #XJ100820",$64.95,A/C-HEATER-VENTILATION,"AW9318D687JA AW93-18D687-JA AW93 18D687 JA",XJ100820-044,SAJWA3HT2FMV87702,Rear,Black,C2D47276,RWD,,"PEL BLACK METALLIC","BLACK/PIANO BLACK/PDB",28,"2021-10-13 00:36:26","2014-2015  Jaguar  XJ  XJ; Rear; w/cooled seats",9f89c8445cec634d2e2494ca175ddaff
29,9,"2021-10-13 00:36:26","10-15 JAGUAR XJ REAR CENTER CONSOLE CLIMATE CONTROL COOLED SEAT HEATER AC SWITCH #XJ100820",$64.95,A/C-HEATER-VENTILATION,"AW9318D687JA AW93-18D687-JA AW93 18D687 JA",XJ100820-044,SAJWA3HT2FMV87702,Rear,Black,C2D47276,RWD,,"PEL BLACK METALLIC","BLACK/PIANO BLACK/PDB",29,"2021-10-13 00:36:26","2014-2015  Jaguar  XJR  XJR; Rear; w/cooled seats",a035276363c2aee2ce06a7f39e33fb7a
30,10,"2021-10-13 00:36:45","10-18 JAGUAR XJ XJL CENTER CONSOLE REAR AC HEATER AIR VENT GRILLE LOUVER SET-2 #JA032418",$49.95,A/C-HEATER-VENTILATION,"AW93014A24AC / AW93 014A24 AC",JA032418-041,SAJWA2GB8BLV06236,"Right, Left. Rear",Black,"C2D19164 / C2D19162",RWD,,"EBONY BLACK (EBON)","LONDON TAN / JET",30,"2021-10-13 00:36:45",<td>2010</td><td>2011</td><td>JAGUAR</td><td>XJ</td><td>L</td>,99b8087f695ed57c788638f61f4a4812
31,10,"2021-10-13 00:36:45","10-18 JAGUAR XJ XJL CENTER CONSOLE REAR AC HEATER AIR VENT GRILLE LOUVER SET-2 #JA032418",$49.95,A/C-HEATER-VENTILATION,"AW93014A24AC / AW93 014A24 AC",JA032418-041,SAJWA2GB8BLV06236,"Right, Left. Rear",Black,"C2D19164 / C2D19162",RWD,,"EBONY BLACK (EBON)","LONDON TAN / JET",31,"2021-10-13 00:36:45","<td>2010</td><td>2017</td><td>JAGUAR</td><td>XJ</td><td>L Supercharged</td>",174935cfa1e338a066e402803e295540
32,10,"2021-10-13 00:36:45","10-18 JAGUAR XJ XJL CENTER CONSOLE REAR AC HEATER AIR VENT GRILLE LOUVER SET-2 #JA032418",$49.95,A/C-HEATER-VENTILATION,"AW93014A24AC / AW93 014A24 AC",JA032418-041,SAJWA2GB8BLV06236,"Right, Left. Rear",Black,"C2D19164 / C2D19162",RWD,,"EBONY BLACK (EBON)","LONDON TAN / JET",32,"2021-10-13 00:36:45",<td>2010</td><td>2017</td><td>JAGUAR</td><td>XJ</td><td>Supercharged</td>,27ab2bb4e857d60da1c4d091c4a68ba8
33,10,"2021-10-13 00:36:45","10-18 JAGUAR XJ XJL CENTER CONSOLE REAR AC HEATER AIR VENT GRILLE LOUVER SET-2 #JA032418",$49.95,A/C-HEATER-VENTILATION,"AW93014A24AC / AW93 014A24 AC",JA032418-041,SAJWA2GB8BLV06236,"Right, Left. Rear",Black,"C2D19164 / C2D19162",RWD,,"EBONY BLACK (EBON)","LONDON TAN / JET",33,"2021-10-13 00:36:45",<td>2014</td><td>2017</td><td>JAGUAR</td><td>XJR</td><td>Base</td>,5d222dfa1f86808229cdd4c49cf78170
34,10,"2021-10-13 00:36:45","10-18 JAGUAR XJ XJL CENTER CONSOLE REAR AC HEATER AIR VENT GRILLE LOUVER SET-2 #JA032418",$49.95,A/C-HEATER-VENTILATION,"AW93014A24AC / AW93 014A24 AC",JA032418-041,SAJWA2GB8BLV06236,"Right, Left. Rear",Black,"C2D19164 / C2D19162",RWD,,"EBONY BLACK (EBON)","LONDON TAN / JET",34,"2021-10-13 00:36:45",<td>2014</td><td>2017</td><td>JAGUAR</td><td>XJR</td><td>L</td>,fde6677367b21b6307dbbe6037c2ff28
35,11,"2021-10-13 00:36:52","11-12 AUDI A8 A8L CENTER LEFT VENT GRILLE AC A/C AIR CONDITIONING HEAT OUTLET #AH051515",$19.95,A/C-HEATER-VENTILATION,"4H1820951A / 4H1 820 951A / 4H1 820 951 A",291516060230,WAURVAFD3BN005513,"Left, Front",,"4H1820951B / 4H1 820 951B / 4H1 820 951 B / 4H1820951 B",AWD,,"ICE SILVER LX7W","BLACK FZ",35,"2021-10-13 00:36:52","<td>2011 </td><td>2012 </td><td>AUDI</td><td>A8 QUATTRO</td><td>L</td>",8d7bf4631b7272c6bd7cbcab2b046106
36,11,"2021-10-13 00:36:52","11-12 AUDI A8 A8L CENTER LEFT VENT GRILLE AC A/C AIR CONDITIONING HEAT OUTLET #AH051515",$19.95,A/C-HEATER-VENTILATION,"4H1820951A / 4H1 820 951A / 4H1 820 951 A",291516060230,WAURVAFD3BN005513,"Left, Front",,"4H1820951B / 4H1 820 951B / 4H1 820 951 B / 4H1820951 B",AWD,,"ICE SILVER LX7W","BLACK FZ",36,"2021-10-13 00:36:52","<td>2012 </td><td>2012 </td><td>AUDI</td><td>A8 QUATTRO</td><td>L W12</td>",b7ad6ed8550094aebc3a89766802a9dd
37,11,"2021-10-13 00:36:52","11-12 AUDI A8 A8L CENTER LEFT VENT GRILLE AC A/C AIR CONDITIONING HEAT OUTLET #AH051515",$19.95,A/C-HEATER-VENTILATION,"4H1820951A / 4H1 820 951A / 4H1 820 951 A",291516060230,WAURVAFD3BN005513,"Left, Front",,"4H1820951B / 4H1 820 951B / 4H1 820 951 B / 4H1820951 B",AWD,,"ICE SILVER LX7W","BLACK FZ",37,"2021-10-13 00:36:52","<td>2011 </td><td>2012 </td><td>AUDI</td><td>A8 QUATTRO</td><td> </td>",f0e520489163cb0a5b2dc680d53882bf
38,12,"2021-10-13 00:37:00","12-13 RANGE ROVER EVOQUE DASH AC CLIMATE CONTROL HEATED SEAT WINDSHIELD SWITCH #EQ051518",$74.95,A/C-HEATER-VENTILATION,"BJ32-14C239-HC / BJ32 14C239 HC / BJ3214C239HC",EQ051518-018,SALVR2BG4CH664575,Front,Black,"LR028193 / LR 028 193 / LR 028193 / LRO28193",AWD,,"BLACK (SANTORINI BLACK)",BLACK,38,"2021-10-13 00:37:00","<td>2012</td><td>2013</td><td>LAND ROVER</td><td>Range Rover Evoque</td><td>Dynamic</td><td>TRIM & ELECTRICAL, w/heated windshield, w/heated seats</td>",dd0d6ad32b80a85ca2c5519e1e044609
39,12,"2021-10-13 00:37:00","12-13 RANGE ROVER EVOQUE DASH AC CLIMATE CONTROL HEATED SEAT WINDSHIELD SWITCH #EQ051518",$74.95,A/C-HEATER-VENTILATION,"BJ32-14C239-HC / BJ32 14C239 HC / BJ3214C239HC",EQ051518-018,SALVR2BG4CH664575,Front,Black,"LR028193 / LR 028 193 / LR 028193 / LRO28193",AWD,,"BLACK (SANTORINI BLACK)",BLACK,39,"2021-10-13 00:37:00","<td>2012</td><td>2013</td><td>LAND ROVER</td><td>Range Rover Evoque</td><td>Prestige</td><td>TRIM & ELECTRICAL, w/heated windshield, w/heated seats</td>",45eae23646ecff9b6d06050c7b9cc96a
40,12,"2021-10-13 00:37:00","12-13 RANGE ROVER EVOQUE DASH AC CLIMATE CONTROL HEATED SEAT WINDSHIELD SWITCH #EQ051518",$74.95,A/C-HEATER-VENTILATION,"BJ32-14C239-HC / BJ32 14C239 HC / BJ3214C239HC",EQ051518-018,SALVR2BG4CH664575,Front,Black,"LR028193 / LR 028 193 / LR 028193 / LRO28193",AWD,,"BLACK (SANTORINI BLACK)",BLACK,40,"2021-10-13 00:37:00","<td>2012</td><td>2013</td><td>LAND ROVER</td><td>Range Rover Evoque</td><td>Pure</td><td>TRIM & ELECTRICAL, w/heated windshield, w/heated seats</td>",ce17c17198e2b774364d6ef0deb09d8f
41,13,"2021-10-13 00:37:19","12-14 BMW 335I F30 DASH HEATER AC CLIMATE CONTROL AIR HEATER UNIT RADIO SWITCH",$79.77,A/C-HEATER-VENTILATION,"6131932355502 / 6131 9323 555 02 / 613 193 235 55",BW021017-027,,Front,"Black, Silver","6411928734101 / 6411 9287 341 01 / 641 192 873 41 01",,,,,41,"2021-10-13 00:37:19","<td>2013</td><td>2014</td><td>BMW</td><td>320i</td><td>Base</td><td>w/heated seats, w/chrome</td>",eec659f2d6d63d68dbdb6552e92ca894
42,13,"2021-10-13 00:37:19","12-14 BMW 335I F30 DASH HEATER AC CLIMATE CONTROL AIR HEATER UNIT RADIO SWITCH",$79.77,A/C-HEATER-VENTILATION,"6131932355502 / 6131 9323 555 02 / 613 193 235 55",BW021017-027,,Front,"Black, Silver","6411928734101 / 6411 9287 341 01 / 641 192 873 41 01",,,,,42,"2021-10-13 00:37:19","<td>2013</td><td>2014</td><td>BMW</td><td>320i xDrive</td><td>Base</td><td>w/heated seats, w/chrome</td>",3b41e9d987fc1a6c12e7dd21032b5264
43,13,"2021-10-13 00:37:19","12-14 BMW 335I F30 DASH HEATER AC CLIMATE CONTROL AIR HEATER UNIT RADIO SWITCH",$79.77,A/C-HEATER-VENTILATION,"6131932355502 / 6131 9323 555 02 / 613 193 235 55",BW021017-027,,Front,"Black, Silver","6411928734101 / 6411 9287 341 01 / 641 192 873 41 01",,,,,43,"2021-10-13 00:37:19","<td>2014</td><td>2014</td><td>BMW</td><td>328d</td><td>Base</td><td>w/heated seats, w/chrome</td>",0727d45332655ab9e622de5ec2104927
44,13,"2021-10-13 00:37:19","12-14 BMW 335I F30 DASH HEATER AC CLIMATE CONTROL AIR HEATER UNIT RADIO SWITCH",$79.77,A/C-HEATER-VENTILATION,"6131932355502 / 6131 9323 555 02 / 613 193 235 55",BW021017-027,,Front,"Black, Silver","6411928734101 / 6411 9287 341 01 / 641 192 873 41 01",,,,,44,"2021-10-13 00:37:19","<td>2014</td><td>2014</td><td>BMW</td><td>328d xDrive</td><td>Base</td><td>w/heated seats, w/chrome</td>",3eb3a4ca7bd2800c6bf5809baaeaad0a
45,13,"2021-10-13 00:37:19","12-14 BMW 335I F30 DASH HEATER AC CLIMATE CONTROL AIR HEATER UNIT RADIO SWITCH",$79.77,A/C-HEATER-VENTILATION,"6131932355502 / 6131 9323 555 02 / 613 193 235 55",BW021017-027,,Front,"Black, Silver","6411928734101 / 6411 9287 341 01 / 641 192 873 41 01",,,,,45,"2021-10-13 00:37:19","<td>2012</td><td>2014</td><td>BMW</td><td>328i</td><td>Base</td><td>w/heated seats, w/chrome</td>",9a4f85eb4f328845a03a3783699e5967
46,13,"2021-10-13 00:37:19","12-14 BMW 335I F30 DASH HEATER AC CLIMATE CONTROL AIR HEATER UNIT RADIO SWITCH",$79.77,A/C-HEATER-VENTILATION,"6131932355502 / 6131 9323 555 02 / 613 193 235 55",BW021017-027,,Front,"Black, Silver","6411928734101 / 6411 9287 341 01 / 641 192 873 41 01",,,,,46,"2021-10-13 00:37:19","<td>2014</td><td>2014</td><td>BMW</td><td>328i GT xDrive</td><td>Base</td><td>w/heated seats, w/chrome</td>",c6105d590203bb54af323b52ae1751c7
47,13,"2021-10-13 00:37:19","12-14 BMW 335I F30 DASH HEATER AC CLIMATE CONTROL AIR HEATER UNIT RADIO SWITCH",$79.77,A/C-HEATER-VENTILATION,"6131932355502 / 6131 9323 555 02 / 613 193 235 55",BW021017-027,,Front,"Black, Silver","6411928734101 / 6411 9287 341 01 / 641 192 873 41 01",,,,,47,"2021-10-13 00:37:19","<td>2012</td><td>2014</td><td>BMW</td><td>328i xDrive</td><td>Base</td><td>w/heated seats, w/chrome</td>",7b7fa258bcc0fac2fe6fdb071fd98ab5
48,13,"2021-10-13 00:37:19","12-14 BMW 335I F30 DASH HEATER AC CLIMATE CONTROL AIR HEATER UNIT RADIO SWITCH",$79.77,A/C-HEATER-VENTILATION,"6131932355502 / 6131 9323 555 02 / 613 193 235 55",BW021017-027,,Front,"Black, Silver","6411928734101 / 6411 9287 341 01 / 641 192 873 41 01",,,,,48,"2021-10-13 00:37:19","<td>2012</td><td>2013</td><td>BMW</td><td>335i</td><td>Base</td><td>SEDAN, w/heated seats, w/chrome</td>",e002923baddaec131f5fc3fef457b2fa
49,13,"2021-10-13 00:37:19","12-14 BMW 335I F30 DASH HEATER AC CLIMATE CONTROL AIR HEATER UNIT RADIO SWITCH",$79.77,A/C-HEATER-VENTILATION,"6131932355502 / 6131 9323 555 02 / 613 193 235 55",BW021017-027,,Front,"Black, Silver","6411928734101 / 6411 9287 341 01 / 641 192 873 41 01",,,,,49,"2021-10-13 00:37:19","<td>2014</td><td>2014</td><td>BMW</td><td>335i</td><td>Base</td><td>w/heated seats, w/chrome</td>",8a7fdf459898375dc45b4488aef5c57d
50,13,"2021-10-13 00:37:19","12-14 BMW 335I F30 DASH HEATER AC CLIMATE CONTROL AIR HEATER UNIT RADIO SWITCH",$79.77,A/C-HEATER-VENTILATION,"6131932355502 / 6131 9323 555 02 / 613 193 235 55",BW021017-027,,Front,"Black, Silver","6411928734101 / 6411 9287 341 01 / 641 192 873 41 01",,,,,50,"2021-10-13 00:37:19","<td>2014</td><td>2014</td><td>BMW</td><td>335i GT xDrive</td><td>Base</td><td>w/heated seats, w/chrome</td>",cdfcfefd5860442a7f2617b72a62a4b0
51,13,"2021-10-13 00:37:19","12-14 BMW 335I F30 DASH HEATER AC CLIMATE CONTROL AIR HEATER UNIT RADIO SWITCH",$79.77,A/C-HEATER-VENTILATION,"6131932355502 / 6131 9323 555 02 / 613 193 235 55",BW021017-027,,Front,"Black, Silver","6411928734101 / 6411 9287 341 01 / 641 192 873 41 01",,,,,51,"2021-10-13 00:37:19","<td>2013</td><td>2013</td><td>BMW</td><td>335i xDrive</td><td>Base</td><td>SEDAN, w/heated seats, w/chrome</td>",15dbb704f3a8ba4be6a45db2bebd4686
52,13,"2021-10-13 00:37:19","12-14 BMW 335I F30 DASH HEATER AC CLIMATE CONTROL AIR HEATER UNIT RADIO SWITCH",$79.77,A/C-HEATER-VENTILATION,"6131932355502 / 6131 9323 555 02 / 613 193 235 55",BW021017-027,,Front,"Black, Silver","6411928734101 / 6411 9287 341 01 / 641 192 873 41 01",,,,,52,"2021-10-13 00:37:19","<td>2014</td><td>2014</td><td>BMW</td><td>335i xDrive</td><td>Base</td><td>w/heated seats, w/chrome</td>",0b69d4c3bfd01b97c678ff00143611e5