image.id,image.ts,image.source_content_type,image.hash_file_content,image.size,image.path,image.title,image.access,name.id,name.ts,name.name,name.popular_year,name.year_number,name.letter,name.gender,name.approval_rating,name.positive_comment_num,name.neutral_comment_num,name.negative_comment_num,name.positive_comment,name.neutral_comment,name.negative_comment,name.description
101,"2021-11-29 03:35:55",image/jpeg,c48d53dcc5f26db4f9d740a3faa444124edef422,15052,/c4/8d/53/dc/c48d53dcc5f26db4f9d740a3faa444124edef422.jpg,,https://songer.datasn.com/data/api/v1/u_e49e7f0fcb85c5451b03/baby_name/by_table/image_access/c4/8d/53/dc/c48d53dcc5f26db4f9d740a3faa444124edef422.jpg,112,"2021-11-28 09:37:35",Alijah,2012,595,A,boy,100%,5,3,,"<li> ""My name is Alijah. I'm a girl. Everybody pronounce it wrong. Like Elijah or Alia. But I like it. My nickname is Ali some people call me both.""  <strong>Jul. 27, 2015:</strong>  <li> ""My sons name is Alijah Jordan. He was born in 2003. He is usually getting it mispronounced as Aaliyah. I wish some would understand that is a proper spelling of the form Elijah. It is pronounced uh-lie-zha. I don't know of any other person with this spelling of the name Alijah.""  <strong>Sep. 22, 2013:</strong>  <li> ""My name is Alijah and I AM A GIRL!! most people spell it Elijah or pronnounce it Aliyah or think that I am a boy. I like my name but i wish people would stop assuming i'm a boy or spelling it Elijah.""  <strong>Nov. 25, 2009:</strong>  <li> ""I love the name Alijah i have a 1yr old daughter named Alani, recently my cousin Sean Elijah Bell was tragically killed and i wanted to let his name live on, also my great grandmother name was Eliza. So since my name is Ayisha and my Fiancee is Adrian Alijah is perfect for a boy later on along the line. God willing...""  <strong>Mar. 28, 2008:</strong>  <li> ""I love this name. I'm pregnant with my second son and was looking for another ""A"" (my other son is Aiden) name and this is perfect, not to popular but not to weird either.........""  <strong>Feb. 17, 2008:</strong>  ","<li> ""I named my daughter Alijah born May 08-2001 pronounced (AH-LEE-JAH) people always call her Elijah or Aaliyah... We are always correcting people and that is ok. I love her name and she does too. We call her Ali for short or Lee, sometimes even Leej. People always assume it is a boy's name when they refer to her. That does get a little annoying but once again, its quite all right. I had my own struggles with my name (Anya-anwu) so she has learned to be ok with helping people through her pronounciation... I have posted a picture of both of us so that u can see how much we suit our names :)""  <strong>Sep. 3, 2008:</strong>  <li> ""I think the pronouncation would be like Elijah, not a-lee-a""  <strong>Mar. 14, 2008:</strong>  <li> ""My name is Alijah except I don't spell it like that I spell it like Alia. I hate this name being spelled like Alijah its too long. The main downside to this name however is that no one can ever pronouce it or spell it I've gotten so many weird spellings like Aliah , Aliyah, and of course Alijah. Oh and by the way I am a girl with this name and I've never heard it being used for a boy not that its a very common name in the states.""  <strong>May. 16, 2007:</strong>   ",,"<p> <li>Records indicate that 5,191 boys in the United States have been named Alijah since 1880.<p> <li>The greatest number of people were given this name in 2012, when 595 people in the U.S. were given the name Alijah. Those people are now 8 years old.<p> <p>So ... how do we know this stuff? Baby Names Hub identifies trends by analyzing vast amounts of data made available by the U.S. government and other public sources. This data, including social security statistics, provides detailed information on baby name popularity and trends in the United States.<p>"
102,"2021-11-29 03:36:02",image/jpeg,debdea284caa6548453c8a0e1aa5c9b2e506aed2,22222,/de/bd/ea/28/debdea284caa6548453c8a0e1aa5c9b2e506aed2.jpg,,https://songer.datasn.com/data/api/v1/u_e49e7f0fcb85c5451b03/baby_name/by_table/image_access/de/bd/ea/28/debdea284caa6548453c8a0e1aa5c9b2e506aed2.jpg,113,"2021-11-28 09:37:41",Allan,1947,"2,183",A,boy,67%,2,4,1,"<li> ""My name is Allan and my sister told me my name is common. I didn't believe her. But still to the people with the name Allan, your awesome.""  <strong>Mar. 29, 2020:</strong>  <li> ""I love the name Allan, I Think its a geat name Give it Thumbs up all the way!! Met a guy called Allan and I Love him to bits :) S""  <strong>Dec. 28, 2008:</strong>  ","<li> ""People always spell my name alan, then alen, and then I get asked about the double l situation. However, I love my name!""  <strong>Apr. 23, 2021:</strong>  <li> ""?Allan? is the least common variant spelling of this name. It is also my given name. No one ever gets the spelling right the first time, sometimes not even the second time. Consequently, I generally just go by ?Al.? There?s no way to misspell that!""  <strong>Jan. 20, 2020:</strong>  <li> ""It always seems so formal to me, for some reason. Maybe its because my father bears the same name, I'm sure I don't know. But I've only ever met one person outside my family who spells it the same way, though the name Allan in all its permutations is not uncommon in any way.""  <strong>Jul. 14, 2007:</strong>  <li> ""People often often spell it Alan or Allen and sometimes Alen.""  <strong>Jul. 4, 2007:</strong>   ","<li> ""The allan I know is abusive to his health, and farts ALL the time!""  <strong>Oct. 11, 2020:</strong>   <div style=""background-color: silver;""> 4 Neutral Comments</div>","<p> <li>Records indicate that 92,335 boys in the United States have been named Allan since 1880.<p> <li>The greatest number of people were given this name in 1947, when 2,183 people in the U.S. were given the name Allan. Those people are now 74 years old.<p> <p>So ... how do we know this stuff? Baby Names Hub identifies trends by analyzing vast amounts of data made available by the U.S. government and other public sources. This data, including social security statistics, provides detailed information on baby name popularity and trends in the United States.<p>"
103,"2021-11-29 03:36:13",image/jpeg,300e9dd1462cfe33e78c50b629f2ec1e5ecbdcce,24473,/30/0e/9d/d1/300e9dd1462cfe33e78c50b629f2ec1e5ecbdcce.jpg,,https://songer.datasn.com/data/api/v1/u_e49e7f0fcb85c5451b03/baby_name/by_table/image_access/30/0e/9d/d1/300e9dd1462cfe33e78c50b629f2ec1e5ecbdcce.jpg,114,"2021-11-28 09:37:46",Allen,1951,"5,159",A,boy,75%,3,3,1,"<li> ""It's my name and I love it. Letters go well and I've always felt it makes more sense to spell the name with and A and E than the other way, Alan.""  <strong>Jan. 12, 2011:</strong>  <li> ""I'm pretty set on naming my first boy Allen i don't know why but i really love it.""  <strong>Feb. 17, 2009:</strong>  <li> ""A lot of people write it as Allan or Alan. Some people even think it's pronounced ""Ellen"". I haven't experienced any negatives with my name. It's sort of cool because I hardly ever run across anyone with the same name.""  <strong>Dec. 28, 2007:</strong>  ","<li> ""I love my name it is just my favorite name. I LOVE MY NAME ALLEN!""  <strong>Feb. 20, 2018:</strong>  <li> ""My name is Allen & I like it because it is a little different. the only thing that gets annoying is that every time I meet someone we have to go over the spelling of it.""  <strong>Apr. 13, 2009:</strong>  <li> ""My boy is named Allen he is so cute it fun to be with an Allen""  <strong>Apr. 5, 2007:</strong>   ","<li> ""I hate the name Allen! It is stupid and has no meaning!""  <strong>Dec. 21, 2007:</strong>   <div style=""background-color: silver;""> 3 Neutral Comments</div>","<p> <li>Records indicate that 262,072 boys in the United States have been named Allen since 1880.<p> <li>The greatest number of people were given this name in 1951, when 5,159 people in the U.S. were given the name Allen. Those people are now 69 years old.<p> <p>So ... how do we know this stuff? Baby Names Hub identifies trends by analyzing vast amounts of data made available by the U.S. government and other public sources. This data, including social security statistics, provides detailed information on baby name popularity and trends in the United States.<p>"
104,"2021-11-29 03:36:19",image/jpeg,91e94f5bbbbad102164a52e5d1d1912084dcbd2e,20372,/91/e9/4f/5b/91e94f5bbbbad102164a52e5d1d1912084dcbd2e.jpg,,https://songer.datasn.com/data/api/v1/u_e49e7f0fcb85c5451b03/baby_name/by_table/image_access/91/e9/4f/5b/91e94f5bbbbad102164a52e5d1d1912084dcbd2e.jpg,115,"2021-11-28 09:37:54",Allie,1923,81,A,boy,100%,2,,,,,,"<p> <li>Records indicate that 1,928 boys in the United States have been named Allie since 1880.<p> <li>The greatest number of people were given this name in 1923, when 81 people in the U.S. were given the name Allie. Those people are now 98 years old.<p> <p>So ... how do we know this stuff? Baby Names Hub identifies trends by analyzing vast amounts of data made available by the U.S. government and other public sources. This data, including social security statistics, provides detailed information on baby name popularity and trends in the United States.<p>"
105,"2021-11-29 03:36:29",image/jpeg,b599cbfadf239571dd0d2ff0399d656e8e14f0ae,19739,/b5/99/cb/fa/b599cbfadf239571dd0d2ff0399d656e8e14f0ae.jpg,,https://songer.datasn.com/data/api/v1/u_e49e7f0fcb85c5451b03/baby_name/by_table/image_access/b5/99/cb/fa/b599cbfadf239571dd0d2ff0399d656e8e14f0ae.jpg,116,"2021-11-28 09:38:05",Allison,1924,72,A,boy,100%,1,,,,,,"<p> <li>Records indicate that 1,527 boys in the United States have been named Allison since 1880.<p> <li>The greatest number of people were given this name in 1924, when 72 people in the U.S. were given the name Allison. Those people are now 96 years old.<p> <p>So ... how do we know this stuff? Baby Names Hub identifies trends by analyzing vast amounts of data made available by the U.S. government and other public sources. This data, including social security statistics, provides detailed information on baby name popularity and trends in the United States.<p>"
106,"2021-11-29 03:36:36",image/jpeg,19668a7533405ba67390df024f9c5d2f88cea751,17988,/19/66/8a/75/19668a7533405ba67390df024f9c5d2f88cea751.jpg,,https://songer.datasn.com/data/api/v1/u_e49e7f0fcb85c5451b03/baby_name/by_table/image_access/19/66/8a/75/19668a7533405ba67390df024f9c5d2f88cea751.jpg,117,"2021-11-28 09:38:16",Allyn,1947,71,A,boy,?,,,,,,,"<p> <li>Records indicate that 870 boys in the United States have been named Allyn since 1880.<p> <li>The greatest number of people were given this name in 1947, when 71 people in the U.S. were given the name Allyn. Those people are now 73 years old.<p> <p>So ... how do we know this stuff? Baby Names Hub identifies trends by analyzing vast amounts of data made available by the U.S. government and other public sources. This data, including social security statistics, provides detailed information on baby name popularity and trends in the United States.<p>"
107,"2021-11-29 03:36:40",image/jpeg,2cc4c22951b6ad57021e03408a51f9d5cfe79b0b,16101,/2c/c4/c2/29/2cc4c22951b6ad57021e03408a51f9d5cfe79b0b.jpg,,https://songer.datasn.com/data/api/v1/u_e49e7f0fcb85c5451b03/baby_name/by_table/image_access/2c/c4/c2/29/2cc4c22951b6ad57021e03408a51f9d5cfe79b0b.jpg,118,"2021-11-28 09:38:26",Alma,1918,52,A,boy,67%,2,,1,"<li> ""My name is Alma and I am male. I'm named after prophets that lived on this continent long ago. So, it is a religious name that I hold dear to me. I do get strange looks when people are not familiar with its background. But that has become normal for me.""  <strong>Feb. 28, 2017:</strong>  <li> ""My son is named Alma, he is named after his Great Grandfather who was also named Alma. I think that it is a great Pioneer name. It stands for strength. It is also the name of Ancient Prophets that lived on the American continent. We like it, except for the few times people think that it is a female name.""  <strong>Jul. 20, 2005:</strong>  ",,"<li> ""This is such an old lady name and I mean old lady name! Why on EARTH did some parents from a century ago use this name for their sons instead of their daughters? The majority of Almas in America - and in England too - are female but in granny age.""  <strong>Apr. 27, 2008:</strong>   ","<p> <li>Records indicate that 610 boys in the United States have been named Alma since 1880.<p> <li>The greatest number of people were given this name in 1918, when 52 people in the U.S. were given the name Alma. Those people are now 102 years old.<p> <p>So ... how do we know this stuff? Baby Names Hub identifies trends by analyzing vast amounts of data made available by the U.S. government and other public sources. This data, including social security statistics, provides detailed information on baby name popularity and trends in the United States.<p>"
108,"2021-11-29 03:36:51",image/jpeg,af017e583d6af44ad3caafab5f4b87e391be6615,15454,/af/01/7e/58/af017e583d6af44ad3caafab5f4b87e391be6615.jpg,,https://songer.datasn.com/data/api/v1/u_e49e7f0fcb85c5451b03/baby_name/by_table/image_access/af/01/7e/58/af017e583d6af44ad3caafab5f4b87e391be6615.jpg,119,"2021-11-28 09:38:37",Almer,1906,11,A,boy,?,,,,,,,"<p> <li>Records indicate that 64 boys in the United States have been named Almer since 1880.<p> <li>The greatest number of people were given this name in 1906, when 11 people in the U.S. were given the name Almer. Those people are now 114 years old.<p> <p>So ... how do we know this stuff? Baby Names Hub identifies trends by analyzing vast amounts of data made available by the U.S. government and other public sources. This data, including social security statistics, provides detailed information on baby name popularity and trends in the United States.<p>"
109,"2021-11-29 03:37:00",image/jpeg,80d09fc4fe99d893133d402a72ae8379d21386f9,15148,/80/d0/9f/c4/80d09fc4fe99d893133d402a72ae8379d21386f9.jpg,,https://songer.datasn.com/data/api/v1/u_e49e7f0fcb85c5451b03/baby_name/by_table/image_access/80/d0/9f/c4/80d09fc4fe99d893133d402a72ae8379d21386f9.jpg,120,"2021-11-28 09:38:39",Almon,1918,59,A,boy,?,,,,,,,"<p> <li>Records indicate that 387 boys in the United States have been named Almon since 1880.<p> <li>The greatest number of people were given this name in 1918, when 59 people in the U.S. were given the name Almon. Those people are now 102 years old.<p> <p>So ... how do we know this stuff? Baby Names Hub identifies trends by analyzing vast amounts of data made available by the U.S. government and other public sources. This data, including social security statistics, provides detailed information on baby name popularity and trends in the United States.<p>"
110,"2021-11-29 03:37:10",image/jpeg,7f9286ef0e6fc7ecf609bff3f6016fb404d7576a,14997,/7f/92/86/ef/7f9286ef0e6fc7ecf609bff3f6016fb404d7576a.jpg,,https://songer.datasn.com/data/api/v1/u_e49e7f0fcb85c5451b03/baby_name/by_table/image_access/7f/92/86/ef/7f9286ef0e6fc7ecf609bff3f6016fb404d7576a.jpg,121,"2021-11-28 09:38:51",Almond,1885,6,A,boy,?,,,,,,,"<p> <li>Records indicate that 16 boys in the United States have been named Almond since 1880.<p> <li>The greatest number of people were given this name in 1885, when 6 people in the U.S. were given the name Almond. Those people are now 135 years old.<p> <p>So ... how do we know this stuff? Baby Names Hub identifies trends by analyzing vast amounts of data made available by the U.S. government and other public sources. This data, including social security statistics, provides detailed information on baby name popularity and trends in the United States.<p>"
111,"2021-11-29 03:37:12",image/jpeg,6cbd40765a6d774178416df48345c2bf69c845ca,14316,/6c/bd/40/76/6cbd40765a6d774178416df48345c2bf69c845ca.jpg,,https://songer.datasn.com/data/api/v1/u_e49e7f0fcb85c5451b03/baby_name/by_table/image_access/6c/bd/40/76/6cbd40765a6d774178416df48345c2bf69c845ca.jpg,122,"2021-11-28 09:38:58",Almus,1890,5,A,boy,?,,,,,,,"<p> <li>Records indicate that 5 boys in the United States have been named Almus since 1880.<p> <li>The greatest number of people were given this name in 1890, when 5 people in the U.S. were given the name Almus. Those people are now 130 years old.<p> <p>So ... how do we know this stuff? Baby Names Hub identifies trends by analyzing vast amounts of data made available by the U.S. government and other public sources. This data, including social security statistics, provides detailed information on baby name popularity and trends in the United States.<p>"
112,"2021-11-29 03:37:21",image/jpeg,c387f4df4a616913749fe7356254eb74666f80d1,20391,/c3/87/f4/df/c387f4df4a616913749fe7356254eb74666f80d1.jpg,,https://songer.datasn.com/data/api/v1/u_e49e7f0fcb85c5451b03/baby_name/by_table/image_access/c3/87/f4/df/c387f4df4a616913749fe7356254eb74666f80d1.jpg,123,"2021-11-28 09:39:09",Alois,1918,106,A,boy,?,,,,,,,"<p> <li>Records indicate that 1,770 boys in the United States have been named Alois since 1880.<p> <li>The greatest number of people were given this name in 1918, when 106 people in the U.S. were given the name Alois. Those people are now 102 years old.<p> <p>So ... how do we know this stuff? Baby Names Hub identifies trends by analyzing vast amounts of data made available by the U.S. government and other public sources. This data, including social security statistics, provides detailed information on baby name popularity and trends in the United States.<p>"
113,"2021-11-29 03:37:26",image/jpeg,9d36869d3ef78679dc377ad18bfa48c2a784e932,18246,/9d/36/86/9d/9d36869d3ef78679dc377ad18bfa48c2a784e932.jpg,,https://songer.datasn.com/data/api/v1/u_e49e7f0fcb85c5451b03/baby_name/by_table/image_access/9d/36/86/9d/9d36869d3ef78679dc377ad18bfa48c2a784e932.jpg,124,"2021-11-28 09:39:16",Alonso,2010,376,A,boy,?,,,,,,,"<p> <li>Records indicate that 6,642 boys in the United States have been named Alonso since 1880.<p> <li>The greatest number of people were given this name in 2010, when 376 people in the U.S. were given the name Alonso. Those people are now 10 years old.<p> <p>So ... how do we know this stuff? Baby Names Hub identifies trends by analyzing vast amounts of data made available by the U.S. government and other public sources. This data, including social security statistics, provides detailed information on baby name popularity and trends in the United States.<p>"
114,"2021-11-29 03:37:30",image/jpeg,550dce944d70673e2a05e0cd1eb65c16bb577aca,17005,/55/0d/ce/94/550dce944d70673e2a05e0cd1eb65c16bb577aca.jpg,,https://songer.datasn.com/data/api/v1/u_e49e7f0fcb85c5451b03/baby_name/by_table/image_access/55/0d/ce/94/550dce944d70673e2a05e0cd1eb65c16bb577aca.jpg,125,"2021-11-28 09:39:23",Alonza,1951,59,A,boy,?,,,,,,,"<p> <li>Records indicate that 606 boys in the United States have been named Alonza since 1880.<p> <li>The greatest number of people were given this name in 1951, when 59 people in the U.S. were given the name Alonza. Those people are now 69 years old.<p> <p>So ... how do we know this stuff? Baby Names Hub identifies trends by analyzing vast amounts of data made available by the U.S. government and other public sources. This data, including social security statistics, provides detailed information on baby name popularity and trends in the United States.<p>"
115,"2021-11-29 03:37:31",image/jpeg,3a0dc05f1ba808837bd3ea46cd4fe841eec2ee66,29153,/3a/0d/c0/5f/3a0dc05f1ba808837bd3ea46cd4fe841eec2ee66.jpg,,https://songer.datasn.com/data/api/v1/u_e49e7f0fcb85c5451b03/baby_name/by_table/image_access/3a/0d/c0/5f/3a0dc05f1ba808837bd3ea46cd4fe841eec2ee66.jpg,126,"2021-11-28 09:39:25",Alonzo,1962,539,A,boy,100%,1,1,,"<li> ""I thought it was a rare name,but the records show that since 1880 at least 36,163 boys were named Alonzo...Wow, I love my name.""  <strong>Jun. 15, 2009:</strong>  ","<li> ""My bf is named Alonzo. I think its an awsome name. Not too long not, too short.""  <strong>May. 22, 2007:</strong>   ",,"<p> <li>Records indicate that 38,383 boys in the United States have been named Alonzo since 1880.<p> <li>The greatest number of people were given this name in 1962, when 539 people in the U.S. were given the name Alonzo. Those people are now 58 years old.<p> <p>So ... how do we know this stuff? Baby Names Hub identifies trends by analyzing vast amounts of data made available by the U.S. government and other public sources. This data, including social security statistics, provides detailed information on baby name popularity and trends in the United States.<p>"
116,"2021-11-29 03:37:34",image/jpeg,272ab29fe41c2e1ac8abe8b46ce07a507df32d1d,14774,/27/2a/b2/9f/272ab29fe41c2e1ac8abe8b46ce07a507df32d1d.jpg,,https://songer.datasn.com/data/api/v1/u_e49e7f0fcb85c5451b03/baby_name/by_table/image_access/27/2a/b2/9f/272ab29fe41c2e1ac8abe8b46ce07a507df32d1d.jpg,127,"2021-11-28 09:39:26",Aloys,1896,7,A,boy,?,,,,,,,"<p> <li>Records indicate that 7 boys in the United States have been named Aloys since 1880.<p> <li>The greatest number of people were given this name in 1896, when 7 people in the U.S. were given the name Aloys. Those people are now 124 years old.<p> <p>So ... how do we know this stuff? Baby Names Hub identifies trends by analyzing vast amounts of data made available by the U.S. government and other public sources. This data, including social security statistics, provides detailed information on baby name popularity and trends in the United States.<p>"
117,"2021-11-29 03:37:56",image/jpeg,0e9f53fa472defff35490f7bda948ff72ecbe81b,17580,/0e/9f/53/fa/0e9f53fa472defff35490f7bda948ff72ecbe81b.jpg,,https://songer.datasn.com/data/api/v1/u_e49e7f0fcb85c5451b03/baby_name/by_table/image_access/0e/9f/53/fa/0e9f53fa472defff35490f7bda948ff72ecbe81b.jpg,128,"2021-11-28 09:39:30",Aloysius,1921,199,A,boy,100%,2,4,,"<li> ""How come your chart says that there hasn't been a child named Aloysius since around 1940, when I was born in 1954 and this is my name?""  <strong>May. 15, 2010:</strong>  <li> ""It used to be a common name in my family, I notice it's popularity drops off completely at 1940- I'm guessing this has to do with the war and it's german roots.""  <strong>Feb. 12, 2009:</strong>  ","<li> ""I also was born in 1955 and have this name and i am the the third. My dad and grandpa were also Aloysius. I have met two people in my life with it as a middle name. I am trying to find out how many men in America currently have this first name""  <strong>Mar. 5, 2021:</strong>  <li> ""Born in 1955. People always mispronounce it. No one can spell it. Met one person in my life who had it as middle name. I like it.""  <strong>Nov. 7, 2019:</strong>  <li> ""whenever people hear that my son's name is Aloysius they think its greek. which i thought as well but i like the name...sounds mysterious""  <strong>Dec. 25, 2008:</strong>  <li> ""Best suited to a parrot these days but it was fairly popular a century ago.""  <strong>Jan. 16, 2008:</strong>   ",,"<p> <li>Records indicate that 4,156 boys in the United States have been named Aloysius since 1880.<p> <li>The greatest number of people were given this name in 1921, when 199 people in the U.S. were given the name Aloysius. Those people are now 100 years old.<p> <p>So ... how do we know this stuff? Baby Names Hub identifies trends by analyzing vast amounts of data made available by the U.S. government and other public sources. This data, including social security statistics, provides detailed information on baby name popularity and trends in the United States.<p>"