image_slug.id,image_slug.ts,image_slug.title,service.id,service.ts,service.description,service.service,service.address,service.lowest_price,service.per_capita_consumption,service.score_overall,service.comment_count,service.latitude,service.longitude,service.area,service.street,service.create_time,service.pay_way,service.open_time,service.telephone,service.feature,service.star,service.count
37,"2019-01-17 05:48:38",艾蜜儿婚纱摄影的图片,3,"2019-01-18 02:50:59",艾蜜儿婚纱摄影是一家位于鞍山的婚纱摄影商户，商户为四星商户，共有0个产品可供用户挑选；截至当日，此商户共有0条用户点评。商户电话：15566275793,艾蜜儿婚纱摄影,铁东区四隆大厦14层108号（景子街附近）,188,0,5,28,41.111562,122.99438,铁东区,站前,,,"周一至周日 08:00-22:00",15566275793,,,
38,"2019-01-17 05:48:48",印象婚纱摄影的图片,4,"2019-01-18 02:51:27","印像摄影 签约省内三大摄影基地 只有您想不到 没有我们做不到 我们提倡自然，真实，简单随意，美丽不是浓妆艳抹.印像摄影一个注重口碑传承的摄影品牌,客户的满意是我们唯一的标准!",印象婚纱摄影,铁东区景子街2楼东座51号（贾氏珠宝）,199,0,4.9,254,41.113146,122.99264,铁东区,站前,2008年,不可刷卡,"周一至周日 09:00-18:00","13204120177 15509802827",底片全送，一对一服务，无隐形消费,,
39,"2019-01-17 05:48:48",印象婚纱摄影的图片,4,"2019-01-18 02:51:27","印像摄影 签约省内三大摄影基地 只有您想不到 没有我们做不到 我们提倡自然，真实，简单随意，美丽不是浓妆艳抹.印像摄影一个注重口碑传承的摄影品牌,客户的满意是我们唯一的标准!",印象婚纱摄影,铁东区景子街2楼东座51号（贾氏珠宝）,199,0,4.9,254,41.113146,122.99264,铁东区,站前,2008年,不可刷卡,"周一至周日 09:00-18:00","13204120177 15509802827",底片全送，一对一服务，无隐形消费,,
40,"2019-01-17 05:48:48",印象婚纱摄影的图片,4,"2019-01-18 02:51:27","印像摄影 签约省内三大摄影基地 只有您想不到 没有我们做不到 我们提倡自然，真实，简单随意，美丽不是浓妆艳抹.印像摄影一个注重口碑传承的摄影品牌,客户的满意是我们唯一的标准!",印象婚纱摄影,铁东区景子街2楼东座51号（贾氏珠宝）,199,0,4.9,254,41.113146,122.99264,铁东区,站前,2008年,不可刷卡,"周一至周日 09:00-18:00","13204120177 15509802827",底片全送，一对一服务，无隐形消费,,
41,"2019-01-17 05:48:48",印象婚纱摄影的图片,4,"2019-01-18 02:51:27","印像摄影 签约省内三大摄影基地 只有您想不到 没有我们做不到 我们提倡自然，真实，简单随意，美丽不是浓妆艳抹.印像摄影一个注重口碑传承的摄影品牌,客户的满意是我们唯一的标准!",印象婚纱摄影,铁东区景子街2楼东座51号（贾氏珠宝）,199,0,4.9,254,41.113146,122.99264,铁东区,站前,2008年,不可刷卡,"周一至周日 09:00-18:00","13204120177 15509802827",底片全送，一对一服务，无隐形消费,,
42,"2019-01-17 05:48:48",印象婚纱摄影的图片,4,"2019-01-18 02:51:27","印像摄影 签约省内三大摄影基地 只有您想不到 没有我们做不到 我们提倡自然，真实，简单随意，美丽不是浓妆艳抹.印像摄影一个注重口碑传承的摄影品牌,客户的满意是我们唯一的标准!",印象婚纱摄影,铁东区景子街2楼东座51号（贾氏珠宝）,199,0,4.9,254,41.113146,122.99264,铁东区,站前,2008年,不可刷卡,"周一至周日 09:00-18:00","13204120177 15509802827",底片全送，一对一服务，无隐形消费,,
43,"2019-01-17 05:49:00",金夫人婚纱摄影的图片,5,"2019-01-18 02:51:47",金夫人集团成立于1989年，是一家跨越14个产业的大型集团公司，是首家外商独资企业，是中国领先的婚纱摄影服务集团。,金夫人婚纱摄影,铁东区东三街54号（近四隆广场）,2018,3739,3,0,41.114255,122.997982,铁东区,站前,1989年,可刷卡,"周一至周日 09:00-18:00",4001761472,不满意重拍，底片全送，无隐形消费,,
44,"2019-01-17 05:49:00",金夫人婚纱摄影的图片,5,"2019-01-18 02:51:47",金夫人集团成立于1989年，是一家跨越14个产业的大型集团公司，是首家外商独资企业，是中国领先的婚纱摄影服务集团。,金夫人婚纱摄影,铁东区东三街54号（近四隆广场）,2018,3739,3,0,41.114255,122.997982,铁东区,站前,1989年,可刷卡,"周一至周日 09:00-18:00",4001761472,不满意重拍，底片全送，无隐形消费,,
45,"2019-01-17 05:49:00",金夫人婚纱摄影的图片,5,"2019-01-18 02:51:47",金夫人集团成立于1989年，是一家跨越14个产业的大型集团公司，是首家外商独资企业，是中国领先的婚纱摄影服务集团。,金夫人婚纱摄影,铁东区东三街54号（近四隆广场）,2018,3739,3,0,41.114255,122.997982,铁东区,站前,1989年,可刷卡,"周一至周日 09:00-18:00",4001761472,不满意重拍，底片全送，无隐形消费,,
46,"2019-01-17 05:49:00",金夫人婚纱摄影的图片,5,"2019-01-18 02:51:47",金夫人集团成立于1989年，是一家跨越14个产业的大型集团公司，是首家外商独资企业，是中国领先的婚纱摄影服务集团。,金夫人婚纱摄影,铁东区东三街54号（近四隆广场）,2018,3739,3,0,41.114255,122.997982,铁东区,站前,1989年,可刷卡,"周一至周日 09:00-18:00",4001761472,不满意重拍，底片全送，无隐形消费,,
47,"2019-01-17 05:49:00",金夫人婚纱摄影的图片,5,"2019-01-18 02:51:47",金夫人集团成立于1989年，是一家跨越14个产业的大型集团公司，是首家外商独资企业，是中国领先的婚纱摄影服务集团。,金夫人婚纱摄影,铁东区东三街54号（近四隆广场）,2018,3739,3,0,41.114255,122.997982,铁东区,站前,1989年,可刷卡,"周一至周日 09:00-18:00",4001761472,不满意重拍，底片全送，无隐形消费,,
48,"2019-01-17 05:49:11",维纳斯婚纱摄影的图片,7,"2019-01-18 02:51:51",鞍山维纳斯婚纱摄影被中国人像摄影协会授予《五星级婚纱影楼》称号，0412-7223411。鞍山婚纱摄影首选。2万平米外景庄园和恒温实景影视拍摄基地，全部为实景搭建一年四季如春一站式婚纱摄影领导品牌。,维纳斯婚纱摄影,铁东区东山街33-12号（四隆东侧）,1,4165,4,0,41.114341,122.996665,铁东区,站前,1988年,可刷卡,,"18310916955 7223411",不满意重拍，底片全送，无隐形消费,,
49,"2019-01-17 05:49:11",维纳斯婚纱摄影的图片,7,"2019-01-18 02:51:51",鞍山维纳斯婚纱摄影被中国人像摄影协会授予《五星级婚纱影楼》称号，0412-7223411。鞍山婚纱摄影首选。2万平米外景庄园和恒温实景影视拍摄基地，全部为实景搭建一年四季如春一站式婚纱摄影领导品牌。,维纳斯婚纱摄影,铁东区东山街33-12号（四隆东侧）,1,4165,4,0,41.114341,122.996665,铁东区,站前,1988年,可刷卡,,"18310916955 7223411",不满意重拍，底片全送，无隐形消费,,
50,"2019-01-17 05:49:11",维纳斯婚纱摄影的图片,7,"2019-01-18 02:51:51",鞍山维纳斯婚纱摄影被中国人像摄影协会授予《五星级婚纱影楼》称号，0412-7223411。鞍山婚纱摄影首选。2万平米外景庄园和恒温实景影视拍摄基地，全部为实景搭建一年四季如春一站式婚纱摄影领导品牌。,维纳斯婚纱摄影,铁东区东山街33-12号（四隆东侧）,1,4165,4,0,41.114341,122.996665,铁东区,站前,1988年,可刷卡,,"18310916955 7223411",不满意重拍，底片全送，无隐形消费,,
51,"2019-01-17 05:49:11",维纳斯婚纱摄影的图片,7,"2019-01-18 02:51:51",鞍山维纳斯婚纱摄影被中国人像摄影协会授予《五星级婚纱影楼》称号，0412-7223411。鞍山婚纱摄影首选。2万平米外景庄园和恒温实景影视拍摄基地，全部为实景搭建一年四季如春一站式婚纱摄影领导品牌。,维纳斯婚纱摄影,铁东区东山街33-12号（四隆东侧）,1,4165,4,0,41.114341,122.996665,铁东区,站前,1988年,可刷卡,,"18310916955 7223411",不满意重拍，底片全送，无隐形消费,,
52,"2019-01-17 05:49:11",维纳斯婚纱摄影的图片,7,"2019-01-18 02:51:51",鞍山维纳斯婚纱摄影被中国人像摄影协会授予《五星级婚纱影楼》称号，0412-7223411。鞍山婚纱摄影首选。2万平米外景庄园和恒温实景影视拍摄基地，全部为实景搭建一年四季如春一站式婚纱摄影领导品牌。,维纳斯婚纱摄影,铁东区东山街33-12号（四隆东侧）,1,4165,4,0,41.114341,122.996665,铁东区,站前,1988年,可刷卡,,"18310916955 7223411",不满意重拍，底片全送，无隐形消费,,
53,"2019-01-17 05:50:47",唯你一生钻石珠宝定制的图片,22,"2019-01-18 02:56:37",由珠宝鉴定师和远在美国的珠宝设计师共同创立的珠宝定制品牌，花了三年的时间打通国外裸石渠道，合作国内优秀的手工匠人，为大家呈现出优秀的珠宝作品。,唯你一生钻石珠宝定制,朝阳区东三环南路雅园国际A座63B,1,25708,5,0,39.864967,116.455802,平谷区,十里河,2017年,可刷卡,"周一至周日 10:00-17:30",18800069677,,,
54,"2019-01-17 05:50:47",唯你一生钻石珠宝定制的图片,22,"2019-01-18 02:56:37",由珠宝鉴定师和远在美国的珠宝设计师共同创立的珠宝定制品牌，花了三年的时间打通国外裸石渠道，合作国内优秀的手工匠人，为大家呈现出优秀的珠宝作品。,唯你一生钻石珠宝定制,朝阳区东三环南路雅园国际A座63B,1,25708,5,0,39.864967,116.455802,平谷区,十里河,2017年,可刷卡,"周一至周日 10:00-17:30",18800069677,,,
55,"2019-01-17 05:50:47",唯你一生钻石珠宝定制的图片,22,"2019-01-18 02:56:37",由珠宝鉴定师和远在美国的珠宝设计师共同创立的珠宝定制品牌，花了三年的时间打通国外裸石渠道，合作国内优秀的手工匠人，为大家呈现出优秀的珠宝作品。,唯你一生钻石珠宝定制,朝阳区东三环南路雅园国际A座63B,1,25708,5,0,39.864967,116.455802,平谷区,十里河,2017年,可刷卡,"周一至周日 10:00-17:30",18800069677,,,
56,"2019-01-17 05:50:47",唯你一生钻石珠宝定制的图片,22,"2019-01-18 02:56:37",由珠宝鉴定师和远在美国的珠宝设计师共同创立的珠宝定制品牌，花了三年的时间打通国外裸石渠道，合作国内优秀的手工匠人，为大家呈现出优秀的珠宝作品。,唯你一生钻石珠宝定制,朝阳区东三环南路雅园国际A座63B,1,25708,5,0,39.864967,116.455802,平谷区,十里河,2017年,可刷卡,"周一至周日 10:00-17:30",18800069677,,,
57,"2019-01-17 05:50:53",极光钻石婚戒定制中心的图片,23,"2019-01-18 02:56:42","北京经营数年钻石批发零售 现主营GIA裸钻现货批发零售 国检成品 自设工厂设计定制",极光钻石婚戒定制中心,大兴区兴华大街兴雅珠宝城1层A056金致美珠宝,10,0,4,0,39.731326,116.332065,平谷区,十里河,2010年,可刷卡,"周一至周日 09:30-18:30",4000908610-232310,,,
58,"2019-01-17 05:50:53",极光钻石婚戒定制中心的图片,23,"2019-01-18 02:56:42","北京经营数年钻石批发零售 现主营GIA裸钻现货批发零售 国检成品 自设工厂设计定制",极光钻石婚戒定制中心,大兴区兴华大街兴雅珠宝城1层A056金致美珠宝,10,0,4,0,39.731326,116.332065,平谷区,十里河,2010年,可刷卡,"周一至周日 09:30-18:30",4000908610-232310,,,
59,"2019-01-17 05:50:53",极光钻石婚戒定制中心的图片,23,"2019-01-18 02:56:42","北京经营数年钻石批发零售 现主营GIA裸钻现货批发零售 国检成品 自设工厂设计定制",极光钻石婚戒定制中心,大兴区兴华大街兴雅珠宝城1层A056金致美珠宝,10,0,4,0,39.731326,116.332065,平谷区,十里河,2010年,可刷卡,"周一至周日 09:30-18:30",4000908610-232310,,,
60,"2019-01-17 05:50:53",极光钻石婚戒定制中心的图片,23,"2019-01-18 02:56:42","北京经营数年钻石批发零售 现主营GIA裸钻现货批发零售 国检成品 自设工厂设计定制",极光钻石婚戒定制中心,大兴区兴华大街兴雅珠宝城1层A056金致美珠宝,10,0,4,0,39.731326,116.332065,平谷区,十里河,2010年,可刷卡,"周一至周日 09:30-18:30",4000908610-232310,,,
61,"2019-01-17 05:50:53",极光钻石婚戒定制中心的图片,23,"2019-01-18 02:56:42","北京经营数年钻石批发零售 现主营GIA裸钻现货批发零售 国检成品 自设工厂设计定制",极光钻石婚戒定制中心,大兴区兴华大街兴雅珠宝城1层A056金致美珠宝,10,0,4,0,39.731326,116.332065,平谷区,十里河,2010年,可刷卡,"周一至周日 09:30-18:30",4000908610-232310,,,
62,"2019-01-17 05:51:01","UP LOVE品钻的图片",24,"2019-01-18 02:56:52","UP LOVE品钻是一家位于北京的裸钻定制商户，商户为五星商户，共有16个产品可供用户挑选；截至当日，此商户共有0条用户点评。商户电话：4000908610-235921","UP LOVE品钻",东城区东二环银河SOHO商铺B座20220,399,24526,5,0,39.920938,116.432341,平谷区,十里河,,,"周一至周日 10:00-21:00",4000908610-235921,,,
63,"2019-01-17 05:51:01","UP LOVE品钻的图片",24,"2019-01-18 02:56:52","UP LOVE品钻是一家位于北京的裸钻定制商户，商户为五星商户，共有16个产品可供用户挑选；截至当日，此商户共有0条用户点评。商户电话：4000908610-235921","UP LOVE品钻",东城区东二环银河SOHO商铺B座20220,399,24526,5,0,39.920938,116.432341,平谷区,十里河,,,"周一至周日 10:00-21:00",4000908610-235921,,,
64,"2019-01-17 05:51:01","UP LOVE品钻的图片",24,"2019-01-18 02:56:52","UP LOVE品钻是一家位于北京的裸钻定制商户，商户为五星商户，共有16个产品可供用户挑选；截至当日，此商户共有0条用户点评。商户电话：4000908610-235921","UP LOVE品钻",东城区东二环银河SOHO商铺B座20220,399,24526,5,0,39.920938,116.432341,平谷区,十里河,,,"周一至周日 10:00-21:00",4000908610-235921,,,
65,"2019-01-17 05:51:01","UP LOVE品钻的图片",24,"2019-01-18 02:56:52","UP LOVE品钻是一家位于北京的裸钻定制商户，商户为五星商户，共有16个产品可供用户挑选；截至当日，此商户共有0条用户点评。商户电话：4000908610-235921","UP LOVE品钻",东城区东二环银河SOHO商铺B座20220,399,24526,5,0,39.920938,116.432341,平谷区,十里河,,,"周一至周日 10:00-21:00",4000908610-235921,,,
66,"2019-01-17 05:51:01","UP LOVE品钻的图片",24,"2019-01-18 02:56:52","UP LOVE品钻是一家位于北京的裸钻定制商户，商户为五星商户，共有16个产品可供用户挑选；截至当日，此商户共有0条用户点评。商户电话：4000908610-235921","UP LOVE品钻",东城区东二环银河SOHO商铺B座20220,399,24526,5,0,39.920938,116.432341,平谷区,十里河,,,"周一至周日 10:00-21:00",4000908610-235921,,,
67,"2019-01-17 05:51:19",大爱金工&戒指DIY的图片,25,"2019-01-18 02:57:06","大爱金工是大爱盛世贸易（北京）有限公司直属品牌。 司2009年成立，是国内金工体验领跑品牌，品牌店遍布上海、北京、深圳、青岛、成都等15个城市共设有36家分店。",大爱金工&戒指DIY（五道口店）,海淀区成府路28号五道口购物中心一层优衣库门口,59,0,4.5,0,39.991939,116.33935,平谷区,十里河,2009年,可刷卡,"周一至周日 08:00-19:00","17710781376 13522799717",,,
68,"2019-01-17 05:51:19",大爱金工&戒指DIY的图片,25,"2019-01-18 02:57:06","大爱金工是大爱盛世贸易（北京）有限公司直属品牌。 司2009年成立，是国内金工体验领跑品牌，品牌店遍布上海、北京、深圳、青岛、成都等15个城市共设有36家分店。",大爱金工&戒指DIY（五道口店）,海淀区成府路28号五道口购物中心一层优衣库门口,59,0,4.5,0,39.991939,116.33935,平谷区,十里河,2009年,可刷卡,"周一至周日 08:00-19:00","17710781376 13522799717",,,
69,"2019-01-17 05:51:19",大爱金工&戒指DIY的图片,25,"2019-01-18 02:57:06","大爱金工是大爱盛世贸易（北京）有限公司直属品牌。 司2009年成立，是国内金工体验领跑品牌，品牌店遍布上海、北京、深圳、青岛、成都等15个城市共设有36家分店。",大爱金工&戒指DIY（五道口店）,海淀区成府路28号五道口购物中心一层优衣库门口,59,0,4.5,0,39.991939,116.33935,平谷区,十里河,2009年,可刷卡,"周一至周日 08:00-19:00","17710781376 13522799717",,,
70,"2019-01-17 05:51:19",大爱金工&戒指DIY的图片,25,"2019-01-18 02:57:06","大爱金工是大爱盛世贸易（北京）有限公司直属品牌。 司2009年成立，是国内金工体验领跑品牌，品牌店遍布上海、北京、深圳、青岛、成都等15个城市共设有36家分店。",大爱金工&戒指DIY（五道口店）,海淀区成府路28号五道口购物中心一层优衣库门口,59,0,4.5,0,39.991939,116.33935,平谷区,十里河,2009年,可刷卡,"周一至周日 08:00-19:00","17710781376 13522799717",,,
71,"2019-01-17 05:51:19",大爱金工&戒指DIY的图片,25,"2019-01-18 02:57:06","大爱金工是大爱盛世贸易（北京）有限公司直属品牌。 司2009年成立，是国内金工体验领跑品牌，品牌店遍布上海、北京、深圳、青岛、成都等15个城市共设有36家分店。",大爱金工&戒指DIY（五道口店）,海淀区成府路28号五道口购物中心一层优衣库门口,59,0,4.5,0,39.991939,116.33935,平谷区,十里河,2009年,可刷卡,"周一至周日 08:00-19:00","17710781376 13522799717",,,
72,"2019-01-17 05:51:24",珂兰钻石的图片,26,"2019-01-18 02:57:17",珂兰钻石是国内首批从事电子商务钻石销售的专业珠宝品牌，珂兰钻石从南非采购一手钻石，并通过office直营与网络销售相结合的全新销售模式，省去了高额的入场费和钻石零售环节。蝉联三年双十一钻石类销冠！,珂兰钻石（珠宝高级定制店）,西城区西单北大街131号西单大悦城写字楼8楼（西单商场对面）,1,21266,4.3,2119,39.911383,116.372541,平谷区,十里河,2007年,可刷卡,"周一至周日 10:00-19:30",4000268920-9447,,,
73,"2019-01-17 05:51:24",珂兰钻石的图片,26,"2019-01-18 02:57:17",珂兰钻石是国内首批从事电子商务钻石销售的专业珠宝品牌，珂兰钻石从南非采购一手钻石，并通过office直营与网络销售相结合的全新销售模式，省去了高额的入场费和钻石零售环节。蝉联三年双十一钻石类销冠！,珂兰钻石（珠宝高级定制店）,西城区西单北大街131号西单大悦城写字楼8楼（西单商场对面）,1,21266,4.3,2119,39.911383,116.372541,平谷区,十里河,2007年,可刷卡,"周一至周日 10:00-19:30",4000268920-9447,,,
74,"2019-01-17 05:51:24",珂兰钻石的图片,26,"2019-01-18 02:57:17",珂兰钻石是国内首批从事电子商务钻石销售的专业珠宝品牌，珂兰钻石从南非采购一手钻石，并通过office直营与网络销售相结合的全新销售模式，省去了高额的入场费和钻石零售环节。蝉联三年双十一钻石类销冠！,珂兰钻石（珠宝高级定制店）,西城区西单北大街131号西单大悦城写字楼8楼（西单商场对面）,1,21266,4.3,2119,39.911383,116.372541,平谷区,十里河,2007年,可刷卡,"周一至周日 10:00-19:30",4000268920-9447,,,
75,"2019-01-17 05:51:24",珂兰钻石的图片,26,"2019-01-18 02:57:17",珂兰钻石是国内首批从事电子商务钻石销售的专业珠宝品牌，珂兰钻石从南非采购一手钻石，并通过office直营与网络销售相结合的全新销售模式，省去了高额的入场费和钻石零售环节。蝉联三年双十一钻石类销冠！,珂兰钻石（珠宝高级定制店）,西城区西单北大街131号西单大悦城写字楼8楼（西单商场对面）,1,21266,4.3,2119,39.911383,116.372541,平谷区,十里河,2007年,可刷卡,"周一至周日 10:00-19:30",4000268920-9447,,,
76,"2019-01-17 05:51:24",珂兰钻石的图片,26,"2019-01-18 02:57:17",珂兰钻石是国内首批从事电子商务钻石销售的专业珠宝品牌，珂兰钻石从南非采购一手钻石，并通过office直营与网络销售相结合的全新销售模式，省去了高额的入场费和钻石零售环节。蝉联三年双十一钻石类销冠！,珂兰钻石（珠宝高级定制店）,西城区西单北大街131号西单大悦城写字楼8楼（西单商场对面）,1,21266,4.3,2119,39.911383,116.372541,平谷区,十里河,2007年,可刷卡,"周一至周日 10:00-19:30",4000268920-9447,,,
77,"2019-01-17 05:51:36",群豪珠宝首饰加工的图片,27,"2019-01-18 02:57:26",群豪珠宝首饰加工是一家位于北京的裸钻定制商户，商户为四星商户，共有1个产品可供用户挑选；截至当日，此商户共有0条用户点评。商户电话：13691220133,群豪珠宝首饰加工,西城区西单北大街西单婚庆大楼四层4030（客梯直梯旁边）（近老佛爷百货西单商场灵境胡同地铁）,59,0,4,0,39.91412,116.373364,平谷区,十里河,,,"周一至周日 10:00-19:00","13691220133 13693121677",,,
78,"2019-01-17 05:51:36",群豪珠宝首饰加工的图片,27,"2019-01-18 02:57:26",群豪珠宝首饰加工是一家位于北京的裸钻定制商户，商户为四星商户，共有1个产品可供用户挑选；截至当日，此商户共有0条用户点评。商户电话：13691220133,群豪珠宝首饰加工,西城区西单北大街西单婚庆大楼四层4030（客梯直梯旁边）（近老佛爷百货西单商场灵境胡同地铁）,59,0,4,0,39.91412,116.373364,平谷区,十里河,,,"周一至周日 10:00-19:00","13691220133 13693121677",,,
79,"2019-01-17 05:51:36",群豪珠宝首饰加工的图片,27,"2019-01-18 02:57:26",群豪珠宝首饰加工是一家位于北京的裸钻定制商户，商户为四星商户，共有1个产品可供用户挑选；截至当日，此商户共有0条用户点评。商户电话：13691220133,群豪珠宝首饰加工,西城区西单北大街西单婚庆大楼四层4030（客梯直梯旁边）（近老佛爷百货西单商场灵境胡同地铁）,59,0,4,0,39.91412,116.373364,平谷区,十里河,,,"周一至周日 10:00-19:00","13691220133 13693121677",,,
80,"2019-01-17 05:51:36",群豪珠宝首饰加工的图片,27,"2019-01-18 02:57:26",群豪珠宝首饰加工是一家位于北京的裸钻定制商户，商户为四星商户，共有1个产品可供用户挑选；截至当日，此商户共有0条用户点评。商户电话：13691220133,群豪珠宝首饰加工,西城区西单北大街西单婚庆大楼四层4030（客梯直梯旁边）（近老佛爷百货西单商场灵境胡同地铁）,59,0,4,0,39.91412,116.373364,平谷区,十里河,,,"周一至周日 10:00-19:00","13691220133 13693121677",,,
81,"2019-01-17 05:51:36",群豪珠宝首饰加工的图片,27,"2019-01-18 02:57:26",群豪珠宝首饰加工是一家位于北京的裸钻定制商户，商户为四星商户，共有1个产品可供用户挑选；截至当日，此商户共有0条用户点评。商户电话：13691220133,群豪珠宝首饰加工,西城区西单北大街西单婚庆大楼四层4030（客梯直梯旁边）（近老佛爷百货西单商场灵境胡同地铁）,59,0,4,0,39.91412,116.373364,平谷区,十里河,,,"周一至周日 10:00-19:00","13691220133 13693121677",,,
82,"2019-01-17 05:51:40",大诚钻石的图片,28,"2019-01-18 02:57:41","大诚钻石专注婚戒定制18年，以实在的价格、优质完善的售前及售后服务，获得众多顾客的口碑宣传，赢得了上万对新人的信赖。 官方网站：m.1314dc.com 官方微信：DCZS1314",大诚钻石（建外SOHO旗舰店）,朝阳区东三环中路39号建外SOHO西区17号楼2708室（近永安里地铁站C口）,100,13116,5,1,39.906292,116.452907,平谷区,十里河,1999年,可刷卡,"周一至周日 10:00-19:00","58696538 13811673765",,,
83,"2019-01-17 05:51:40",大诚钻石的图片,28,"2019-01-18 02:57:41","大诚钻石专注婚戒定制18年，以实在的价格、优质完善的售前及售后服务，获得众多顾客的口碑宣传，赢得了上万对新人的信赖。 官方网站：m.1314dc.com 官方微信：DCZS1314",大诚钻石（建外SOHO旗舰店）,朝阳区东三环中路39号建外SOHO西区17号楼2708室（近永安里地铁站C口）,100,13116,5,1,39.906292,116.452907,平谷区,十里河,1999年,可刷卡,"周一至周日 10:00-19:00","58696538 13811673765",,,
84,"2019-01-17 05:51:40",大诚钻石的图片,28,"2019-01-18 02:57:41","大诚钻石专注婚戒定制18年，以实在的价格、优质完善的售前及售后服务，获得众多顾客的口碑宣传，赢得了上万对新人的信赖。 官方网站：m.1314dc.com 官方微信：DCZS1314",大诚钻石（建外SOHO旗舰店）,朝阳区东三环中路39号建外SOHO西区17号楼2708室（近永安里地铁站C口）,100,13116,5,1,39.906292,116.452907,平谷区,十里河,1999年,可刷卡,"周一至周日 10:00-19:00","58696538 13811673765",,,
85,"2019-01-17 05:51:40",大诚钻石的图片,28,"2019-01-18 02:57:41","大诚钻石专注婚戒定制18年，以实在的价格、优质完善的售前及售后服务，获得众多顾客的口碑宣传，赢得了上万对新人的信赖。 官方网站：m.1314dc.com 官方微信：DCZS1314",大诚钻石（建外SOHO旗舰店）,朝阳区东三环中路39号建外SOHO西区17号楼2708室（近永安里地铁站C口）,100,13116,5,1,39.906292,116.452907,平谷区,十里河,1999年,可刷卡,"周一至周日 10:00-19:00","58696538 13811673765",,,
86,"2019-01-17 05:51:40",大诚钻石的图片,28,"2019-01-18 02:57:41","大诚钻石专注婚戒定制18年，以实在的价格、优质完善的售前及售后服务，获得众多顾客的口碑宣传，赢得了上万对新人的信赖。 官方网站：m.1314dc.com 官方微信：DCZS1314",大诚钻石（建外SOHO旗舰店）,朝阳区东三环中路39号建外SOHO西区17号楼2708室（近永安里地铁站C口）,100,13116,5,1,39.906292,116.452907,平谷区,十里河,1999年,可刷卡,"周一至周日 10:00-19:00","58696538 13811673765",,,
87,"2019-01-17 05:51:50","NALAN 那蓝珠宝—专业钻戒&彩宝定制的图片",29,"2019-01-18 02:57:55",GIA钻石，彩钻，彩色宝石，珍珠，专属定制,"NALAN 那蓝珠宝—专业钻戒&彩宝定制",朝阳区东三环中路39号建外SOHO东区2号楼604室,100,23487,5,1,39.905665,116.459706,平谷区,十里河,2013年,可刷卡,"周一至周日 10:30-18:30",4001101353,,,
88,"2019-01-17 05:51:50","NALAN 那蓝珠宝—专业钻戒&彩宝定制的图片",29,"2019-01-18 02:57:55",GIA钻石，彩钻，彩色宝石，珍珠，专属定制,"NALAN 那蓝珠宝—专业钻戒&彩宝定制",朝阳区东三环中路39号建外SOHO东区2号楼604室,100,23487,5,1,39.905665,116.459706,平谷区,十里河,2013年,可刷卡,"周一至周日 10:30-18:30",4001101353,,,
89,"2019-01-17 05:51:50","NALAN 那蓝珠宝—专业钻戒&彩宝定制的图片",29,"2019-01-18 02:57:55",GIA钻石，彩钻，彩色宝石，珍珠，专属定制,"NALAN 那蓝珠宝—专业钻戒&彩宝定制",朝阳区东三环中路39号建外SOHO东区2号楼604室,100,23487,5,1,39.905665,116.459706,平谷区,十里河,2013年,可刷卡,"周一至周日 10:30-18:30",4001101353,,,
90,"2019-01-17 05:51:50","NALAN 那蓝珠宝—专业钻戒&彩宝定制的图片",29,"2019-01-18 02:57:55",GIA钻石，彩钻，彩色宝石，珍珠，专属定制,"NALAN 那蓝珠宝—专业钻戒&彩宝定制",朝阳区东三环中路39号建外SOHO东区2号楼604室,100,23487,5,1,39.905665,116.459706,平谷区,十里河,2013年,可刷卡,"周一至周日 10:30-18:30",4001101353,,,
91,"2019-01-17 05:51:50","NALAN 那蓝珠宝—专业钻戒&彩宝定制的图片",29,"2019-01-18 02:57:55",GIA钻石，彩钻，彩色宝石，珍珠，专属定制,"NALAN 那蓝珠宝—专业钻戒&彩宝定制",朝阳区东三环中路39号建外SOHO东区2号楼604室,100,23487,5,1,39.905665,116.459706,平谷区,十里河,2013年,可刷卡,"周一至周日 10:30-18:30",4001101353,,,
92,"2019-01-17 05:51:55",囍缘Club婚庆用车的图片,30,"2019-01-18 02:58:03",囍缘Club婚庆用车是一家位于北京的婚车租赁商户，商户为五星商户，共有2个产品可供用户挑选；截至当日，此商户共有0条用户点评。商户电话：13811714705,囍缘Club婚庆用车,昌平区立汤路龙德紫金,3000,5969,5,0,40.062127,116.414754,大兴区,白龙潭,,,"周一至周日 08:30-23:30",13811714705,,,
93,"2019-01-17 05:51:55",囍缘Club婚庆用车的图片,30,"2019-01-18 02:58:03",囍缘Club婚庆用车是一家位于北京的婚车租赁商户，商户为五星商户，共有2个产品可供用户挑选；截至当日，此商户共有0条用户点评。商户电话：13811714705,囍缘Club婚庆用车,昌平区立汤路龙德紫金,3000,5969,5,0,40.062127,116.414754,大兴区,白龙潭,,,"周一至周日 08:30-23:30",13811714705,,,
94,"2019-01-17 05:51:55",囍缘Club婚庆用车的图片,30,"2019-01-18 02:58:03",囍缘Club婚庆用车是一家位于北京的婚车租赁商户，商户为五星商户，共有2个产品可供用户挑选；截至当日，此商户共有0条用户点评。商户电话：13811714705,囍缘Club婚庆用车,昌平区立汤路龙德紫金,3000,5969,5,0,40.062127,116.414754,大兴区,白龙潭,,,"周一至周日 08:30-23:30",13811714705,,,
95,"2019-01-17 05:51:55",囍缘Club婚庆用车的图片,30,"2019-01-18 02:58:03",囍缘Club婚庆用车是一家位于北京的婚车租赁商户，商户为五星商户，共有2个产品可供用户挑选；截至当日，此商户共有0条用户点评。商户电话：13811714705,囍缘Club婚庆用车,昌平区立汤路龙德紫金,3000,5969,5,0,40.062127,116.414754,大兴区,白龙潭,,,"周一至周日 08:30-23:30",13811714705,,,
96,"2019-01-17 05:51:55",囍缘Club婚庆用车的图片,30,"2019-01-18 02:58:03",囍缘Club婚庆用车是一家位于北京的婚车租赁商户，商户为五星商户，共有2个产品可供用户挑选；截至当日，此商户共有0条用户点评。商户电话：13811714705,囍缘Club婚庆用车,昌平区立汤路龙德紫金,3000,5969,5,0,40.062127,116.414754,大兴区,白龙潭,,,"周一至周日 08:30-23:30",13811714705,,,
97,"2019-01-17 05:52:13",国宾婚庆用车的图片,31,"2019-01-18 02:58:12",公司技术力量雄厚，经营租赁车辆种类齐全，具有劳斯莱斯、宾利、林肯、奔驰S系列、宝马、别克商务仓GL8、奥迪A6L、本田、帕萨特、福特全顺、金龙大巴、宇通55座大巴、各种跑车等等一系列豪华车辆。,国宾婚庆用车,西城区广安门外大街305号（靠近达官营地铁）,3050,5081,4.5,0,39.894481,116.339295,大兴区,白龙潭,2008年,不可刷卡,"周一至周日 07:00-23:00","13801326655 13301306655",,,
98,"2019-01-17 05:52:13",国宾婚庆用车的图片,31,"2019-01-18 02:58:12",公司技术力量雄厚，经营租赁车辆种类齐全，具有劳斯莱斯、宾利、林肯、奔驰S系列、宝马、别克商务仓GL8、奥迪A6L、本田、帕萨特、福特全顺、金龙大巴、宇通55座大巴、各种跑车等等一系列豪华车辆。,国宾婚庆用车,西城区广安门外大街305号（靠近达官营地铁）,3050,5081,4.5,0,39.894481,116.339295,大兴区,白龙潭,2008年,不可刷卡,"周一至周日 07:00-23:00","13801326655 13301306655",,,
99,"2019-01-17 05:52:13",国宾婚庆用车的图片,31,"2019-01-18 02:58:12",公司技术力量雄厚，经营租赁车辆种类齐全，具有劳斯莱斯、宾利、林肯、奔驰S系列、宝马、别克商务仓GL8、奥迪A6L、本田、帕萨特、福特全顺、金龙大巴、宇通55座大巴、各种跑车等等一系列豪华车辆。,国宾婚庆用车,西城区广安门外大街305号（靠近达官营地铁）,3050,5081,4.5,0,39.894481,116.339295,大兴区,白龙潭,2008年,不可刷卡,"周一至周日 07:00-23:00","13801326655 13301306655",,,
100,"2019-01-17 05:52:13",国宾婚庆用车的图片,31,"2019-01-18 02:58:12",公司技术力量雄厚，经营租赁车辆种类齐全，具有劳斯莱斯、宾利、林肯、奔驰S系列、宝马、别克商务仓GL8、奥迪A6L、本田、帕萨特、福特全顺、金龙大巴、宇通55座大巴、各种跑车等等一系列豪华车辆。,国宾婚庆用车,西城区广安门外大街305号（靠近达官营地铁）,3050,5081,4.5,0,39.894481,116.339295,大兴区,白龙潭,2008年,不可刷卡,"周一至周日 07:00-23:00","13801326655 13301306655",,,
101,"2019-01-17 05:52:13",国宾婚庆用车的图片,31,"2019-01-18 02:58:12",公司技术力量雄厚，经营租赁车辆种类齐全，具有劳斯莱斯、宾利、林肯、奔驰S系列、宝马、别克商务仓GL8、奥迪A6L、本田、帕萨特、福特全顺、金龙大巴、宇通55座大巴、各种跑车等等一系列豪华车辆。,国宾婚庆用车,西城区广安门外大街305号（靠近达官营地铁）,3050,5081,4.5,0,39.894481,116.339295,大兴区,白龙潭,2008年,不可刷卡,"周一至周日 07:00-23:00","13801326655 13301306655",,,
102,"2019-01-17 05:52:23",北京婚车俱乐部的图片,32,"2019-01-18 02:58:24",北京婚车俱乐部是隶属于北京首企之选汽车租赁有限公司旗下的婚车品牌，是北京市少有的正规注册婚车公司，公司每年服务上千对新人，为新人提供多种车型、多种颜色的选择，真正做到了为您的婚礼保驾护航。,北京婚车俱乐部,通州区北苑南路38号院雅丽世居底商,2600,15665,4.5,0,39.89506,116.644547,大兴区,白龙潭,2012年,可刷卡,"周一至周日 08:00-23:30","13911314111 18518923262",,,
103,"2019-01-17 05:52:23",北京婚车俱乐部的图片,32,"2019-01-18 02:58:24",北京婚车俱乐部是隶属于北京首企之选汽车租赁有限公司旗下的婚车品牌，是北京市少有的正规注册婚车公司，公司每年服务上千对新人，为新人提供多种车型、多种颜色的选择，真正做到了为您的婚礼保驾护航。,北京婚车俱乐部,通州区北苑南路38号院雅丽世居底商,2600,15665,4.5,0,39.89506,116.644547,大兴区,白龙潭,2012年,可刷卡,"周一至周日 08:00-23:30","13911314111 18518923262",,,
104,"2019-01-17 05:52:23",北京婚车俱乐部的图片,32,"2019-01-18 02:58:24",北京婚车俱乐部是隶属于北京首企之选汽车租赁有限公司旗下的婚车品牌，是北京市少有的正规注册婚车公司，公司每年服务上千对新人，为新人提供多种车型、多种颜色的选择，真正做到了为您的婚礼保驾护航。,北京婚车俱乐部,通州区北苑南路38号院雅丽世居底商,2600,15665,4.5,0,39.89506,116.644547,大兴区,白龙潭,2012年,可刷卡,"周一至周日 08:00-23:30","13911314111 18518923262",,,
105,"2019-01-17 05:52:23",北京婚车俱乐部的图片,32,"2019-01-18 02:58:24",北京婚车俱乐部是隶属于北京首企之选汽车租赁有限公司旗下的婚车品牌，是北京市少有的正规注册婚车公司，公司每年服务上千对新人，为新人提供多种车型、多种颜色的选择，真正做到了为您的婚礼保驾护航。,北京婚车俱乐部,通州区北苑南路38号院雅丽世居底商,2600,15665,4.5,0,39.89506,116.644547,大兴区,白龙潭,2012年,可刷卡,"周一至周日 08:00-23:30","13911314111 18518923262",,,
106,"2019-01-17 05:52:23",北京婚车俱乐部的图片,32,"2019-01-18 02:58:24",北京婚车俱乐部是隶属于北京首企之选汽车租赁有限公司旗下的婚车品牌，是北京市少有的正规注册婚车公司，公司每年服务上千对新人，为新人提供多种车型、多种颜色的选择，真正做到了为您的婚礼保驾护航。,北京婚车俱乐部,通州区北苑南路38号院雅丽世居底商,2600,15665,4.5,0,39.89506,116.644547,大兴区,白龙潭,2012年,可刷卡,"周一至周日 08:00-23:30","13911314111 18518923262",,,
107,"2019-01-17 05:52:30",耀莱婚车租赁的图片,33,"2019-01-18 02:58:29",北京耀莱租车主要为公司提供汽车租赁服务。公司现有劳斯莱斯、宾利、奔驰、奥迪、天籁、广本、丰田、帕萨特等轿车及奔驰、丰田海狮、别克等商务车，车新价优，市内免费送车。,耀莱婚车租赁,丰台区长辛店杜家坎6号,1,0,0,0,39.840518,116.204498,大兴区,白龙潭,2012年,可刷卡,"周一至周日 09:00-22:00","13910813250 13910985499",,,
108,"2019-01-17 05:52:30",耀莱婚车租赁的图片,33,"2019-01-18 02:58:29",北京耀莱租车主要为公司提供汽车租赁服务。公司现有劳斯莱斯、宾利、奔驰、奥迪、天籁、广本、丰田、帕萨特等轿车及奔驰、丰田海狮、别克等商务车，车新价优，市内免费送车。,耀莱婚车租赁,丰台区长辛店杜家坎6号,1,0,0,0,39.840518,116.204498,大兴区,白龙潭,2012年,可刷卡,"周一至周日 09:00-22:00","13910813250 13910985499",,,
109,"2019-01-17 05:52:30",耀莱婚车租赁的图片,33,"2019-01-18 02:58:29",北京耀莱租车主要为公司提供汽车租赁服务。公司现有劳斯莱斯、宾利、奔驰、奥迪、天籁、广本、丰田、帕萨特等轿车及奔驰、丰田海狮、别克等商务车，车新价优，市内免费送车。,耀莱婚车租赁,丰台区长辛店杜家坎6号,1,0,0,0,39.840518,116.204498,大兴区,白龙潭,2012年,可刷卡,"周一至周日 09:00-22:00","13910813250 13910985499",,,
110,"2019-01-17 05:52:30",耀莱婚车租赁的图片,33,"2019-01-18 02:58:29",北京耀莱租车主要为公司提供汽车租赁服务。公司现有劳斯莱斯、宾利、奔驰、奥迪、天籁、广本、丰田、帕萨特等轿车及奔驰、丰田海狮、别克等商务车，车新价优，市内免费送车。,耀莱婚车租赁,丰台区长辛店杜家坎6号,1,0,0,0,39.840518,116.204498,大兴区,白龙潭,2012年,可刷卡,"周一至周日 09:00-22:00","13910813250 13910985499",,,
111,"2019-01-17 05:52:30",耀莱婚车租赁的图片,33,"2019-01-18 02:58:29",北京耀莱租车主要为公司提供汽车租赁服务。公司现有劳斯莱斯、宾利、奔驰、奥迪、天籁、广本、丰田、帕萨特等轿车及奔驰、丰田海狮、别克等商务车，车新价优，市内免费送车。,耀莱婚车租赁,丰台区长辛店杜家坎6号,1,0,0,0,39.840518,116.204498,大兴区,白龙潭,2012年,可刷卡,"周一至周日 09:00-22:00","13910813250 13910985499",,,
112,"2019-01-17 05:52:38",花嫁甜心婚庆用车的图片,34,"2019-01-18 02:58:43","花嫁甜心婚庆用车，诚信为本，给您最专业最好的服务。 选择我们绝对让新人用着舒心，家人放心。",花嫁甜心婚庆用车,东城区和平西桥,1,5767,5,1,39.959094,116.421225,大兴区,白龙潭,2008年,不可刷卡,"周一至周日 全天",4000908610-220927,,,
113,"2019-01-17 05:52:38",花嫁甜心婚庆用车的图片,34,"2019-01-18 02:58:43","花嫁甜心婚庆用车，诚信为本，给您最专业最好的服务。 选择我们绝对让新人用着舒心，家人放心。",花嫁甜心婚庆用车,东城区和平西桥,1,5767,5,1,39.959094,116.421225,大兴区,白龙潭,2008年,不可刷卡,"周一至周日 全天",4000908610-220927,,,
114,"2019-01-17 05:52:38",花嫁甜心婚庆用车的图片,34,"2019-01-18 02:58:43","花嫁甜心婚庆用车，诚信为本，给您最专业最好的服务。 选择我们绝对让新人用着舒心，家人放心。",花嫁甜心婚庆用车,东城区和平西桥,1,5767,5,1,39.959094,116.421225,大兴区,白龙潭,2008年,不可刷卡,"周一至周日 全天",4000908610-220927,,,
115,"2019-01-17 05:52:38",花嫁甜心婚庆用车的图片,34,"2019-01-18 02:58:43","花嫁甜心婚庆用车，诚信为本，给您最专业最好的服务。 选择我们绝对让新人用着舒心，家人放心。",花嫁甜心婚庆用车,东城区和平西桥,1,5767,5,1,39.959094,116.421225,大兴区,白龙潭,2008年,不可刷卡,"周一至周日 全天",4000908610-220927,,,
116,"2019-01-17 05:52:38",花嫁甜心婚庆用车的图片,34,"2019-01-18 02:58:43","花嫁甜心婚庆用车，诚信为本，给您最专业最好的服务。 选择我们绝对让新人用着舒心，家人放心。",花嫁甜心婚庆用车,东城区和平西桥,1,5767,5,1,39.959094,116.421225,大兴区,白龙潭,2008年,不可刷卡,"周一至周日 全天",4000908610-220927,,,
117,"2019-01-17 05:52:50",京诚婚庆用车的图片,35,"2019-01-18 02:59:53",鹊桥相会在七号，天作之合在北京京诚club，北京京诚club是品味与生活，时尚与节俭的兼顾者。,京诚婚庆用车,西城区感化胡同3号（长椿街地铁站c口）,1,13145,5,0,39.894612,116.364784,大兴区,白龙潭,2008年,可刷卡,"周一至周日 05:30-23:30","15611030182 18612828260",,,
118,"2019-01-17 05:52:50",京诚婚庆用车的图片,35,"2019-01-18 02:59:53",鹊桥相会在七号，天作之合在北京京诚club，北京京诚club是品味与生活，时尚与节俭的兼顾者。,京诚婚庆用车,西城区感化胡同3号（长椿街地铁站c口）,1,13145,5,0,39.894612,116.364784,大兴区,白龙潭,2008年,可刷卡,"周一至周日 05:30-23:30","15611030182 18612828260",,,
119,"2019-01-17 05:52:50",京诚婚庆用车的图片,35,"2019-01-18 02:59:53",鹊桥相会在七号，天作之合在北京京诚club，北京京诚club是品味与生活，时尚与节俭的兼顾者。,京诚婚庆用车,西城区感化胡同3号（长椿街地铁站c口）,1,13145,5,0,39.894612,116.364784,大兴区,白龙潭,2008年,可刷卡,"周一至周日 05:30-23:30","15611030182 18612828260",,,
120,"2019-01-17 05:52:50",京诚婚庆用车的图片,35,"2019-01-18 02:59:53",鹊桥相会在七号，天作之合在北京京诚club，北京京诚club是品味与生活，时尚与节俭的兼顾者。,京诚婚庆用车,西城区感化胡同3号（长椿街地铁站c口）,1,13145,5,0,39.894612,116.364784,大兴区,白龙潭,2008年,可刷卡,"周一至周日 05:30-23:30","15611030182 18612828260",,,
121,"2019-01-17 05:52:50",京诚婚庆用车的图片,35,"2019-01-18 02:59:53",鹊桥相会在七号，天作之合在北京京诚club，北京京诚club是品味与生活，时尚与节俭的兼顾者。,京诚婚庆用车,西城区感化胡同3号（长椿街地铁站c口）,1,13145,5,0,39.894612,116.364784,大兴区,白龙潭,2008年,可刷卡,"周一至周日 05:30-23:30","15611030182 18612828260",,,
122,"2019-01-17 05:52:57",李晓哲彩妆造型工作室的图片,36,"2019-01-18 03:00:03","李晓哲彩妆造型工作室 为每一位客户找到属于您自身的魅力妆容，打造星级技术和优质服务 化妆造型经验丰富 拥有数名业内资深彩妆造型师 是专业新娘化妆，化妆培训，商业广告团体演出化妆造型为一体性价比高的一家",李晓哲彩妆造型工作室（五道口店）,海淀区王庄路33-2号6层601室（清华同方科技广场对面）,218,461,4,5,39.999746,116.340318,东城区,燕山,2010年,不可刷卡,"周一至周日 10:30-19:00",18510341108,,,
123,"2019-01-17 05:52:57",李晓哲彩妆造型工作室的图片,36,"2019-01-18 03:00:03","李晓哲彩妆造型工作室 为每一位客户找到属于您自身的魅力妆容，打造星级技术和优质服务 化妆造型经验丰富 拥有数名业内资深彩妆造型师 是专业新娘化妆，化妆培训，商业广告团体演出化妆造型为一体性价比高的一家",李晓哲彩妆造型工作室（五道口店）,海淀区王庄路33-2号6层601室（清华同方科技广场对面）,218,461,4,5,39.999746,116.340318,东城区,燕山,2010年,不可刷卡,"周一至周日 10:30-19:00",18510341108,,,
124,"2019-01-17 05:52:57",李晓哲彩妆造型工作室的图片,36,"2019-01-18 03:00:03","李晓哲彩妆造型工作室 为每一位客户找到属于您自身的魅力妆容，打造星级技术和优质服务 化妆造型经验丰富 拥有数名业内资深彩妆造型师 是专业新娘化妆，化妆培训，商业广告团体演出化妆造型为一体性价比高的一家",李晓哲彩妆造型工作室（五道口店）,海淀区王庄路33-2号6层601室（清华同方科技广场对面）,218,461,4,5,39.999746,116.340318,东城区,燕山,2010年,不可刷卡,"周一至周日 10:30-19:00",18510341108,,,