service_image.id,service_image.ts,service_image.source_content_type,service_image.hash_file_content,service_image.size,service_image.path,service_image.title,service_image.access,image_slug.id,image_slug.ts,image_slug.title,service.id,service.ts,service.description,service.service,service.address,service.lowest_price,service.per_capita_consumption,service.score_overall,service.comment_count,service.latitude,service.longitude,service.area,service.street,service.create_time,service.pay_way,service.open_time,service.telephone,service.feature,service.star,service.count
105,"2019-01-22 22:30:05",image/jpeg,4b8ab668aa02f69464fc43dc883125a761adc2bf,375398,/4b/8a/b6/68/4b8ab668aa02f69464fc43dc883125a761adc2bf.jpg,,https://songer.datasn.com/data/api/v1/u_e49e7f0fcb85c5451b03/china_wedding_service_1/by_table/service_image_access/4b/8a/b6/68/4b8ab668aa02f69464fc43dc883125a761adc2bf.jpg,124,"2019-01-17 05:52:57",李晓哲彩妆造型工作室的图片,36,"2019-01-18 03:00:03","李晓哲彩妆造型工作室 为每一位客户找到属于您自身的魅力妆容，打造星级技术和优质服务 化妆造型经验丰富 拥有数名业内资深彩妆造型师 是专业新娘化妆，化妆培训，商业广告团体演出化妆造型为一体性价比高的一家",李晓哲彩妆造型工作室（五道口店）,海淀区王庄路33-2号6层601室（清华同方科技广场对面）,218,461,4,5,39.999746,116.340318,东城区,燕山,2010年,不可刷卡,"周一至周日 10:30-19:00",18510341108,,,
106,"2019-01-22 22:30:22",image/jpeg,1fcbaa8831db486631bc02e3072973e10cbec96b,350280,/1f/cb/aa/88/1fcbaa8831db486631bc02e3072973e10cbec96b.jpg,,https://songer.datasn.com/data/api/v1/u_e49e7f0fcb85c5451b03/china_wedding_service_1/by_table/service_image_access/1f/cb/aa/88/1fcbaa8831db486631bc02e3072973e10cbec96b.jpg,125,"2019-01-17 05:52:57",李晓哲彩妆造型工作室的图片,36,"2019-01-18 03:00:03","李晓哲彩妆造型工作室 为每一位客户找到属于您自身的魅力妆容，打造星级技术和优质服务 化妆造型经验丰富 拥有数名业内资深彩妆造型师 是专业新娘化妆，化妆培训，商业广告团体演出化妆造型为一体性价比高的一家",李晓哲彩妆造型工作室（五道口店）,海淀区王庄路33-2号6层601室（清华同方科技广场对面）,218,461,4,5,39.999746,116.340318,东城区,燕山,2010年,不可刷卡,"周一至周日 10:30-19:00",18510341108,,,
107,"2019-01-22 22:30:35",image/jpeg,f866de3612caa784fb210d1970c95cb6fed36975,297993,/f8/66/de/36/f866de3612caa784fb210d1970c95cb6fed36975.jpg,,https://songer.datasn.com/data/api/v1/u_e49e7f0fcb85c5451b03/china_wedding_service_1/by_table/service_image_access/f8/66/de/36/f866de3612caa784fb210d1970c95cb6fed36975.jpg,126,"2019-01-17 05:52:57",李晓哲彩妆造型工作室的图片,36,"2019-01-18 03:00:03","李晓哲彩妆造型工作室 为每一位客户找到属于您自身的魅力妆容，打造星级技术和优质服务 化妆造型经验丰富 拥有数名业内资深彩妆造型师 是专业新娘化妆，化妆培训，商业广告团体演出化妆造型为一体性价比高的一家",李晓哲彩妆造型工作室（五道口店）,海淀区王庄路33-2号6层601室（清华同方科技广场对面）,218,461,4,5,39.999746,116.340318,东城区,燕山,2010年,不可刷卡,"周一至周日 10:30-19:00",18510341108,,,
108,"2019-01-22 22:30:51",image/jpeg,6df4d6b227a3d8c389cf3ccdf5f6fc47d370b9a2,415819,/6d/f4/d6/b2/6df4d6b227a3d8c389cf3ccdf5f6fc47d370b9a2.jpg,,https://songer.datasn.com/data/api/v1/u_e49e7f0fcb85c5451b03/china_wedding_service_1/by_table/service_image_access/6d/f4/d6/b2/6df4d6b227a3d8c389cf3ccdf5f6fc47d370b9a2.jpg,127,"2019-01-17 05:53:00",轩丫修眉化妆造型的图片,37,"2019-01-18 03:00:58",轩丫修眉化妆造型(金码大厦店)是一家位于北京的彩妆造型商户，商户为五星商户，共有5个产品可供用户挑选；截至当日，此商户共有0条用户点评。商户电话：13381177706,轩丫修眉化妆造型（金码大厦店）,海淀区学院路和清华东路交汇处金码大厦3层,20,60,4.9,23,40.001819,116.353838,海淀区,五道口,,,"周一,周三至周日 10:00-19:00",13381177706,,,
109,"2019-01-22 22:31:14",image/jpeg,61d8d949a585602f6b7314a0dca88ec7c942322d,484827,/61/d8/d9/49/61d8d949a585602f6b7314a0dca88ec7c942322d.jpg,,https://songer.datasn.com/data/api/v1/u_e49e7f0fcb85c5451b03/china_wedding_service_1/by_table/service_image_access/61/d8/d9/49/61d8d949a585602f6b7314a0dca88ec7c942322d.jpg,128,"2019-01-17 05:53:00",轩丫修眉化妆造型的图片,37,"2019-01-18 03:00:58",轩丫修眉化妆造型(金码大厦店)是一家位于北京的彩妆造型商户，商户为五星商户，共有5个产品可供用户挑选；截至当日，此商户共有0条用户点评。商户电话：13381177706,轩丫修眉化妆造型（金码大厦店）,海淀区学院路和清华东路交汇处金码大厦3层,20,60,4.9,23,40.001819,116.353838,海淀区,五道口,,,"周一,周三至周日 10:00-19:00",13381177706,,,
110,"2019-01-22 22:31:24",image/jpeg,7f1cb65ed8975221e7bc441b5b787635e70c998b,434188,/7f/1c/b6/5e/7f1cb65ed8975221e7bc441b5b787635e70c998b.jpg,,https://songer.datasn.com/data/api/v1/u_e49e7f0fcb85c5451b03/china_wedding_service_1/by_table/service_image_access/7f/1c/b6/5e/7f1cb65ed8975221e7bc441b5b787635e70c998b.jpg,129,"2019-01-17 05:53:00",轩丫修眉化妆造型的图片,37,"2019-01-18 03:00:58",轩丫修眉化妆造型(金码大厦店)是一家位于北京的彩妆造型商户，商户为五星商户，共有5个产品可供用户挑选；截至当日，此商户共有0条用户点评。商户电话：13381177706,轩丫修眉化妆造型（金码大厦店）,海淀区学院路和清华东路交汇处金码大厦3层,20,60,4.9,23,40.001819,116.353838,海淀区,五道口,,,"周一,周三至周日 10:00-19:00",13381177706,,,
111,"2019-01-22 22:32:08",image/jpeg,30d32f2b3b4ccc070f4a763e330175ad90d41004,325235,/30/d3/2f/2b/30d32f2b3b4ccc070f4a763e330175ad90d41004.jpg,,https://songer.datasn.com/data/api/v1/u_e49e7f0fcb85c5451b03/china_wedding_service_1/by_table/service_image_access/30/d3/2f/2b/30d32f2b3b4ccc070f4a763e330175ad90d41004.jpg,130,"2019-01-17 05:53:00",轩丫修眉化妆造型的图片,37,"2019-01-18 03:00:58",轩丫修眉化妆造型(金码大厦店)是一家位于北京的彩妆造型商户，商户为五星商户，共有5个产品可供用户挑选；截至当日，此商户共有0条用户点评。商户电话：13381177706,轩丫修眉化妆造型（金码大厦店）,海淀区学院路和清华东路交汇处金码大厦3层,20,60,4.9,23,40.001819,116.353838,海淀区,五道口,,,"周一,周三至周日 10:00-19:00",13381177706,,,
112,"2019-01-22 22:32:39",image/jpeg,2a7fac7cb1b6d495d60ed09e589fd97f955add44,368830,/2a/7f/ac/7c/2a7fac7cb1b6d495d60ed09e589fd97f955add44.jpg,,https://songer.datasn.com/data/api/v1/u_e49e7f0fcb85c5451b03/china_wedding_service_1/by_table/service_image_access/2a/7f/ac/7c/2a7fac7cb1b6d495d60ed09e589fd97f955add44.jpg,131,"2019-01-17 05:53:00",轩丫修眉化妆造型的图片,37,"2019-01-18 03:00:58",轩丫修眉化妆造型(金码大厦店)是一家位于北京的彩妆造型商户，商户为五星商户，共有5个产品可供用户挑选；截至当日，此商户共有0条用户点评。商户电话：13381177706,轩丫修眉化妆造型（金码大厦店）,海淀区学院路和清华东路交汇处金码大厦3层,20,60,4.9,23,40.001819,116.353838,海淀区,五道口,,,"周一,周三至周日 10:00-19:00",13381177706,,,
113,"2019-01-22 22:32:52",image/jpeg,51cb7b9dc5f52cce9e11bc7c5ce62a07e8180750,484872,/51/cb/7b/9d/51cb7b9dc5f52cce9e11bc7c5ce62a07e8180750.jpg,,https://songer.datasn.com/data/api/v1/u_e49e7f0fcb85c5451b03/china_wedding_service_1/by_table/service_image_access/51/cb/7b/9d/51cb7b9dc5f52cce9e11bc7c5ce62a07e8180750.jpg,132,"2019-01-17 05:53:14",李晓哲彩妆造型工作室的图片,38,"2019-01-17 05:53:14",,李晓哲彩妆造型工作室,海淀区王庄路33号楼6层（北京人才市场报社）,368,1982,4.1,10,39.999532,116.340381,海淀区,"洋桥\u002F木樨园",,,,400-090-8610-168163,,,
114,"2019-01-22 22:33:00",image/jpeg,a1446d16318cbb33feac58c55a5b88092e2209b5,98572,/a1/44/6d/16/a1446d16318cbb33feac58c55a5b88092e2209b5.jpg,,https://songer.datasn.com/data/api/v1/u_e49e7f0fcb85c5451b03/china_wedding_service_1/by_table/service_image_access/a1/44/6d/16/a1446d16318cbb33feac58c55a5b88092e2209b5.jpg,133,"2019-01-17 05:53:14",李晓哲彩妆造型工作室的图片,38,"2019-01-17 05:53:14",,李晓哲彩妆造型工作室,海淀区王庄路33号楼6层（北京人才市场报社）,368,1982,4.1,10,39.999532,116.340381,海淀区,"洋桥\u002F木樨园",,,,400-090-8610-168163,,,
115,"2019-01-22 22:33:12",image/jpeg,952418a32e0ff1228c3878c7de917f737150df5f,469395,/95/24/18/a3/952418a32e0ff1228c3878c7de917f737150df5f.jpg,,https://songer.datasn.com/data/api/v1/u_e49e7f0fcb85c5451b03/china_wedding_service_1/by_table/service_image_access/95/24/18/a3/952418a32e0ff1228c3878c7de917f737150df5f.jpg,134,"2019-01-17 05:53:14",李晓哲彩妆造型工作室的图片,38,"2019-01-17 05:53:14",,李晓哲彩妆造型工作室,海淀区王庄路33号楼6层（北京人才市场报社）,368,1982,4.1,10,39.999532,116.340381,海淀区,"洋桥\u002F木樨园",,,,400-090-8610-168163,,,
116,"2019-01-22 22:33:18",image/jpeg,d158308f67778de9e9d3bd15db7c3117c69828a0,266657,/d1/58/30/8f/d158308f67778de9e9d3bd15db7c3117c69828a0.jpg,,https://songer.datasn.com/data/api/v1/u_e49e7f0fcb85c5451b03/china_wedding_service_1/by_table/service_image_access/d1/58/30/8f/d158308f67778de9e9d3bd15db7c3117c69828a0.jpg,135,"2019-01-17 05:53:14",李晓哲彩妆造型工作室的图片,38,"2019-01-17 05:53:14",,李晓哲彩妆造型工作室,海淀区王庄路33号楼6层（北京人才市场报社）,368,1982,4.1,10,39.999532,116.340381,海淀区,"洋桥\u002F木樨园",,,,400-090-8610-168163,,,
117,"2019-01-22 22:33:28",image/jpeg,05b6160c6ad764b4129314482b0c4b93b4a11b10,333449,/05/b6/16/0c/05b6160c6ad764b4129314482b0c4b93b4a11b10.jpg,,https://songer.datasn.com/data/api/v1/u_e49e7f0fcb85c5451b03/china_wedding_service_1/by_table/service_image_access/05/b6/16/0c/05b6160c6ad764b4129314482b0c4b93b4a11b10.jpg,137,"2019-01-17 05:54:18",米兰彩妆工作室的图片,39,"2019-01-18 03:01:10",米兰彩妆工作室是一家位于北京的彩妆造型商户，商户为暂无星级，共有1个产品可供用户挑选；截至当日，此商户共有0条用户点评。商户电话：17610592599,米兰彩妆工作室,海淀区成府路华清嘉园1号楼9号3门,199,0,0,0,39.992279,116.336687,海淀区,五道口,,,"周一至周日 09:30-21:30",17610592599,,,
118,"2019-01-22 22:33:59",image/jpeg,0ee64a11f12a96563b56b918d6384f4e2446b588,269290,/0e/e6/4a/11/0ee64a11f12a96563b56b918d6384f4e2446b588.jpg,,https://songer.datasn.com/data/api/v1/u_e49e7f0fcb85c5451b03/china_wedding_service_1/by_table/service_image_access/0e/e6/4a/11/0ee64a11f12a96563b56b918d6384f4e2446b588.jpg,138,"2019-01-17 05:54:18",米兰彩妆工作室的图片,39,"2019-01-18 03:01:10",米兰彩妆工作室是一家位于北京的彩妆造型商户，商户为暂无星级，共有1个产品可供用户挑选；截至当日，此商户共有0条用户点评。商户电话：17610592599,米兰彩妆工作室,海淀区成府路华清嘉园1号楼9号3门,199,0,0,0,39.992279,116.336687,海淀区,五道口,,,"周一至周日 09:30-21:30",17610592599,,,
119,"2019-01-22 22:38:15",image/jpeg,6e8e33c00a92906e8e090a6bb9767fc7f3e86b85,329216,/6e/8e/33/c0/6e8e33c00a92906e8e090a6bb9767fc7f3e86b85.jpg,,https://songer.datasn.com/data/api/v1/u_e49e7f0fcb85c5451b03/china_wedding_service_1/by_table/service_image_access/6e/8e/33/c0/6e8e33c00a92906e8e090a6bb9767fc7f3e86b85.jpg,139,"2019-01-17 05:54:18",米兰彩妆工作室的图片,39,"2019-01-18 03:01:10",米兰彩妆工作室是一家位于北京的彩妆造型商户，商户为暂无星级，共有1个产品可供用户挑选；截至当日，此商户共有0条用户点评。商户电话：17610592599,米兰彩妆工作室,海淀区成府路华清嘉园1号楼9号3门,199,0,0,0,39.992279,116.336687,海淀区,五道口,,,"周一至周日 09:30-21:30",17610592599,,,
120,"2019-01-22 22:38:42",image/jpeg,41dfc8f214cb3179caa4082286be111d83af2751,354853,/41/df/c8/f2/41dfc8f214cb3179caa4082286be111d83af2751.jpg,,https://songer.datasn.com/data/api/v1/u_e49e7f0fcb85c5451b03/china_wedding_service_1/by_table/service_image_access/41/df/c8/f2/41dfc8f214cb3179caa4082286be111d83af2751.jpg,140,"2019-01-17 05:54:18",米兰彩妆工作室的图片,39,"2019-01-18 03:01:10",米兰彩妆工作室是一家位于北京的彩妆造型商户，商户为暂无星级，共有1个产品可供用户挑选；截至当日，此商户共有0条用户点评。商户电话：17610592599,米兰彩妆工作室,海淀区成府路华清嘉园1号楼9号3门,199,0,0,0,39.992279,116.336687,海淀区,五道口,,,"周一至周日 09:30-21:30",17610592599,,,
121,"2019-01-22 22:39:55",image/jpeg,eef23736afaa2757746dfb0bf2031f8f0675c93e,375112,/ee/f2/37/36/eef23736afaa2757746dfb0bf2031f8f0675c93e.jpg,,https://songer.datasn.com/data/api/v1/u_e49e7f0fcb85c5451b03/china_wedding_service_1/by_table/service_image_access/ee/f2/37/36/eef23736afaa2757746dfb0bf2031f8f0675c93e.jpg,141,"2019-01-17 05:54:18",米兰彩妆工作室的图片,39,"2019-01-18 03:01:10",米兰彩妆工作室是一家位于北京的彩妆造型商户，商户为暂无星级，共有1个产品可供用户挑选；截至当日，此商户共有0条用户点评。商户电话：17610592599,米兰彩妆工作室,海淀区成府路华清嘉园1号楼9号3门,199,0,0,0,39.992279,116.336687,海淀区,五道口,,,"周一至周日 09:30-21:30",17610592599,,,
122,"2019-01-22 22:40:07",image/jpeg,22157e1e8dc5daaf1fbae1562d49a729c14bf1d6,320012,/22/15/7e/1e/22157e1e8dc5daaf1fbae1562d49a729c14bf1d6.jpg,,https://songer.datasn.com/data/api/v1/u_e49e7f0fcb85c5451b03/china_wedding_service_1/by_table/service_image_access/22/15/7e/1e/22157e1e8dc5daaf1fbae1562d49a729c14bf1d6.jpg,142,"2019-01-17 05:54:29",纯善化妆造型的图片,40,"2019-01-18 03:01:20","我们是真正的手工艺人 我们用雕刻的方式开展我们的工作 首先，我们要根据你的形象、气质、特质、品味、经历、职业、等等制定扬长避短的形象设计 纯善化妆造型超值服务体验，专业婚礼跟妆，呈现最美的你～",纯善化妆造型,房山区长政南路双子座2号楼1104（长阳地铁站）,98,0,4.7,12,39.763396,116.214281,东城区,燕山,2010年,可刷卡,"周一至周日 09:30-17:30",17701093206,,,
123,"2019-01-22 22:40:27",image/jpeg,057489bca492e33a9d5bf3702caa64f92de309b4,193859,/05/74/89/bc/057489bca492e33a9d5bf3702caa64f92de309b4.jpg,,https://songer.datasn.com/data/api/v1/u_e49e7f0fcb85c5451b03/china_wedding_service_1/by_table/service_image_access/05/74/89/bc/057489bca492e33a9d5bf3702caa64f92de309b4.jpg,143,"2019-01-17 05:54:29",纯善化妆造型的图片,40,"2019-01-18 03:01:20","我们是真正的手工艺人 我们用雕刻的方式开展我们的工作 首先，我们要根据你的形象、气质、特质、品味、经历、职业、等等制定扬长避短的形象设计 纯善化妆造型超值服务体验，专业婚礼跟妆，呈现最美的你～",纯善化妆造型,房山区长政南路双子座2号楼1104（长阳地铁站）,98,0,4.7,12,39.763396,116.214281,东城区,燕山,2010年,可刷卡,"周一至周日 09:30-17:30",17701093206,,,
124,"2019-01-22 22:40:41",image/jpeg,b8227970ec202f0983980adc2bc72cebe7e5f495,231328,/b8/22/79/70/b8227970ec202f0983980adc2bc72cebe7e5f495.jpg,,https://songer.datasn.com/data/api/v1/u_e49e7f0fcb85c5451b03/china_wedding_service_1/by_table/service_image_access/b8/22/79/70/b8227970ec202f0983980adc2bc72cebe7e5f495.jpg,144,"2019-01-17 05:54:29",纯善化妆造型的图片,40,"2019-01-18 03:01:20","我们是真正的手工艺人 我们用雕刻的方式开展我们的工作 首先，我们要根据你的形象、气质、特质、品味、经历、职业、等等制定扬长避短的形象设计 纯善化妆造型超值服务体验，专业婚礼跟妆，呈现最美的你～",纯善化妆造型,房山区长政南路双子座2号楼1104（长阳地铁站）,98,0,4.7,12,39.763396,116.214281,东城区,燕山,2010年,可刷卡,"周一至周日 09:30-17:30",17701093206,,,
125,"2019-01-22 22:40:48",image/jpeg,0619a899ae837fc41e339cbf8d594ed5f6817352,177327,/06/19/a8/99/0619a899ae837fc41e339cbf8d594ed5f6817352.jpg,,https://songer.datasn.com/data/api/v1/u_e49e7f0fcb85c5451b03/china_wedding_service_1/by_table/service_image_access/06/19/a8/99/0619a899ae837fc41e339cbf8d594ed5f6817352.jpg,145,"2019-01-17 05:54:29",纯善化妆造型的图片,40,"2019-01-18 03:01:20","我们是真正的手工艺人 我们用雕刻的方式开展我们的工作 首先，我们要根据你的形象、气质、特质、品味、经历、职业、等等制定扬长避短的形象设计 纯善化妆造型超值服务体验，专业婚礼跟妆，呈现最美的你～",纯善化妆造型,房山区长政南路双子座2号楼1104（长阳地铁站）,98,0,4.7,12,39.763396,116.214281,东城区,燕山,2010年,可刷卡,"周一至周日 09:30-17:30",17701093206,,,
126,"2019-01-22 22:43:45",image/jpeg,e0b6c5bb8e54a0f3127ba6692dd3507cd58ab7e9,284831,/e0/b6/c5/bb/e0b6c5bb8e54a0f3127ba6692dd3507cd58ab7e9.jpg,,https://songer.datasn.com/data/api/v1/u_e49e7f0fcb85c5451b03/china_wedding_service_1/by_table/service_image_access/e0/b6/c5/bb/e0b6c5bb8e54a0f3127ba6692dd3507cd58ab7e9.jpg,146,"2019-01-17 05:54:29",纯善化妆造型的图片,40,"2019-01-18 03:01:20","我们是真正的手工艺人 我们用雕刻的方式开展我们的工作 首先，我们要根据你的形象、气质、特质、品味、经历、职业、等等制定扬长避短的形象设计 纯善化妆造型超值服务体验，专业婚礼跟妆，呈现最美的你～",纯善化妆造型,房山区长政南路双子座2号楼1104（长阳地铁站）,98,0,4.7,12,39.763396,116.214281,东城区,燕山,2010年,可刷卡,"周一至周日 09:30-17:30",17701093206,,,
127,"2019-01-22 22:44:02",image/jpeg,89dc608a52804aeeb641107ccd7963e770681ceb,169593,/89/dc/60/8a/89dc608a52804aeeb641107ccd7963e770681ceb.jpg,,https://songer.datasn.com/data/api/v1/u_e49e7f0fcb85c5451b03/china_wedding_service_1/by_table/service_image_access/89/dc/60/8a/89dc608a52804aeeb641107ccd7963e770681ceb.jpg,147,"2019-01-17 05:54:36",LIN·新娘彩妆造型·美睫工作室的图片,41,"2019-01-18 03:01:23","Ms.Queen 婚纱彩妆造型一站式会所致力于由内而外打造属于每位女士的专属美丽，为女性消费者提供女王般的服务。你的美丽举世无双！",LIN·新娘彩妆造型·美睫工作室,朝阳区十里河家具大道新农创大厦（近地铁十号线十里河D口）,138,752,5,92,39.861688,116.459364,朝阳区,十里河,2010年,可刷卡,"周一至周日 全天",13716313818,,,
128,"2019-01-22 22:46:35",image/jpeg,2db84e35b40178148538ef57c41d199e91e5279f,366376,/2d/b8/4e/35/2db84e35b40178148538ef57c41d199e91e5279f.jpg,,https://songer.datasn.com/data/api/v1/u_e49e7f0fcb85c5451b03/china_wedding_service_1/by_table/service_image_access/2d/b8/4e/35/2db84e35b40178148538ef57c41d199e91e5279f.jpg,148,"2019-01-17 05:54:36",LIN·新娘彩妆造型·美睫工作室的图片,41,"2019-01-18 03:01:23","Ms.Queen 婚纱彩妆造型一站式会所致力于由内而外打造属于每位女士的专属美丽，为女性消费者提供女王般的服务。你的美丽举世无双！",LIN·新娘彩妆造型·美睫工作室,朝阳区十里河家具大道新农创大厦（近地铁十号线十里河D口）,138,752,5,92,39.861688,116.459364,朝阳区,十里河,2010年,可刷卡,"周一至周日 全天",13716313818,,,
129,"2019-01-22 22:46:43",image/jpeg,17a1fa0d3f7bc5f7e568d8d70e63ebd4a24b33c6,139307,/17/a1/fa/0d/17a1fa0d3f7bc5f7e568d8d70e63ebd4a24b33c6.jpg,,https://songer.datasn.com/data/api/v1/u_e49e7f0fcb85c5451b03/china_wedding_service_1/by_table/service_image_access/17/a1/fa/0d/17a1fa0d3f7bc5f7e568d8d70e63ebd4a24b33c6.jpg,149,"2019-01-17 05:54:36",LIN·新娘彩妆造型·美睫工作室的图片,41,"2019-01-18 03:01:23","Ms.Queen 婚纱彩妆造型一站式会所致力于由内而外打造属于每位女士的专属美丽，为女性消费者提供女王般的服务。你的美丽举世无双！",LIN·新娘彩妆造型·美睫工作室,朝阳区十里河家具大道新农创大厦（近地铁十号线十里河D口）,138,752,5,92,39.861688,116.459364,朝阳区,十里河,2010年,可刷卡,"周一至周日 全天",13716313818,,,
130,"2019-01-22 22:47:00",image/jpeg,9730c647611894d09a4e602de1a81bfeb36d69bd,181857,/97/30/c6/47/9730c647611894d09a4e602de1a81bfeb36d69bd.jpg,,https://songer.datasn.com/data/api/v1/u_e49e7f0fcb85c5451b03/china_wedding_service_1/by_table/service_image_access/97/30/c6/47/9730c647611894d09a4e602de1a81bfeb36d69bd.jpg,150,"2019-01-17 05:54:36",LIN·新娘彩妆造型·美睫工作室的图片,41,"2019-01-18 03:01:23","Ms.Queen 婚纱彩妆造型一站式会所致力于由内而外打造属于每位女士的专属美丽，为女性消费者提供女王般的服务。你的美丽举世无双！",LIN·新娘彩妆造型·美睫工作室,朝阳区十里河家具大道新农创大厦（近地铁十号线十里河D口）,138,752,5,92,39.861688,116.459364,朝阳区,十里河,2010年,可刷卡,"周一至周日 全天",13716313818,,,
131,"2019-01-22 22:49:57",image/jpeg,ef36158343b066d77a62c98aaf29a24b107c9f54,243692,/ef/36/15/83/ef36158343b066d77a62c98aaf29a24b107c9f54.jpg,,https://songer.datasn.com/data/api/v1/u_e49e7f0fcb85c5451b03/china_wedding_service_1/by_table/service_image_access/ef/36/15/83/ef36158343b066d77a62c98aaf29a24b107c9f54.jpg,151,"2019-01-17 05:54:36",LIN·新娘彩妆造型·美睫工作室的图片,41,"2019-01-18 03:01:23","Ms.Queen 婚纱彩妆造型一站式会所致力于由内而外打造属于每位女士的专属美丽，为女性消费者提供女王般的服务。你的美丽举世无双！",LIN·新娘彩妆造型·美睫工作室,朝阳区十里河家具大道新农创大厦（近地铁十号线十里河D口）,138,752,5,92,39.861688,116.459364,朝阳区,十里河,2010年,可刷卡,"周一至周日 全天",13716313818,,,
132,"2019-01-22 22:50:10",image/jpeg,5001da21b8a0abd87c80796bb7e5a1105cf06c33,165232,/50/01/da/21/5001da21b8a0abd87c80796bb7e5a1105cf06c33.jpg,,https://songer.datasn.com/data/api/v1/u_e49e7f0fcb85c5451b03/china_wedding_service_1/by_table/service_image_access/50/01/da/21/5001da21b8a0abd87c80796bb7e5a1105cf06c33.jpg,152,"2019-01-17 05:54:40",薇拉美妆半永久皮肤管理的图片,42,"2019-01-18 03:01:31",薇拉美妆半永久皮肤管理是一家位于北京的彩妆造型商户，商户为五星商户，共有0个产品可供用户挑选；截至当日，此商户共有0条用户点评。商户电话：15011513385,薇拉美妆半永久皮肤管理,昌平区鼓楼西街12-17号（稻香村二楼）,1,1137,4.3,5,40.223985,116.231047,东城区,燕山,,,"周一至周日 09:00-18:00",15011513385,,,
133,"2019-01-22 22:50:17",image/jpeg,30e66a157123b4ab6190f14291b2caf030567d8a,114530,/30/e6/6a/15/30e66a157123b4ab6190f14291b2caf030567d8a.jpg,,https://songer.datasn.com/data/api/v1/u_e49e7f0fcb85c5451b03/china_wedding_service_1/by_table/service_image_access/30/e6/6a/15/30e66a157123b4ab6190f14291b2caf030567d8a.jpg,153,"2019-01-17 05:54:40",薇拉美妆半永久皮肤管理的图片,42,"2019-01-18 03:01:31",薇拉美妆半永久皮肤管理是一家位于北京的彩妆造型商户，商户为五星商户，共有0个产品可供用户挑选；截至当日，此商户共有0条用户点评。商户电话：15011513385,薇拉美妆半永久皮肤管理,昌平区鼓楼西街12-17号（稻香村二楼）,1,1137,4.3,5,40.223985,116.231047,东城区,燕山,,,"周一至周日 09:00-18:00",15011513385,,,
134,"2019-01-22 22:50:24",image/jpeg,e9e1221009f10349c21b689e7c58df614071a075,286256,/e9/e1/22/10/e9e1221009f10349c21b689e7c58df614071a075.jpg,,https://songer.datasn.com/data/api/v1/u_e49e7f0fcb85c5451b03/china_wedding_service_1/by_table/service_image_access/e9/e1/22/10/e9e1221009f10349c21b689e7c58df614071a075.jpg,154,"2019-01-17 05:54:40",薇拉美妆半永久皮肤管理的图片,42,"2019-01-18 03:01:31",薇拉美妆半永久皮肤管理是一家位于北京的彩妆造型商户，商户为五星商户，共有0个产品可供用户挑选；截至当日，此商户共有0条用户点评。商户电话：15011513385,薇拉美妆半永久皮肤管理,昌平区鼓楼西街12-17号（稻香村二楼）,1,1137,4.3,5,40.223985,116.231047,东城区,燕山,,,"周一至周日 09:00-18:00",15011513385,,,
135,"2019-01-22 22:50:30",image/jpeg,90416bd071677ca26b407ed684a736a627f564ea,139970,/90/41/6b/d0/90416bd071677ca26b407ed684a736a627f564ea.jpg,,https://songer.datasn.com/data/api/v1/u_e49e7f0fcb85c5451b03/china_wedding_service_1/by_table/service_image_access/90/41/6b/d0/90416bd071677ca26b407ed684a736a627f564ea.jpg,155,"2019-01-17 05:54:40",薇拉美妆半永久皮肤管理的图片,42,"2019-01-18 03:01:31",薇拉美妆半永久皮肤管理是一家位于北京的彩妆造型商户，商户为五星商户，共有0个产品可供用户挑选；截至当日，此商户共有0条用户点评。商户电话：15011513385,薇拉美妆半永久皮肤管理,昌平区鼓楼西街12-17号（稻香村二楼）,1,1137,4.3,5,40.223985,116.231047,东城区,燕山,,,"周一至周日 09:00-18:00",15011513385,,,
136,"2019-01-22 22:50:43",image/jpeg,cba3bef7327729636378888c1754d5885e4610e2,608850,/cb/a3/be/f7/cba3bef7327729636378888c1754d5885e4610e2.jpg,,https://songer.datasn.com/data/api/v1/u_e49e7f0fcb85c5451b03/china_wedding_service_1/by_table/service_image_access/cb/a3/be/f7/cba3bef7327729636378888c1754d5885e4610e2.jpg,156,"2019-01-17 05:55:57",雨芳MAKEUP的图片,43,"2019-01-18 03:01:37",雨芳MAKEUP(国泰百货昌平店)是一家位于北京的彩妆造型商户，商户为暂无星级，共有0个产品可供用户挑选；截至当日，此商户共有0条用户点评。商户电话：13051139872,雨芳MAKEUP（国泰百货昌平店）,昌平区府学路甲24号国泰百货后门正对面,99,0,0,2,40.220499,116.243585,昌平区,燕山,,,"周一至周日 09:00-19:00",13051139872,,,
137,"2019-01-22 22:51:01",image/jpeg,a7444f5c15a99e3415003b61558f691e51bdefad,542304,/a7/44/4f/5c/a7444f5c15a99e3415003b61558f691e51bdefad.jpg,,https://songer.datasn.com/data/api/v1/u_e49e7f0fcb85c5451b03/china_wedding_service_1/by_table/service_image_access/a7/44/4f/5c/a7444f5c15a99e3415003b61558f691e51bdefad.jpg,157,"2019-01-17 05:55:57",雨芳MAKEUP的图片,43,"2019-01-18 03:01:37",雨芳MAKEUP(国泰百货昌平店)是一家位于北京的彩妆造型商户，商户为暂无星级，共有0个产品可供用户挑选；截至当日，此商户共有0条用户点评。商户电话：13051139872,雨芳MAKEUP（国泰百货昌平店）,昌平区府学路甲24号国泰百货后门正对面,99,0,0,2,40.220499,116.243585,昌平区,燕山,,,"周一至周日 09:00-19:00",13051139872,,,
138,"2019-01-22 22:51:45",image/jpeg,baba16705332906ba740e325f139093f1a4847fb,525942,/ba/ba/16/70/baba16705332906ba740e325f139093f1a4847fb.jpg,,https://songer.datasn.com/data/api/v1/u_e49e7f0fcb85c5451b03/china_wedding_service_1/by_table/service_image_access/ba/ba/16/70/baba16705332906ba740e325f139093f1a4847fb.jpg,158,"2019-01-17 05:55:57",雨芳MAKEUP的图片,43,"2019-01-18 03:01:37",雨芳MAKEUP(国泰百货昌平店)是一家位于北京的彩妆造型商户，商户为暂无星级，共有0个产品可供用户挑选；截至当日，此商户共有0条用户点评。商户电话：13051139872,雨芳MAKEUP（国泰百货昌平店）,昌平区府学路甲24号国泰百货后门正对面,99,0,0,2,40.220499,116.243585,昌平区,燕山,,,"周一至周日 09:00-19:00",13051139872,,,
139,"2019-01-22 22:52:00",image/jpeg,340f599e08beba3e76dd159f3e577d2e1e71e48e,425965,/34/0f/59/9e/340f599e08beba3e76dd159f3e577d2e1e71e48e.jpg,,https://songer.datasn.com/data/api/v1/u_e49e7f0fcb85c5451b03/china_wedding_service_1/by_table/service_image_access/34/0f/59/9e/340f599e08beba3e76dd159f3e577d2e1e71e48e.jpg,159,"2019-01-17 05:55:57",雨芳MAKEUP的图片,43,"2019-01-18 03:01:37",雨芳MAKEUP(国泰百货昌平店)是一家位于北京的彩妆造型商户，商户为暂无星级，共有0个产品可供用户挑选；截至当日，此商户共有0条用户点评。商户电话：13051139872,雨芳MAKEUP（国泰百货昌平店）,昌平区府学路甲24号国泰百货后门正对面,99,0,0,2,40.220499,116.243585,昌平区,燕山,,,"周一至周日 09:00-19:00",13051139872,,,
140,"2019-01-22 22:52:14",image/jpeg,3d24bccc747dc999cdc2f18a9b55a6928493c1e4,259461,/3d/24/bc/cc/3d24bccc747dc999cdc2f18a9b55a6928493c1e4.jpg,,https://songer.datasn.com/data/api/v1/u_e49e7f0fcb85c5451b03/china_wedding_service_1/by_table/service_image_access/3d/24/bc/cc/3d24bccc747dc999cdc2f18a9b55a6928493c1e4.jpg,160,"2019-01-17 05:56:06",美妆派彩妆造型的图片,45,"2019-01-18 03:01:46",美妆派位于北京市国贸建外soho东区，专注婚礼跟妆造型服务，旗下拥有《彩妆造型》《饰品-私人定制》《新娘皮肤管理》《韩式半永久》等全面婚礼服务项目.您的专属魅力，美妆派与您一起发掘。,美妆派彩妆造型,朝阳区建外soho东区2号楼1706（ata三层别墅楼后面）,188,225,4.4,18,39.905695,116.459783,东城区,"洋桥\u002F木樨园",2008年,可刷卡,"周一至周日 10:00-18:30",4001761015,,,
141,"2019-01-22 22:52:59",image/jpeg,7d591a6eea8126d4709551edf527550360c4b22f,280167,/7d/59/1a/6e/7d591a6eea8126d4709551edf527550360c4b22f.jpg,,https://songer.datasn.com/data/api/v1/u_e49e7f0fcb85c5451b03/china_wedding_service_1/by_table/service_image_access/7d/59/1a/6e/7d591a6eea8126d4709551edf527550360c4b22f.jpg,161,"2019-01-17 05:56:06",美妆派彩妆造型的图片,45,"2019-01-18 03:01:46",美妆派位于北京市国贸建外soho东区，专注婚礼跟妆造型服务，旗下拥有《彩妆造型》《饰品-私人定制》《新娘皮肤管理》《韩式半永久》等全面婚礼服务项目.您的专属魅力，美妆派与您一起发掘。,美妆派彩妆造型,朝阳区建外soho东区2号楼1706（ata三层别墅楼后面）,188,225,4.4,18,39.905695,116.459783,东城区,"洋桥\u002F木樨园",2008年,可刷卡,"周一至周日 10:00-18:30",4001761015,,,
142,"2019-01-22 22:53:06",image/jpeg,9033df1011d741c168ff07927fcc60a640f9b60e,222446,/90/33/df/10/9033df1011d741c168ff07927fcc60a640f9b60e.jpg,,https://songer.datasn.com/data/api/v1/u_e49e7f0fcb85c5451b03/china_wedding_service_1/by_table/service_image_access/90/33/df/10/9033df1011d741c168ff07927fcc60a640f9b60e.jpg,162,"2019-01-17 05:56:06",美妆派彩妆造型的图片,45,"2019-01-18 03:01:46",美妆派位于北京市国贸建外soho东区，专注婚礼跟妆造型服务，旗下拥有《彩妆造型》《饰品-私人定制》《新娘皮肤管理》《韩式半永久》等全面婚礼服务项目.您的专属魅力，美妆派与您一起发掘。,美妆派彩妆造型,朝阳区建外soho东区2号楼1706（ata三层别墅楼后面）,188,225,4.4,18,39.905695,116.459783,东城区,"洋桥\u002F木樨园",2008年,可刷卡,"周一至周日 10:00-18:30",4001761015,,,
143,"2019-01-22 22:53:25",image/jpeg,74fac81687e7f5aec7a8ba6706cef316748a84bd,365310,/74/fa/c8/16/74fac81687e7f5aec7a8ba6706cef316748a84bd.jpg,,https://songer.datasn.com/data/api/v1/u_e49e7f0fcb85c5451b03/china_wedding_service_1/by_table/service_image_access/74/fa/c8/16/74fac81687e7f5aec7a8ba6706cef316748a84bd.jpg,163,"2019-01-17 05:56:06",美妆派彩妆造型的图片,45,"2019-01-18 03:01:46",美妆派位于北京市国贸建外soho东区，专注婚礼跟妆造型服务，旗下拥有《彩妆造型》《饰品-私人定制》《新娘皮肤管理》《韩式半永久》等全面婚礼服务项目.您的专属魅力，美妆派与您一起发掘。,美妆派彩妆造型,朝阳区建外soho东区2号楼1706（ata三层别墅楼后面）,188,225,4.4,18,39.905695,116.459783,东城区,"洋桥\u002F木樨园",2008年,可刷卡,"周一至周日 10:00-18:30",4001761015,,,
144,"2019-01-22 22:53:43",image/jpeg,83d4a22f7c7507b700bd66c9e507981cefdbebef,218470,/83/d4/a2/2f/83d4a22f7c7507b700bd66c9e507981cefdbebef.jpg,,https://songer.datasn.com/data/api/v1/u_e49e7f0fcb85c5451b03/china_wedding_service_1/by_table/service_image_access/83/d4/a2/2f/83d4a22f7c7507b700bd66c9e507981cefdbebef.jpg,164,"2019-01-17 05:56:06",美妆派彩妆造型的图片,45,"2019-01-18 03:01:46",美妆派位于北京市国贸建外soho东区，专注婚礼跟妆造型服务，旗下拥有《彩妆造型》《饰品-私人定制》《新娘皮肤管理》《韩式半永久》等全面婚礼服务项目.您的专属魅力，美妆派与您一起发掘。,美妆派彩妆造型,朝阳区建外soho东区2号楼1706（ata三层别墅楼后面）,188,225,4.4,18,39.905695,116.459783,东城区,"洋桥\u002F木樨园",2008年,可刷卡,"周一至周日 10:00-18:30",4001761015,,,