service_product.id,service_product.ts,service_product.title,service_product.price,service_product.original_price,service.id,service.ts,service.description,service.service,service.address,service.lowest_price,service.per_capita_consumption,service.score_overall,service.comment_count,service.latitude,service.longitude,service.area,service.street,service.create_time,service.pay_way,service.open_time,service.telephone,service.feature,service.star,service.count
1,"2019-01-20 20:57:31",孕妇照超值优惠拍摄,￥399,￥899,1,"2019-01-18 02:50:46",岸芷汀兰婚纱摄影是一家位于鞍山的个性写真商户，商户为准四星商户，共有0个产品可供用户挑选；截至当日，此商户共有0条用户点评。商户电话：15509802827,岸芷汀兰婚纱摄影,铁东区万熹城市广场二号楼19层20号（天河大厦对面）,198,0,4.7,25,41.109813,122.989378,铁东区,站前,,,"周一至周日 08:00-22:00",15509802827,,1星,0
2,"2019-01-20 20:57:31",【超高性价比万平影视基地】《VIP尊享一对一服务》,"￥2,688","￥5,988",1,"2019-01-18 02:50:46",岸芷汀兰婚纱摄影是一家位于鞍山的个性写真商户，商户为准四星商户，共有0个产品可供用户挑选；截至当日，此商户共有0条用户点评。商户电话：15509802827,岸芷汀兰婚纱摄影,铁东区万熹城市广场二号楼19层20号（天河大厦对面）,198,0,4.7,25,41.109813,122.989378,铁东区,站前,,,"周一至周日 08:00-22:00",15509802827,,1星,0
3,"2019-01-20 20:57:31",大型海景拍摄基地私家拍摄,"￥3,388","￥5,999",1,"2019-01-18 02:50:46",岸芷汀兰婚纱摄影是一家位于鞍山的个性写真商户，商户为准四星商户，共有0个产品可供用户挑选；截至当日，此商户共有0条用户点评。商户电话：15509802827,岸芷汀兰婚纱摄影,铁东区万熹城市广场二号楼19层20号（天河大厦对面）,198,0,4.7,25,41.109813,122.989378,铁东区,站前,,,"周一至周日 08:00-22:00",15509802827,,1星,0
4,"2019-01-20 20:57:31","★ 特惠 艺术照火爆预定中★",￥198,￥599,1,"2019-01-18 02:50:46",岸芷汀兰婚纱摄影是一家位于鞍山的个性写真商户，商户为准四星商户，共有0个产品可供用户挑选；截至当日，此商户共有0条用户点评。商户电话：15509802827,岸芷汀兰婚纱摄影,铁东区万熹城市广场二号楼19层20号（天河大厦对面）,198,0,4.7,25,41.109813,122.989378,铁东区,站前,,,"周一至周日 08:00-22:00",15509802827,,1星,0
5,"2019-01-20 20:57:31",★全新纪实拍摄火爆预定中★,￥599,"￥1,280",1,"2019-01-18 02:50:46",岸芷汀兰婚纱摄影是一家位于鞍山的个性写真商户，商户为准四星商户，共有0个产品可供用户挑选；截至当日，此商户共有0条用户点评。商户电话：15509802827,岸芷汀兰婚纱摄影,铁东区万熹城市广场二号楼19层20号（天河大厦对面）,198,0,4.7,25,41.109813,122.989378,铁东区,站前,,,"周一至周日 08:00-22:00",15509802827,,1星,0
6,"2019-01-20 20:57:37",红白蓝任选单色证件照,￥69,￥89,2,"2019-01-18 02:50:57",怪兽老板证件照专门店是一家位于鞍山的个性写真商户，商户为准四星商户，共有0个产品可供用户挑选；截至当日，此商户共有0条用户点评。商户电话：4000908621-40467,怪兽老板证件照专门店,铁东区站前新世界午餐时间斜对过美南大厦10楼3号,69,0,5,189,41.112278,122.992555,铁东区,站前,,,"周一至周日 10:00-17:00",4000908621-40467,,,
7,"2019-01-20 20:57:37",登记照,￥109,￥149,2,"2019-01-18 02:50:57",怪兽老板证件照专门店是一家位于鞍山的个性写真商户，商户为准四星商户，共有0个产品可供用户挑选；截至当日，此商户共有0条用户点评。商户电话：4000908621-40467,怪兽老板证件照专门店,铁东区站前新世界午餐时间斜对过美南大厦10楼3号,69,0,5,189,41.112278,122.992555,铁东区,站前,,,"周一至周日 10:00-17:00",4000908621-40467,,,
8,"2019-01-20 20:57:37",登记照片+单人单色证件照,￥149,￥178,2,"2019-01-18 02:50:57",怪兽老板证件照专门店是一家位于鞍山的个性写真商户，商户为准四星商户，共有0个产品可供用户挑选；截至当日，此商户共有0条用户点评。商户电话：4000908621-40467,怪兽老板证件照专门店,铁东区站前新世界午餐时间斜对过美南大厦10楼3号,69,0,5,189,41.112278,122.992555,铁东区,站前,,,"周一至周日 10:00-17:00",4000908621-40467,,,
9,"2019-01-20 20:57:37",情侣花絮照,￥188,￥218,2,"2019-01-18 02:50:57",怪兽老板证件照专门店是一家位于鞍山的个性写真商户，商户为准四星商户，共有0个产品可供用户挑选；截至当日，此商户共有0条用户点评。商户电话：4000908621-40467,怪兽老板证件照专门店,铁东区站前新世界午餐时间斜对过美南大厦10楼3号,69,0,5,189,41.112278,122.992555,铁东区,站前,,,"周一至周日 10:00-17:00",4000908621-40467,,,
10,"2019-01-20 20:57:37",职业形象照,￥99,￥200,2,"2019-01-18 02:50:57",怪兽老板证件照专门店是一家位于鞍山的个性写真商户，商户为准四星商户，共有0个产品可供用户挑选；截至当日，此商户共有0条用户点评。商户电话：4000908621-40467,怪兽老板证件照专门店,铁东区站前新世界午餐时间斜对过美南大厦10楼3号,69,0,5,189,41.112278,122.992555,铁东区,站前,,,"周一至周日 10:00-17:00",4000908621-40467,,,
11,"2019-01-20 20:57:47",感恩节个性写真、公主艺术照、闺蜜照,￥258,￥888,3,"2019-01-18 02:50:59",艾蜜儿婚纱摄影是一家位于鞍山的婚纱摄影商户，商户为四星商户，共有0个产品可供用户挑选；截至当日，此商户共有0条用户点评。商户电话：15566275793,艾蜜儿婚纱摄影,铁东区四隆大厦14层108号（景子街附近）,188,0,5,28,41.111562,122.99438,铁东区,站前,,,"周一至周日 08:00-22:00",15566275793,,,
12,"2019-01-20 20:57:47",❤️国庆VIP全家福❤️、孕妇照、情侣照,￥518,"￥1,521",3,"2019-01-18 02:50:59",艾蜜儿婚纱摄影是一家位于鞍山的婚纱摄影商户，商户为四星商户，共有0个产品可供用户挑选；截至当日，此商户共有0条用户点评。商户电话：15566275793,艾蜜儿婚纱摄影,铁东区四隆大厦14层108号（景子街附近）,188,0,5,28,41.111562,122.99438,铁东区,站前,,,"周一至周日 08:00-22:00",15566275793,,,
13,"2019-01-20 20:57:47",一对一服务高端VIP婚纱摄影,"￥1,314","￥3,999",3,"2019-01-18 02:50:59",艾蜜儿婚纱摄影是一家位于鞍山的婚纱摄影商户，商户为四星商户，共有0个产品可供用户挑选；截至当日，此商户共有0条用户点评。商户电话：15566275793,艾蜜儿婚纱摄影,铁东区四隆大厦14层108号（景子街附近）,188,0,5,28,41.111562,122.99438,铁东区,站前,,,"周一至周日 08:00-22:00",15566275793,,,
14,"2019-01-20 20:57:47",❤️感恩节回馈❤️婚纱摄影开启你的梦幻旅拍,"￥2,369","￥6,999",3,"2019-01-18 02:50:59",艾蜜儿婚纱摄影是一家位于鞍山的婚纱摄影商户，商户为四星商户，共有0个产品可供用户挑选；截至当日，此商户共有0条用户点评。商户电话：15566275793,艾蜜儿婚纱摄影,铁东区四隆大厦14层108号（景子街附近）,188,0,5,28,41.111562,122.99438,铁东区,站前,,,"周一至周日 08:00-22:00",15566275793,,,
15,"2019-01-20 20:57:47",超值海景一对一服务高端VIP,"￥3,399","￥8,999",3,"2019-01-18 02:50:59",艾蜜儿婚纱摄影是一家位于鞍山的婚纱摄影商户，商户为四星商户，共有0个产品可供用户挑选；截至当日，此商户共有0条用户点评。商户电话：15566275793,艾蜜儿婚纱摄影,铁东区四隆大厦14层108号（景子街附近）,188,0,5,28,41.111562,122.99438,铁东区,站前,,,"周一至周日 08:00-22:00",15566275793,,,
16,"2019-01-20 20:57:47",❤️形象照❤️商品代言微商推广,￥188,￥888,3,"2019-01-18 02:50:59",艾蜜儿婚纱摄影是一家位于鞍山的婚纱摄影商户，商户为四星商户，共有0个产品可供用户挑选；截至当日，此商户共有0条用户点评。商户电话：15566275793,艾蜜儿婚纱摄影,铁东区四隆大厦14层108号（景子街附近）,188,0,5,28,41.111562,122.99438,铁东区,站前,,,"周一至周日 08:00-22:00",15566275793,,,
17,"2019-01-20 20:57:56","婚纱海景基地拍摄《底片全送 无二次消费》","￥3,399","￥6,999",4,"2019-01-18 02:51:27","印像摄影 签约省内三大摄影基地 只有您想不到 没有我们做不到 我们提倡自然，真实，简单随意，美丽不是浓妆艳抹.印像摄影一个注重口碑传承的摄影品牌,客户的满意是我们唯一的标准!",印象婚纱摄影,铁东区景子街2楼东座51号（贾氏珠宝）,199,0,4.9,254,41.113146,122.99264,铁东区,站前,2008年,不可刷卡,"周一至周日 09:00-18:00","13204120177 15509802827",底片全送，一对一服务，无隐形消费,,
18,"2019-01-20 20:57:56",艺术写真火爆预定中………,￥199,￥499,4,"2019-01-18 02:51:27","印像摄影 签约省内三大摄影基地 只有您想不到 没有我们做不到 我们提倡自然，真实，简单随意，美丽不是浓妆艳抹.印像摄影一个注重口碑传承的摄影品牌,客户的满意是我们唯一的标准!",印象婚纱摄影,铁东区景子街2楼东座51号（贾氏珠宝）,199,0,4.9,254,41.113146,122.99264,铁东区,站前,2008年,不可刷卡,"周一至周日 09:00-18:00","13204120177 15509802827",底片全送，一对一服务，无隐形消费,,
19,"2019-01-20 20:57:56","底片全送 无二次消费《全程一对一拍摄》","￥1,199","￥2,688",4,"2019-01-18 02:51:27","印像摄影 签约省内三大摄影基地 只有您想不到 没有我们做不到 我们提倡自然，真实，简单随意，美丽不是浓妆艳抹.印像摄影一个注重口碑传承的摄影品牌,客户的满意是我们唯一的标准!",印象婚纱摄影,铁东区景子街2楼东座51号（贾氏珠宝）,199,0,4.9,254,41.113146,122.99264,铁东区,站前,2008年,不可刷卡,"周一至周日 09:00-18:00","13204120177 15509802827",底片全送，一对一服务，无隐形消费,,
20,"2019-01-20 20:57:56",卡地亚法式婚纱照《VIP全程一对一拍摄》,"￥2,699","￥5,999",4,"2019-01-18 02:51:27","印像摄影 签约省内三大摄影基地 只有您想不到 没有我们做不到 我们提倡自然，真实，简单随意，美丽不是浓妆艳抹.印像摄影一个注重口碑传承的摄影品牌,客户的满意是我们唯一的标准!",印象婚纱摄影,铁东区景子街2楼东座51号（贾氏珠宝）,199,0,4.9,254,41.113146,122.99264,铁东区,站前,2008年,不可刷卡,"周一至周日 09:00-18:00","13204120177 15509802827",底片全送，一对一服务，无隐形消费,,
21,"2019-01-20 20:57:56","豪华海景 一对一专人服务 浪漫旅拍 品质之选","￥4,899","￥8,999",4,"2019-01-18 02:51:27","印像摄影 签约省内三大摄影基地 只有您想不到 没有我们做不到 我们提倡自然，真实，简单随意，美丽不是浓妆艳抹.印像摄影一个注重口碑传承的摄影品牌,客户的满意是我们唯一的标准!",印象婚纱摄影,铁东区景子街2楼东座51号（贾氏珠宝）,199,0,4.9,254,41.113146,122.99264,铁东区,站前,2008年,不可刷卡,"周一至周日 09:00-18:00","13204120177 15509802827",底片全送，一对一服务，无隐形消费,,
22,"2019-01-20 20:59:07",内外景通拍底片版权全送婚纱照,"￥3,999","￥8,999",5,"2019-01-18 02:51:47",金夫人集团成立于1989年，是一家跨越14个产业的大型集团公司，是首家外商独资企业，是中国领先的婚纱摄影服务集团。,金夫人婚纱摄影,铁东区东三街54号（近四隆广场）,2018,3739,3,0,41.114255,122.997982,铁东区,站前,1989年,可刷卡,"周一至周日 09:00-18:00",4001761472,不满意重拍，底片全送，无隐形消费,,
23,"2019-01-20 20:59:07",婚纱照6服6造礼服通选无加价,"￥2,018","￥4,999",5,"2019-01-18 02:51:47",金夫人集团成立于1989年，是一家跨越14个产业的大型集团公司，是首家外商独资企业，是中国领先的婚纱摄影服务集团。,金夫人婚纱摄影,铁东区东三街54号（近四隆广场）,2018,3739,3,0,41.114255,122.997982,铁东区,站前,1989年,可刷卡,"周一至周日 09:00-18:00",4001761472,不满意重拍，底片全送，无隐形消费,,
24,"2019-01-20 20:59:07",场馆服装通选加赠婚嫁礼详询客服,"￥4,999","￥8,999",5,"2019-01-18 02:51:47",金夫人集团成立于1989年，是一家跨越14个产业的大型集团公司，是首家外商独资企业，是中国领先的婚纱摄影服务集团。,金夫人婚纱摄影,铁东区东三街54号（近四隆广场）,2018,3739,3,0,41.114255,122.997982,铁东区,站前,1989年,可刷卡,"周一至周日 09:00-18:00",4001761472,不满意重拍，底片全送，无隐形消费,,
25,"2019-01-20 20:59:07","三亚\/丽江特价4999旅拍婚照","￥4,999","￥9,999",5,"2019-01-18 02:51:47",金夫人集团成立于1989年，是一家跨越14个产业的大型集团公司，是首家外商独资企业，是中国领先的婚纱摄影服务集团。,金夫人婚纱摄影,铁东区东三街54号（近四隆广场）,2018,3739,3,0,41.114255,122.997982,铁东区,站前,1989年,可刷卡,"周一至周日 09:00-18:00",4001761472,不满意重拍，底片全送，无隐形消费,,
26,"2019-01-20 21:01:29",一克拉裸钻定制钻石戒指,"￥49,999","￥89,999",23,"2019-01-18 02:56:42","北京经营数年钻石批发零售 现主营GIA裸钻现货批发零售 国检成品 自设工厂设计定制",极光钻石婚戒定制中心,大兴区兴华大街兴雅珠宝城1层A056金致美珠宝,10,0,4,0,39.731326,116.332065,平谷区,十里河,2010年,可刷卡,"周一至周日 09:30-18:30",4000908610-232310,,,
27,"2019-01-20 21:01:52",24K黄金3D手链,￥399,"￥1,299",24,"2019-01-18 02:56:52","UP LOVE品钻是一家位于北京的裸钻定制商户，商户为五星商户，共有16个产品可供用户挑选；截至当日，此商户共有0条用户点评。商户电话：4000908610-235921","UP LOVE品钻",东城区东二环银河SOHO商铺B座20220,399,24526,5,0,39.920938,116.432341,平谷区,十里河,,,"周一至周日 10:00-21:00",4000908610-235921,,,
28,"2019-01-20 21:03:05",进阶款单人戒指体验套餐1次,￥298,￥398,25,"2019-01-18 02:57:06","大爱金工是大爱盛世贸易（北京）有限公司直属品牌。 司2009年成立，是国内金工体验领跑品牌，品牌店遍布上海、北京、深圳、青岛、成都等15个城市共设有36家分店。",大爱金工&戒指DIY（五道口店）,海淀区成府路28号五道口购物中心一层优衣库门口,59,0,4.5,0,39.991939,116.33935,平谷区,十里河,2009年,可刷卡,"周一至周日 08:00-19:00","17710781376 13522799717",,,
29,"2019-01-20 21:03:05",纯银耳钉单人DIY体验（一只）,￥98,￥100,25,"2019-01-18 02:57:06","大爱金工是大爱盛世贸易（北京）有限公司直属品牌。 司2009年成立，是国内金工体验领跑品牌，品牌店遍布上海、北京、深圳、青岛、成都等15个城市共设有36家分店。",大爱金工&戒指DIY（五道口店）,海淀区成府路28号五道口购物中心一层优衣库门口,59,0,4.5,0,39.991939,116.33935,平谷区,十里河,2009年,可刷卡,"周一至周日 08:00-19:00","17710781376 13522799717",,,
30,"2019-01-20 21:03:05",铂金18k金戒指DIY,￥499,￥499.8,25,"2019-01-18 02:57:06","大爱金工是大爱盛世贸易（北京）有限公司直属品牌。 司2009年成立，是国内金工体验领跑品牌，品牌店遍布上海、北京、深圳、青岛、成都等15个城市共设有36家分店。",大爱金工&戒指DIY（五道口店）,海淀区成府路28号五道口购物中心一层优衣库门口,59,0,4.5,0,39.991939,116.33935,平谷区,十里河,2009年,可刷卡,"周一至周日 08:00-19:00","17710781376 13522799717",,,
31,"2019-01-20 21:03:05",团建多人DIY体验套餐,￥158,￥460,25,"2019-01-18 02:57:06","大爱金工是大爱盛世贸易（北京）有限公司直属品牌。 司2009年成立，是国内金工体验领跑品牌，品牌店遍布上海、北京、深圳、青岛、成都等15个城市共设有36家分店。",大爱金工&戒指DIY（五道口店）,海淀区成府路28号五道口购物中心一层优衣库门口,59,0,4.5,0,39.991939,116.33935,平谷区,十里河,2009年,可刷卡,"周一至周日 08:00-19:00","17710781376 13522799717",,,
32,"2019-01-20 21:03:05",纯银单人手镯DIY体验一次,￥396,￥798,25,"2019-01-18 02:57:06","大爱金工是大爱盛世贸易（北京）有限公司直属品牌。 司2009年成立，是国内金工体验领跑品牌，品牌店遍布上海、北京、深圳、青岛、成都等15个城市共设有36家分店。",大爱金工&戒指DIY（五道口店）,海淀区成府路28号五道口购物中心一层优衣库门口,59,0,4.5,0,39.991939,116.33935,平谷区,十里河,2009年,可刷卡,"周一至周日 08:00-19:00","17710781376 13522799717",,,
33,"2019-01-20 21:03:05",专业打耳洞,￥59,￥68,25,"2019-01-18 02:57:06","大爱金工是大爱盛世贸易（北京）有限公司直属品牌。 司2009年成立，是国内金工体验领跑品牌，品牌店遍布上海、北京、深圳、青岛、成都等15个城市共设有36家分店。",大爱金工&戒指DIY（五道口店）,海淀区成府路28号五道口购物中心一层优衣库门口,59,0,4.5,0,39.991939,116.33935,平谷区,十里河,2009年,可刷卡,"周一至周日 08:00-19:00","17710781376 13522799717",,,
34,"2019-01-20 21:03:07",珂兰18k金雪花群镶钻石吊坠,￥999,"￥1,999",26,"2019-01-18 02:57:17",珂兰钻石是国内首批从事电子商务钻石销售的专业珠宝品牌，珂兰钻石从南非采购一手钻石，并通过office直营与网络销售相结合的全新销售模式，省去了高额的入场费和钻石零售环节。蝉联三年双十一钻石类销冠！,珂兰钻石（珠宝高级定制店）,西城区西单北大街131号西单大悦城写字楼8楼（西单商场对面）,1,21266,4.3,2119,39.911383,116.372541,平谷区,十里河,2007年,可刷卡,"周一至周日 10:00-19:30",4000268920-9447,,,
35,"2019-01-20 21:03:11",手链项链无痕微痕修复,￥59,￥108,27,"2019-01-18 02:57:26",群豪珠宝首饰加工是一家位于北京的裸钻定制商户，商户为四星商户，共有1个产品可供用户挑选；截至当日，此商户共有0条用户点评。商户电话：13691220133,群豪珠宝首饰加工,西城区西单北大街西单婚庆大楼四层4030（客梯直梯旁边）（近老佛爷百货西单商场灵境胡同地铁）,59,0,4,0,39.91412,116.373364,平谷区,十里河,,,"周一至周日 10:00-19:00","13691220133 13693121677",,,
36,"2019-01-20 21:03:11",断裂手镯修复维修嵌金丝镶玉加工,￥888,"￥3,000",27,"2019-01-18 02:57:26",群豪珠宝首饰加工是一家位于北京的裸钻定制商户，商户为四星商户，共有1个产品可供用户挑选；截至当日，此商户共有0条用户点评。商户电话：13691220133,群豪珠宝首饰加工,西城区西单北大街西单婚庆大楼四层4030（客梯直梯旁边）（近老佛爷百货西单商场灵境胡同地铁）,59,0,4,0,39.91412,116.373364,平谷区,十里河,,,"周一至周日 10:00-19:00","13691220133 13693121677",,,
37,"2019-01-20 21:03:11",GIA钻石婚戒克拉钻戒戒托定制,"￥45,999","￥56,999",27,"2019-01-18 02:57:26",群豪珠宝首饰加工是一家位于北京的裸钻定制商户，商户为四星商户，共有1个产品可供用户挑选；截至当日，此商户共有0条用户点评。商户电话：13691220133,群豪珠宝首饰加工,西城区西单北大街西单婚庆大楼四层4030（客梯直梯旁边）（近老佛爷百货西单商场灵境胡同地铁）,59,0,4,0,39.91412,116.373364,平谷区,十里河,,,"周一至周日 10:00-19:00","13691220133 13693121677",,,
38,"2019-01-20 21:03:30",18K金钻石耳钉三色可选,￥666,"￥1,500",28,"2019-01-18 02:57:41","大诚钻石专注婚戒定制18年，以实在的价格、优质完善的售前及售后服务，获得众多顾客的口碑宣传，赢得了上万对新人的信赖。 官方网站：m.1314dc.com 官方微信：DCZS1314",大诚钻石（建外SOHO旗舰店）,朝阳区东三环中路39号建外SOHO西区17号楼2708室（近永安里地铁站C口）,100,13116,5,1,39.906292,116.452907,平谷区,十里河,1999年,可刷卡,"周一至周日 10:00-19:00","58696538 13811673765",,,
39,"2019-01-20 21:03:50",奔驰S系+奥迪啊A6L,"￥3,000","￥3,500",30,"2019-01-18 02:58:03",囍缘Club婚庆用车是一家位于北京的婚车租赁商户，商户为五星商户，共有2个产品可供用户挑选；截至当日，此商户共有0条用户点评。商户电话：13811714705,囍缘Club婚庆用车,昌平区立汤路龙德紫金,3000,5969,5,0,40.062127,116.414754,大兴区,白龙潭,,,"周一至周日 08:30-23:30",13811714705,,,
40,"2019-01-20 21:04:02",宝马330+宝马3系5辆,"￥3,050","￥3,200",31,"2019-01-18 02:58:12",公司技术力量雄厚，经营租赁车辆种类齐全，具有劳斯莱斯、宾利、林肯、奔驰S系列、宝马、别克商务仓GL8、奥迪A6L、本田、帕萨特、福特全顺、金龙大巴、宇通55座大巴、各种跑车等等一系列豪华车辆。,国宾婚庆用车,西城区广安门外大街305号（靠近达官营地铁）,3050,5081,4.5,0,39.894481,116.339295,大兴区,白龙潭,2008年,不可刷卡,"周一至周日 07:00-23:00","13801326655 13301306655",,,
41,"2019-01-20 21:04:02",劳斯莱斯幻影+5辆新款奔驰S,"￥8,088","￥9,500",31,"2019-01-18 02:58:12",公司技术力量雄厚，经营租赁车辆种类齐全，具有劳斯莱斯、宾利、林肯、奔驰S系列、宝马、别克商务仓GL8、奥迪A6L、本田、帕萨特、福特全顺、金龙大巴、宇通55座大巴、各种跑车等等一系列豪华车辆。,国宾婚庆用车,西城区广安门外大街305号（靠近达官营地铁）,3050,5081,4.5,0,39.894481,116.339295,大兴区,白龙潭,2008年,不可刷卡,"周一至周日 07:00-23:00","13801326655 13301306655",,,
42,"2019-01-20 21:04:10",奔驰S600+奥迪A6婚车套餐,"￥2,600","￥4,650",32,"2019-01-18 02:58:24",北京婚车俱乐部是隶属于北京首企之选汽车租赁有限公司旗下的婚车品牌，是北京市少有的正规注册婚车公司，公司每年服务上千对新人，为新人提供多种车型、多种颜色的选择，真正做到了为您的婚礼保驾护航。,北京婚车俱乐部,通州区北苑南路38号院雅丽世居底商,2600,15665,4.5,0,39.89506,116.644547,大兴区,白龙潭,2012年,可刷卡,"周一至周日 08:00-23:30","13911314111 18518923262",,,
43,"2019-01-20 21:04:21",豪华奢侈劳斯莱斯幻影+5奥迪,"￥8,000","￥15,000",33,"2019-01-18 02:58:29",北京耀莱租车主要为公司提供汽车租赁服务。公司现有劳斯莱斯、宾利、奔驰、奥迪、天籁、广本、丰田、帕萨特等轿车及奔驰、丰田海狮、别克等商务车，车新价优，市内免费送车。,耀莱婚车租赁,丰台区长辛店杜家坎6号,1,0,0,0,39.840518,116.204498,大兴区,白龙潭,2012年,可刷卡,"周一至周日 09:00-22:00","13910813250 13910985499",,,
44,"2019-01-20 21:04:21",奔驰S1辆+5辆奥迪A6L,"￥2,800","￥4,300",33,"2019-01-18 02:58:29",北京耀莱租车主要为公司提供汽车租赁服务。公司现有劳斯莱斯、宾利、奔驰、奥迪、天籁、广本、丰田、帕萨特等轿车及奔驰、丰田海狮、别克等商务车，车新价优，市内免费送车。,耀莱婚车租赁,丰台区长辛店杜家坎6号,1,0,0,0,39.840518,116.204498,大兴区,白龙潭,2012年,可刷卡,"周一至周日 09:00-22:00","13910813250 13910985499",,,
45,"2019-01-20 21:04:28","奔弛S级+奥迪A6L 5辆","￥2,700","￥3,500",34,"2019-01-18 02:58:43","花嫁甜心婚庆用车，诚信为本，给您最专业最好的服务。 选择我们绝对让新人用着舒心，家人放心。",花嫁甜心婚庆用车,东城区和平西桥,1,5767,5,1,39.959094,116.421225,大兴区,白龙潭,2008年,不可刷卡,"周一至周日 全天",4000908610-220927,,,
46,"2019-01-20 21:04:28",婚车花+手捧花小套餐,￥566,￥798,34,"2019-01-18 02:58:43","花嫁甜心婚庆用车，诚信为本，给您最专业最好的服务。 选择我们绝对让新人用着舒心，家人放心。",花嫁甜心婚庆用车,东城区和平西桥,1,5767,5,1,39.959094,116.421225,大兴区,白龙潭,2008年,不可刷卡,"周一至周日 全天",4000908610-220927,,,
47,"2019-01-20 21:04:30",电镀红玛莎1辆+奥迪5辆套餐,"￥3,800","￥6,300",35,"2019-01-18 02:59:53",鹊桥相会在七号，天作之合在北京京诚club，北京京诚club是品味与生活，时尚与节俭的兼顾者。,京诚婚庆用车,西城区感化胡同3号（长椿街地铁站c口）,1,13145,5,0,39.894612,116.364784,大兴区,白龙潭,2008年,可刷卡,"周一至周日 05:30-23:30","15611030182 18612828260",,,
48,"2019-01-20 21:04:40",高端精致生活妆+造型服务一次,￥368,￥788,36,"2019-01-18 03:00:03","李晓哲彩妆造型工作室 为每一位客户找到属于您自身的魅力妆容，打造星级技术和优质服务 化妆造型经验丰富 拥有数名业内资深彩妆造型师 是专业新娘化妆，化妆培训，商业广告团体演出化妆造型为一体性价比高的一家",李晓哲彩妆造型工作室（五道口店）,海淀区王庄路33-2号6层601室（清华同方科技广场对面）,218,461,4,5,39.999746,116.340318,东城区,燕山,2010年,不可刷卡,"周一至周日 10:30-19:00",18510341108,,,
49,"2019-01-20 21:04:40",单人主持人妆／婚礼早妆／宴请妆,￥698,"￥1,280",36,"2019-01-18 03:00:03","李晓哲彩妆造型工作室 为每一位客户找到属于您自身的魅力妆容，打造星级技术和优质服务 化妆造型经验丰富 拥有数名业内资深彩妆造型师 是专业新娘化妆，化妆培训，商业广告团体演出化妆造型为一体性价比高的一家",李晓哲彩妆造型工作室（五道口店）,海淀区王庄路33-2号6层601室（清华同方科技广场对面）,218,461,4,5,39.999746,116.340318,东城区,燕山,2010年,不可刷卡,"周一至周日 10:30-19:00",18510341108,,,
50,"2019-01-20 21:04:40","首席造型师新娘婚礼跟妆一次 赠送妈妈妆（伴娘妆）","￥1,314","￥4,180",36,"2019-01-18 03:00:03","李晓哲彩妆造型工作室 为每一位客户找到属于您自身的魅力妆容，打造星级技术和优质服务 化妆造型经验丰富 拥有数名业内资深彩妆造型师 是专业新娘化妆，化妆培训，商业广告团体演出化妆造型为一体性价比高的一家",李晓哲彩妆造型工作室（五道口店）,海淀区王庄路33-2号6层601室（清华同方科技广场对面）,218,461,4,5,39.999746,116.340318,东城区,燕山,2010年,不可刷卡,"周一至周日 10:30-19:00",18510341108,,,
51,"2019-01-20 21:04:40",资深化妆造型师全程新娘跟妆服务,"￥2,280","￥4,880",36,"2019-01-18 03:00:03","李晓哲彩妆造型工作室 为每一位客户找到属于您自身的魅力妆容，打造星级技术和优质服务 化妆造型经验丰富 拥有数名业内资深彩妆造型师 是专业新娘化妆，化妆培训，商业广告团体演出化妆造型为一体性价比高的一家",李晓哲彩妆造型工作室（五道口店）,海淀区王庄路33-2号6层601室（清华同方科技广场对面）,218,461,4,5,39.999746,116.340318,东城区,燕山,2010年,不可刷卡,"周一至周日 10:30-19:00",18510341108,,,
52,"2019-01-20 21:04:46","约会妆\/面试妆（含发型）",￥100,￥168,37,"2019-01-18 03:00:58",轩丫修眉化妆造型(金码大厦店)是一家位于北京的彩妆造型商户，商户为五星商户，共有5个产品可供用户挑选；截至当日，此商户共有0条用户点评。商户电话：13381177706,轩丫修眉化妆造型（金码大厦店）,海淀区学院路和清华东路交汇处金码大厦3层,20,60,4.9,23,40.001819,116.353838,海淀区,五道口,,,"周一,周三至周日 10:00-19:00",13381177706,,,
53,"2019-01-20 21:04:46","晚宴妆\/主持人妆\/年会妆含发型",￥158,￥238,37,"2019-01-18 03:00:58",轩丫修眉化妆造型(金码大厦店)是一家位于北京的彩妆造型商户，商户为五星商户，共有5个产品可供用户挑选；截至当日，此商户共有0条用户点评。商户电话：13381177706,轩丫修眉化妆造型（金码大厦店）,海淀区学院路和清华东路交汇处金码大厦3层,20,60,4.9,23,40.001819,116.353838,海淀区,五道口,,,"周一,周三至周日 10:00-19:00",13381177706,,,
54,"2019-01-20 21:04:46",一对一日常妆教学（两课时）,￥300,￥580,37,"2019-01-18 03:00:58",轩丫修眉化妆造型(金码大厦店)是一家位于北京的彩妆造型商户，商户为五星商户，共有5个产品可供用户挑选；截至当日，此商户共有0条用户点评。商户电话：13381177706,轩丫修眉化妆造型（金码大厦店）,海淀区学院路和清华东路交汇处金码大厦3层,20,60,4.9,23,40.001819,116.353838,海淀区,五道口,,,"周一,周三至周日 10:00-19:00",13381177706,,,
55,"2019-01-20 21:04:46",精细修眉,￥20,￥38,37,"2019-01-18 03:00:58",轩丫修眉化妆造型(金码大厦店)是一家位于北京的彩妆造型商户，商户为五星商户，共有5个产品可供用户挑选；截至当日，此商户共有0条用户点评。商户电话：13381177706,轩丫修眉化妆造型（金码大厦店）,海淀区学院路和清华东路交汇处金码大厦3层,20,60,4.9,23,40.001819,116.353838,海淀区,五道口,,,"周一,周三至周日 10:00-19:00",13381177706,,,
56,"2019-01-20 21:04:46",半永久纹眉,"￥1,580","￥3,800",37,"2019-01-18 03:00:58",轩丫修眉化妆造型(金码大厦店)是一家位于北京的彩妆造型商户，商户为五星商户，共有5个产品可供用户挑选；截至当日，此商户共有0条用户点评。商户电话：13381177706,轩丫修眉化妆造型（金码大厦店）,海淀区学院路和清华东路交汇处金码大厦3层,20,60,4.9,23,40.001819,116.353838,海淀区,五道口,,,"周一,周三至周日 10:00-19:00",13381177706,,,
57,"2019-01-20 21:06:03","简约生活妆\/年会妆",￥199,￥399,39,"2019-01-18 03:01:10",米兰彩妆工作室是一家位于北京的彩妆造型商户，商户为暂无星级，共有1个产品可供用户挑选；截至当日，此商户共有0条用户点评。商户电话：17610592599,米兰彩妆工作室,海淀区成府路华清嘉园1号楼9号3门,199,0,0,0,39.992279,116.336687,海淀区,五道口,,,"周一至周日 09:30-21:30",17610592599,,,
58,"2019-01-20 21:06:03",年会活动上门化妆舞台妆主持人妆,￥599,"￥1,000",39,"2019-01-18 03:01:10",米兰彩妆工作室是一家位于北京的彩妆造型商户，商户为暂无星级，共有1个产品可供用户挑选；截至当日，此商户共有0条用户点评。商户电话：17610592599,米兰彩妆工作室,海淀区成府路华清嘉园1号楼9号3门,199,0,0,0,39.992279,116.336687,海淀区,五道口,,,"周一至周日 09:30-21:30",17610592599,,,
59,"2019-01-20 21:06:09",明星同款生活妆,￥98,￥298,40,"2019-01-18 03:01:20","我们是真正的手工艺人 我们用雕刻的方式开展我们的工作 首先，我们要根据你的形象、气质、特质、品味、经历、职业、等等制定扬长避短的形象设计 纯善化妆造型超值服务体验，专业婚礼跟妆，呈现最美的你～",纯善化妆造型,房山区长政南路双子座2号楼1104（长阳地铁站）,98,0,4.7,12,39.763396,116.214281,东城区,燕山,2010年,可刷卡,"周一至周日 09:30-17:30",17701093206,,,
60,"2019-01-20 21:06:09","生活妆\/约会妆\/年会妆（上门）",￥298,￥988,40,"2019-01-18 03:01:20","我们是真正的手工艺人 我们用雕刻的方式开展我们的工作 首先，我们要根据你的形象、气质、特质、品味、经历、职业、等等制定扬长避短的形象设计 纯善化妆造型超值服务体验，专业婚礼跟妆，呈现最美的你～",纯善化妆造型,房山区长政南路双子座2号楼1104（长阳地铁站）,98,0,4.7,12,39.763396,116.214281,东城区,燕山,2010年,可刷卡,"周一至周日 09:30-17:30",17701093206,,,
61,"2019-01-20 21:06:09","白领自化课程\/化妆培训\/化妆教学","￥1,580","￥3,280",40,"2019-01-18 03:01:20","我们是真正的手工艺人 我们用雕刻的方式开展我们的工作 首先，我们要根据你的形象、气质、特质、品味、经历、职业、等等制定扬长避短的形象设计 纯善化妆造型超值服务体验，专业婚礼跟妆，呈现最美的你～",纯善化妆造型,房山区长政南路双子座2号楼1104（长阳地铁站）,98,0,4.7,12,39.763396,116.214281,东城区,燕山,2010年,可刷卡,"周一至周日 09:30-17:30",17701093206,,,
62,"2019-01-20 21:06:09",唯美新娘跟妆造型（首席化妆师）,"￥1,580","￥3,880",40,"2019-01-18 03:01:20","我们是真正的手工艺人 我们用雕刻的方式开展我们的工作 首先，我们要根据你的形象、气质、特质、品味、经历、职业、等等制定扬长避短的形象设计 纯善化妆造型超值服务体验，专业婚礼跟妆，呈现最美的你～",纯善化妆造型,房山区长政南路双子座2号楼1104（长阳地铁站）,98,0,4.7,12,39.763396,116.214281,东城区,燕山,2010年,可刷卡,"周一至周日 09:30-17:30",17701093206,,,
63,"2019-01-20 21:06:09",摄影师+摄像师+化妆师跟拍跟妆（总监级）,"￥6,880","￥9,980",40,"2019-01-18 03:01:20","我们是真正的手工艺人 我们用雕刻的方式开展我们的工作 首先，我们要根据你的形象、气质、特质、品味、经历、职业、等等制定扬长避短的形象设计 纯善化妆造型超值服务体验，专业婚礼跟妆，呈现最美的你～",纯善化妆造型,房山区长政南路双子座2号楼1104（长阳地铁站）,98,0,4.7,12,39.763396,116.214281,东城区,燕山,2010年,可刷卡,"周一至周日 09:30-17:30",17701093206,,,
64,"2019-01-20 21:06:16",到店超值面试妆、约会妆、生活妆、美妆造型一次,￥168,￥398,41,"2019-01-18 03:01:23","Ms.Queen 婚纱彩妆造型一站式会所致力于由内而外打造属于每位女士的专属美丽，为女性消费者提供女王般的服务。你的美丽举世无双！",LIN·新娘彩妆造型·美睫工作室,朝阳区十里河家具大道新农创大厦（近地铁十号线十里河D口）,138,752,5,92,39.861688,116.459364,朝阳区,十里河,2010年,可刷卡,"周一至周日 全天",13716313818,,,
65,"2019-01-20 21:06:16","上门服务 生活妆 面试妆 约会妆",￥298,￥568,41,"2019-01-18 03:01:23","Ms.Queen 婚纱彩妆造型一站式会所致力于由内而外打造属于每位女士的专属美丽，为女性消费者提供女王般的服务。你的美丽举世无双！",LIN·新娘彩妆造型·美睫工作室,朝阳区十里河家具大道新农创大厦（近地铁十号线十里河D口）,138,752,5,92,39.861688,116.459364,朝阳区,十里河,2010年,可刷卡,"周一至周日 全天",13716313818,,,
66,"2019-01-20 21:06:16",新娘早妆到店,￥520,"￥1,160",41,"2019-01-18 03:01:23","Ms.Queen 婚纱彩妆造型一站式会所致力于由内而外打造属于每位女士的专属美丽，为女性消费者提供女王般的服务。你的美丽举世无双！",LIN·新娘彩妆造型·美睫工作室,朝阳区十里河家具大道新农创大厦（近地铁十号线十里河D口）,138,752,5,92,39.861688,116.459364,朝阳区,十里河,2010年,可刷卡,"周一至周日 全天",13716313818,,,
67,"2019-01-20 21:06:16",新娘妆-资深化妆师全程跟妆,"￥1,299","￥1,680",41,"2019-01-18 03:01:23","Ms.Queen 婚纱彩妆造型一站式会所致力于由内而外打造属于每位女士的专属美丽，为女性消费者提供女王般的服务。你的美丽举世无双！",LIN·新娘彩妆造型·美睫工作室,朝阳区十里河家具大道新农创大厦（近地铁十号线十里河D口）,138,752,5,92,39.861688,116.459364,朝阳区,十里河,2010年,可刷卡,"周一至周日 全天",13716313818,,,
68,"2019-01-20 21:06:16",蚕丝蛋白睫毛嫁接自然款,￥138,￥278,41,"2019-01-18 03:01:23","Ms.Queen 婚纱彩妆造型一站式会所致力于由内而外打造属于每位女士的专属美丽，为女性消费者提供女王般的服务。你的美丽举世无双！",LIN·新娘彩妆造型·美睫工作室,朝阳区十里河家具大道新农创大厦（近地铁十号线十里河D口）,138,752,5,92,39.861688,116.459364,朝阳区,十里河,2010年,可刷卡,"周一至周日 全天",13716313818,,,
69,"2019-01-20 21:06:26",高级形象顾问私人定制设计修眉,￥1,￥9.9,42,"2019-01-18 03:01:31",薇拉美妆半永久皮肤管理是一家位于北京的彩妆造型商户，商户为五星商户，共有0个产品可供用户挑选；截至当日，此商户共有0条用户点评。商户电话：15011513385,薇拉美妆半永久皮肤管理,昌平区鼓楼西街12-17号（稻香村二楼）,1,1137,4.3,5,40.223985,116.231047,东城区,燕山,,,"周一至周日 09:00-18:00",15011513385,,,
70,"2019-01-20 21:06:26","新娘早妆 舞台演出妆 晚宴妆",￥198,￥280,42,"2019-01-18 03:01:31",薇拉美妆半永久皮肤管理是一家位于北京的彩妆造型商户，商户为五星商户，共有0个产品可供用户挑选；截至当日，此商户共有0条用户点评。商户电话：15011513385,薇拉美妆半永久皮肤管理,昌平区鼓楼西街12-17号（稻香村二楼）,1,1137,4.3,5,40.223985,116.231047,东城区,燕山,,,"周一至周日 09:00-18:00",15011513385,,,
71,"2019-01-20 21:06:26",【美甲】单人手部纯色美甲,￥29.8,￥128,42,"2019-01-18 03:01:31",薇拉美妆半永久皮肤管理是一家位于北京的彩妆造型商户，商户为五星商户，共有0个产品可供用户挑选；截至当日，此商户共有0条用户点评。商户电话：15011513385,薇拉美妆半永久皮肤管理,昌平区鼓楼西街12-17号（稻香村二楼）,1,1137,4.3,5,40.223985,116.231047,东城区,燕山,,,"周一至周日 09:00-18:00",15011513385,,,
72,"2019-01-20 21:06:26",新娘跟妆,"￥1,280","￥2,180",42,"2019-01-18 03:01:31",薇拉美妆半永久皮肤管理是一家位于北京的彩妆造型商户，商户为五星商户，共有0个产品可供用户挑选；截至当日，此商户共有0条用户点评。商户电话：15011513385,薇拉美妆半永久皮肤管理,昌平区鼓楼西街12-17号（稻香村二楼）,1,1137,4.3,5,40.223985,116.231047,东城区,燕山,,,"周一至周日 09:00-18:00",15011513385,,,
73,"2019-01-20 21:06:35",到店年会化妆生活妆约会妆面试妆,￥99,￥199,43,"2019-01-18 03:01:37",雨芳MAKEUP(国泰百货昌平店)是一家位于北京的彩妆造型商户，商户为暂无星级，共有0个产品可供用户挑选；截至当日，此商户共有0条用户点评。商户电话：13051139872,雨芳MAKEUP（国泰百货昌平店）,昌平区府学路甲24号国泰百货后门正对面,99,0,0,2,40.220499,116.243585,昌平区,燕山,,,"周一至周日 09:00-19:00",13051139872,,,
74,"2019-01-20 21:06:35",可上门高端精致化妆造型服务一次,￥399,￥799,43,"2019-01-18 03:01:37",雨芳MAKEUP(国泰百货昌平店)是一家位于北京的彩妆造型商户，商户为暂无星级，共有0个产品可供用户挑选；截至当日，此商户共有0条用户点评。商户电话：13051139872,雨芳MAKEUP（国泰百货昌平店）,昌平区府学路甲24号国泰百货后门正对面,99,0,0,2,40.220499,116.243585,昌平区,燕山,,,"周一至周日 09:00-19:00",13051139872,,,
75,"2019-01-20 21:06:35",新娘到店早妆回门宴妆,￥499,￥899,43,"2019-01-18 03:01:37",雨芳MAKEUP(国泰百货昌平店)是一家位于北京的彩妆造型商户，商户为暂无星级，共有0个产品可供用户挑选；截至当日，此商户共有0条用户点评。商户电话：13051139872,雨芳MAKEUP（国泰百货昌平店）,昌平区府学路甲24号国泰百货后门正对面,99,0,0,2,40.220499,116.243585,昌平区,燕山,,,"周一至周日 09:00-19:00",13051139872,,,
76,"2019-01-20 21:06:35",精美新娘跟妆新娘婚礼化妆造型,"￥1,314","￥3,588",43,"2019-01-18 03:01:37",雨芳MAKEUP(国泰百货昌平店)是一家位于北京的彩妆造型商户，商户为暂无星级，共有0个产品可供用户挑选；截至当日，此商户共有0条用户点评。商户电话：13051139872,雨芳MAKEUP（国泰百货昌平店）,昌平区府学路甲24号国泰百货后门正对面,99,0,0,2,40.220499,116.243585,昌平区,燕山,,,"周一至周日 09:00-19:00",13051139872,,,
77,"2019-01-20 21:06:45",约会妆、生活妆、面试妆、宴会妆、学生妆、闺蜜妆、,￥188,￥488,45,"2019-01-18 03:01:46",美妆派位于北京市国贸建外soho东区，专注婚礼跟妆造型服务，旗下拥有《彩妆造型》《饰品-私人定制》《新娘皮肤管理》《韩式半永久》等全面婚礼服务项目.您的专属魅力，美妆派与您一起发掘。,美妆派彩妆造型,朝阳区建外soho东区2号楼1706（ata三层别墅楼后面）,188,225,4.4,18,39.905695,116.459783,东城区,"洋桥\u002F木樨园",2008年,可刷卡,"周一至周日 10:00-18:30",4001761015,,,
78,"2019-01-20 21:06:45",舞台妆、主持妆、拍摄妆、晚宴妆,￥388,￥688,45,"2019-01-18 03:01:46",美妆派位于北京市国贸建外soho东区，专注婚礼跟妆造型服务，旗下拥有《彩妆造型》《饰品-私人定制》《新娘皮肤管理》《韩式半永久》等全面婚礼服务项目.您的专属魅力，美妆派与您一起发掘。,美妆派彩妆造型,朝阳区建外soho东区2号楼1706（ata三层别墅楼后面）,188,225,4.4,18,39.905695,116.459783,东城区,"洋桥\u002F木樨园",2008年,可刷卡,"周一至周日 10:00-18:30",4001761015,,,
79,"2019-01-20 21:06:45",【上门化妆】精致妆容,￥488,￥880,45,"2019-01-18 03:01:46",美妆派位于北京市国贸建外soho东区，专注婚礼跟妆造型服务，旗下拥有《彩妆造型》《饰品-私人定制》《新娘皮肤管理》《韩式半永久》等全面婚礼服务项目.您的专属魅力，美妆派与您一起发掘。,美妆派彩妆造型,朝阳区建外soho东区2号楼1706（ata三层别墅楼后面）,188,225,4.4,18,39.905695,116.459783,东城区,"洋桥\u002F木樨园",2008年,可刷卡,"周一至周日 10:00-18:30",4001761015,,,
80,"2019-01-20 21:06:45",一对一化妆课程,￥398,"￥1,260",45,"2019-01-18 03:01:46",美妆派位于北京市国贸建外soho东区，专注婚礼跟妆造型服务，旗下拥有《彩妆造型》《饰品-私人定制》《新娘皮肤管理》《韩式半永久》等全面婚礼服务项目.您的专属魅力，美妆派与您一起发掘。,美妆派彩妆造型,朝阳区建外soho东区2号楼1706（ata三层别墅楼后面）,188,225,4.4,18,39.905695,116.459783,东城区,"洋桥\u002F木樨园",2008年,可刷卡,"周一至周日 10:00-18:30",4001761015,,,
81,"2019-01-20 21:06:45",新娘早妆&上门化妆,￥880,"￥1,280",45,"2019-01-18 03:01:46",美妆派位于北京市国贸建外soho东区，专注婚礼跟妆造型服务，旗下拥有《彩妆造型》《饰品-私人定制》《新娘皮肤管理》《韩式半永久》等全面婚礼服务项目.您的专属魅力，美妆派与您一起发掘。,美妆派彩妆造型,朝阳区建外soho东区2号楼1706（ata三层别墅楼后面）,188,225,4.4,18,39.905695,116.459783,东城区,"洋桥\u002F木樨园",2008年,可刷卡,"周一至周日 10:00-18:30",4001761015,,,
82,"2019-01-20 21:06:54",生活妆-约会妆-面试妆,￥300,￥648,46,"2019-01-18 03:01:56",况利彩妆造型工作室，是由顶级时尚造型师况利领导的庞大精英技术团队。自成立以来，得到了广大顾客的肯定，一路走来我们一直致力于为新人塑造完美形象，努力为大家提供专业高品质的彩妆服务。,KUANGLI彩妆造型（国贸店）,朝阳区景恒街国贸建外SOHO东区3号楼602,198,4260,5,0,39.906283,116.459811,东城区,燕山,2008年,可刷卡,"周一至周日 09:30-20:00",53380185,,,